{"text_format":"3","workbook":"xlsx","n_sheets":5,"sheets":["NOMBRE","BM18","BM18A","FILTRO.12","Filtro_"],"not_rendered":{"macros":1,"defined_names":1,"pivot_tables":2},"read":"whole","date_system":"1900"}

{"sheet":"NOMBRE","index":0,"n_rows":42,"n_cols":33,"rows_kept":42,"hidden":true,"merged":[[0,0,0,1],[0,2,0,6],[1,8,1,13],[2,8,2,13],[8,0,8,1],[13,0,13,1],[16,1,18,1]]}
["DATOS DEL ESTABLECIMIENTO",null,"CÓDIGOS"]
["NOMBRE DE COMUNA",{"$nulls":7},{"$f":"IF(OR(NOMBRE!C2=\"\",NOMBRE!D2=\"\",NOMBRE!E2=\"\",NOMBRE!F2=\"\",NOMBRE!G2=\"\"),\"Falta Cód. Com.\",\"\")","v":"Falta Cód. Com."},{"$nulls":23},{"$f":"IF(I2>\"\",1,0)","v":1}]
["NOMBRE ESTABLECIMIENTO/ESTRATEGIA",{"$nulls":7},{"$f":"IF(OR(NOMBRE!C3=\"\",NOMBRE!D3=\"\",NOMBRE!E3=\"\",NOMBRE!F3=\"\",NOMBRE!G3=\"\",NOMBRE!H3=\"\"),\"Falta Cód. Est.\",\"\")","v":"Falta Cód. Est."},{"$nulls":23},{"$f":"IF(I3>\"\",1,0)","v":1}]
[]
[]
["MES:",{"$nulls":7},{"$f":"IF(OR(NOMBRE!C6=\"\",NOMBRE!D6=\"\"),\"Falta Cód. Mes.\",\"\")","v":"Falta Cód. Mes."},{"$nulls":23},{"$f":"IF(I6>\"\",1,0)","v":1}]
["AÑO:",2024,{"$nulls":30},{"$f":"SUM(AG2:AG6)","v":3}]
[{"$nulls":6}," "]
["Versión 1.0 FEBRERO 2024"]
[]
["Director/a Servicio de Salud o Director/a Establecimiento",{"$nulls":25},"ENERO","Establecimiento de Mayor Complejidad (EMAYC)","SERVICIO DE SALUD"]
["Jefe/a de Estadísticas",{"$nulls":25},"FEBRERO","Establecimiento de Mediana Complejidad (EMEDC)","MUNICIPAL"]
[{"$nulls":26},"MARZO","Establecimiento de Menor Complejidad (EMENC)","OTRA INSTITUCION (Delegado)"]
["MINSAL - DEIS",{"$nulls":25},"ABRIL","Centros de Diagnóstico Terapeutico (CDT)"]
[{"$nulls":26},"MAYO","Centro de Referencia de Salud (CRS)"]
[{"$nulls":26},"JUNIO","Centro de Salud Familiar"]
[null,"SERIE BM ESTABLECIMIENTOS AREA MUNICIPAL",{"$nulls":24},"JULIO","Consultorio General Urbano (CGU)"]
[{"$nulls":26},"AGOSTO","Consultorio General Urbano (CGU) - CESFAM"]
[{"$nulls":26},"SEPTIEMBRE","Consultorio General Urbano(CGU) con SAPU/SUR/SAR"]
[{"$nulls":26},"OCTUBRE","Consultorio General Urbano (CGU) - CESFAM con SAPU/SAR"]
[{"$nulls":26},"NOVIEMBRE","Consultorio General Rural (CGR)"]
[{"$nulls":26},"DICIEMBRE","Consultorio General Rural (CGR) - CESFAM"]
[{"$nulls":27},"Consultorio General Rural (CGR) con SAPU/SAR/SUR"]
[{"$nulls":27},"Consultorio General Rural (CGR) - CESFAM con SAPU/SAR/SUR"]
[{"$nulls":27},"Posta de Salud Rural (PSR)"]
[{"$nulls":27},"Centro Comunitario de Salud Familiar (CECOF)"]
[{"$nulls":27},"Consultorio de Salud Mental (COSAM)"]
[{"$nulls":27},"Programa de Reparación y Atención Integral de Salud (PRAIS)"]
[{"$nulls":27},"Centro de Atención Funcionarios (CAF)"]
[{"$nulls":27},"Unidad de Salud de Funcionarios (USF)"]
[{"$nulls":27},"ClÍnica Dental Móvil (CDM)"]
[{"$nulls":27},"Dirección Servicio de Salud (DSS)"]
[{"$nulls":27},"Servicio de Atención Primaria de Urgencia (SAPU)"]
[{"$nulls":27},"Servicio de Urgencia Rural (SUR)"]
[{"$nulls":27},"Servicio de Alta Resolución SAR"]
[{"$nulls":27},"Laboratorio Clínico o Dental"]
[{"$nulls":27},"Servicio de Atención Primaria de Urgencia Dental (SAPUDENT)"]
[{"$nulls":27},"Centro de Rehabilitación (CR)"]
[{"$nulls":27},"Hospital de Campaña"]
[{"$nulls":27},"Centro Oncologico"]
[{"$nulls":27},"SAMU"]
[{"$nulls":27},"Centro de salud Urbano (CSU)"]

{"sheet":"BM18","index":1,"n_rows":112,"n_cols":23,"rows_kept":112,"merged":[[7,1,8,6],[9,1,9,3],[10,1,11,3],[10,4,11,4],[10,5,11,5],[10,6,11,6],[12,2,12,3],[13,2,13,3],[14,2,14,3],[15,2,15,3],[16,2,16,3],[17,2,17,3],[18,2,18,3],[19,2,19,3],[20,2,20,3],[21,2,21,3],[22,2,22,3],[23,2,23,3],[24,2,24,3],[25,2,25,3],[26,2,26,3],[27,2,27,3],[28,2,28,3],[29,1,42,1],[29,2,30,2],[31,2,32,2],[33,2,34,2],[35,2,36,2],[37,2,38,2],[39,2,40,2],[41,2,42,2],[43,2,43,3],[46,1,47,1],[46,2,47,2],[46,3,47,3],[46,4,47,4],[61,1,62,2],[61,3,62,3],[61,4,62,4],[61,5,62,5],[63,1,63,2],[70,1,71,1],[70,2,71,2],[70,3,71,3],[70,4,71,4],[79,1,80,1],[79,2,80,2],[83,1,84,1],[83,2,84,2],[83,3,83,8],[89,1,89,2],[90,1,92,1],[94,1,95,1],[94,2,95,2],[94,3,94,5],[94,6,95,6]]}
[null,"SERVICIO DE SALUD "]
[null,{"$f":"CONCATENATE(\"COMUNA: \",NOMBRE!B2,\"  \",\"( \",NOMBRE!C2,NOMBRE!D2,NOMBRE!E2,NOMBRE!F2,NOMBRE!G2,\" )\")","v":"COMUNA:   (  )"}]
[null,{"$f":"CONCATENATE(\"ESTABLECIMIENTO/ESTRATEGIA: \",NOMBRE!B3,\"  \",\"( \",NOMBRE!C3,NOMBRE!D3,NOMBRE!E3,NOMBRE!F3,NOMBRE!G3,NOMBRE!H3,\" )\")","v":"ESTABLECIMIENTO/ESTRATEGIA:   (  )"}]
[null,{"$f":"CONCATENATE(\"MES: \",NOMBRE!B6,\"  \",\"( \",NOMBRE!C6,NOMBRE!D6,\" )\")","v":"MES:   (  )"}]
[null,{"$f":"CONCATENATE(\"AÑO: \",NOMBRE!B7)","v":"AÑO: 2024"}]
[]
[]
[null,"REM-B18.   ACTIVIDADES DE APOYO DIAGNOSTICO Y TERAPEUTICO\n     (USO EXCLUSIVO DE ESTABLECIMIENTOS MUNICIPALES)"]
[]
[null,"SECCIÓN A: EXÁMENES DE DIAGNOSTICO"]
[null,"EXÁMENES",null,null,"TOTAL","SAPU/SAR/SUR","Resto Establecimientos APS"]
[{"$nulls":5},"Total","Total"]
[null,"TOTAL EXÁMENES LABORATORIO",null,null,{"$f":"SUM(F13:G13)","v":{"v":591880,"d":"591,880"}},{"$f":"SUM(F14:F16,F18:F19,F24:F25)","v":477},{"$f":"SUM(G14:G16,G18:G19,G24:G25)","v":{"v":591403,"d":"591,403"}}," "]
["18010100","I  ","HEMATOLÓGICOS",null,{"$f":"SUM(F14:G14)","v":{"v":93537,"d":"93,537"}},{"$f":"IFERROR(VLOOKUP($A14,FILTRO.12!A5:K167,3,FALSE),0)","v":0},{"$f":"IFERROR(VLOOKUP($A14,FILTRO.12!A5:K167,4,FALSE),0)","v":{"v":93537,"d":"93,537"}}]
["18010200","II  ","BIOQUÍMICOS",null,{"$f":"SUM(F15:G15)","v":{"v":323002,"d":"323,002"}},{"$f":"IFERROR(VLOOKUP($A15,FILTRO.12!A6:K168,3,FALSE),0)","v":477},{"$f":"IFERROR(VLOOKUP($A15,FILTRO.12!A6:K168,4,FALSE),0)","v":{"v":322525,"d":"322,525"}}]
["18090100","III","HORMONALES",null,{"v":63572,"d":"63,572"},{"$f":"IFERROR(VLOOKUP($A16,FILTRO.12!A7:K169,3,FALSE),0)","v":0},{"$f":"IFERROR(VLOOKUP($A16,FILTRO.12!A7:K169,4,FALSE),0)","v":{"v":63572,"d":"63,572"}}]
[null,"IV","GENÉTICA",null,null,{"$f":"IFERROR(VLOOKUP($A17,FILTRO.12!A8:K170,3,FALSE),0)","v":0},{"$f":"IFERROR(VLOOKUP($A17,FILTRO.12!A8:K170,4,FALSE),0)","v":0}]
["18010500","V","INMUNOLÓGICOS",null,{"$f":"SUM(F18:G18)","v":0},{"$f":"IFERROR(VLOOKUP($A18,FILTRO.12!A9:K171,3,FALSE),0)","v":0},{"$f":"IFERROR(VLOOKUP($A18,FILTRO.12!A9:K171,4,FALSE),0)","v":0}]
["18010601","VI  ","MICROBIOLÓGICOS",null,0,{"$f":"IFERROR(VLOOKUP($A19,FILTRO.12!A10:K172,3,FALSE),0)","v":0},{"$f":"IFERROR(VLOOKUP($A19,FILTRO.12!A10:K172,4,FALSE),0)","v":0}]
[null,null,"a)   BACTERIAS Y HONGOS"]
[null,null,"b)   PARÁSITOS"]
[null,null,"c)   VIRUS"]
[null,"VII","PROCEDIMIENTO O DETERMINACIÓN DIRECTA C/PACIENTE"]
["18010800","VIII  ","EX.  DE DEPOSICIONES EXUDADOS. SECREC. Y OTROS LIQ.  ",null,{"$f":"SUM(F24:G24)","v":{"v":3548,"d":"3,548"}},{"$f":"IFERROR(VLOOKUP($A24,FILTRO.12!A5:K334,3,FALSE),0)","v":0},{"$f":"IFERROR(VLOOKUP($A24,FILTRO.12!A5:K334,4,FALSE),0)","v":{"v":3548,"d":"3,548"}}]
["18010900","IX   ","ORINA",null,{"v":108221,"d":"108,221"},{"$f":"IFERROR(VLOOKUP($A25,FILTRO.12!A16:K178,3,FALSE),0)","v":0},{"$f":"IFERROR(VLOOKUP($A25,FILTRO.12!A6:K335,4,FALSE),0)","v":{"v":108221,"d":"108,221"}}]
[null,"TOTAL EXÁMENES IMAGENOLOGIA",null,null,{"$f":"SUM(F26:G26)","v":{"v":10179,"d":"10,179"}},{"$f":"SUM(F27+F28+F44)","v":0},{"$f":"SUM(G27+G28)","v":{"v":10179,"d":"10,179"}}]
["18011001","a)","EX. RADIOLÓGICOS SIMPLES",null,{"$f":"SUM(F27:G27)","v":{"v":7312,"d":"7,312"}},{"$f":"IFERROR(VLOOKUP($A27,FILTRO.12!A18:K180,3,FALSE),0)","v":0},{"$f":"IFERROR(VLOOKUP($A27,FILTRO.12!A8:K337,4,FALSE),0)","v":{"v":7312,"d":"7,312"}}]
["18011002",null," Ecotomografías",null,{"$f":"SUM(F28:G28)","v":{"v":2867,"d":"2,867"}},{"$f":"IFERROR(VLOOKUP($A28,FILTRO.12!A19:K181,3,FALSE),0)","v":0},{"$f":"IFERROR(VLOOKUP($A28,FILTRO.12!A9:K338,4,FALSE),0)","v":{"v":2867,"d":"2,867"}}]
["18400500",null," Ecotomografías abdominal ",null,{"v":1049,"d":"1,049"},{"$f":"IFERROR(VLOOKUP($A29,FILTRO.12!A20:K182,3,FALSE),0)","v":0},{"$f":"IFERROR(VLOOKUP($A29,FILTRO.12!A10:K339,4,FALSE),0)","v":{"v":1049,"d":"1,049"}}]
["18700240",null,"Ecografías Obstétrica Primer Trimestre (<11 semanas)","Médico/a",{"$f":"SUM(G30)","v":18},{"$f":"IFERROR(VLOOKUP($A30,FILTRO.12!A21:K183,3,FALSE),0)","v":0},{"$f":"IFERROR(VLOOKUP($A30,FILTRO.12!A11:K340,4,FALSE),0)","v":18}]
["18700250",null,null,"Matrón/a",{"$f":"SUM(G31)","v":812},{"$f":"IFERROR(VLOOKUP($A31,FILTRO.12!A22:K184,3,FALSE),0)","v":0},{"$f":"IFERROR(VLOOKUP($A31,FILTRO.12!A12:K341,4,FALSE),0)","v":812}]
["18700260",null,"Ecografias Obstétricas Primer Trimestre (11 - 14 semanas)","Médico/a",{"$f":"SUM(G32)","v":9},{"$f":"IFERROR(VLOOKUP($A32,FILTRO.12!A23:K185,3,FALSE),0)","v":0},{"$f":"IFERROR(VLOOKUP($A32,FILTRO.12!A13:K342,4,FALSE),0)","v":9}]
["18700270",null,null,"Matrón/a",{"v":1003,"d":"1,003"},{"$f":"IFERROR(VLOOKUP($A33,FILTRO.12!A24:K186,3,FALSE),0)","v":0},{"$f":"IFERROR(VLOOKUP($A33,FILTRO.12!A14:K343,4,FALSE),0)","v":{"v":1003,"d":"1,003"}}]
["18700280",null,"Ecografias Obstétricas Segundo Trimestre (22 - 24 semanas)","Médico/a",8,{"$f":"IFERROR(VLOOKUP($A34,FILTRO.12!A25:K187,3,FALSE),0)","v":0},{"$f":"IFERROR(VLOOKUP($A34,FILTRO.12!A15:K344,4,FALSE),0)","v":8}]
["18700290",null,null,"Matrón/a",606,{"$f":"IFERROR(VLOOKUP($A35,FILTRO.12!A26:K188,3,FALSE),0)","v":0},{"$f":"IFERROR(VLOOKUP($A35,FILTRO.12!A16:K345,4,FALSE),0)","v":606}]
["18700300",null,"Ecografias Obstétricas Tercer Trimestre (30 - 34 semanas)","Médico/a",32,{"$f":"IFERROR(VLOOKUP($A36,FILTRO.12!A27:K189,3,FALSE),0)","v":0},{"$f":"IFERROR(VLOOKUP($A36,FILTRO.12!A17:K346,4,FALSE),0)","v":32}]
["18700310",null,null,"Matrón/a",500,{"$f":"IFERROR(VLOOKUP($A37,FILTRO.12!A28:K190,3,FALSE),0)","v":0},{"$f":"IFERROR(VLOOKUP($A37,FILTRO.12!A18:K347,4,FALSE),0)","v":500}]
[null,null,"Total Ecografías Obstétricas por profesional","Médico/a",{"$f":"SUM(E30+E32+E34+E36)","v":67},{"$f":"IFERROR(VLOOKUP($A38,FILTRO.12!A29:K191,3,FALSE),0)","v":0},{"$f":"IFERROR(VLOOKUP($A38,FILTRO.12!A19:K348,4,FALSE),0)","v":0}]
[{"$nulls":3},"Matrón/a",{"$f":"SUM(E31+E33+E35+E37)","v":{"v":2921,"d":"2,921"}},{"$f":"IFERROR(VLOOKUP($A39,FILTRO.12!A30:K192,3,FALSE),0)","v":0},{"$f":"IFERROR(VLOOKUP($A39,FILTRO.12!A20:K349,4,FALSE),0)","v":0}]
["18700320",null,"Ecografía de seguimiento DIU (Regulación de la Fertilidad)","Médico/a",{"$f":"SUM(G40)","v":0},{"$f":"IFERROR(VLOOKUP($A40,FILTRO.12!A31:K193,3,FALSE),0)","v":0},{"$f":"IFERROR(VLOOKUP($A40,FILTRO.12!A21:K350,4,FALSE),0)","v":0}]
["18700330",null,null,"Matrón/a",{"$f":"SUM(G41)","v":261},{"$f":"IFERROR(VLOOKUP($A41,FILTRO.12!A32:K194,3,FALSE),0)","v":0},{"$f":"IFERROR(VLOOKUP($A41,FILTRO.12!A22:K351,4,FALSE),0)","v":261}]
["18700340",null,"Ecografía Transvaginal (control de Climaterio y Ginecológico)","Médico/a",{"$f":"SUM(G42)","v":8},{"$f":"IFERROR(VLOOKUP($A42,FILTRO.12!A33:K195,3,FALSE),0)","v":0},{"$f":"IFERROR(VLOOKUP($A42,FILTRO.12!A23:K352,4,FALSE),0)","v":8}]
["18700350",null,null,"Matrón/a",{"$f":"SUM(G43)","v":489},{"$f":"IFERROR(VLOOKUP($A43,FILTRO.12!A34:K196,3,FALSE),0)","v":0},{"$f":"IFERROR(VLOOKUP($A43,FILTRO.12!A24:K353,4,FALSE),0)","v":489}]
[null,null,"Total de ecografías obstetricas y ginecologicas ",null,{"$f":"SUM(E38:E43)","v":{"v":3746,"d":"3,746"}}]
[]
[null,"SECCIÓN B:  PROCEDIMIENTO DE APOYO CLÍNICO Y TERAPÉUTICO"]
[null,"PROCEDIMIENTOS","TOTAL","SAPU/SAR/SUR","Resto Establecimientos APS"]
[{"$nulls":3},"Total","Total"]
["18020100","PROC. DE NEUROLOGÍA ",{"$f":"SUM(D49:E49)","v":0},{"$f":"IFERROR(VLOOKUP($A49,FILTRO.12!A5:K334,3,FALSE),0)","v":0},{"$f":"IFERROR(VLOOKUP($A49,FILTRO.12!A5:K334,4,FALSE),0)","v":0}]
["18400400","PROC. DE OFTALMOLOGÍA",{"$f":"SUM(D50:E50)","v":206},{"$f":"IFERROR(VLOOKUP($A50,FILTRO.12!A6:K335,3,FALSE),0)","v":169},{"$f":"IFERROR(VLOOKUP($A50,FILTRO.12!A6:K335,4,FALSE),0)","v":37}]
["18020200","PROC. DE OTORRINOLARINGOLOGÍA ",188,{"$f":"IFERROR(VLOOKUP($A51,FILTRO.12!A7:K336,3,FALSE),0)","v":160},{"$f":"IFERROR(VLOOKUP($A51,FILTRO.12!A7:K336,4,FALSE),0)","v":28}]
["18020300","PROC. DE NEUMOLOGÍA",{"v":22330,"d":"22,330"},{"$f":"IFERROR(VLOOKUP($A52,FILTRO.12!A8:K337,3,FALSE),0)","v":{"v":15893,"d":"15,893"}},{"$f":"IFERROR(VLOOKUP($A52,FILTRO.12!A8:K337,4,FALSE),0)","v":{"v":6437,"d":"6,437"}}]
["18020400","PROC. DE DERMATOLOGÍA",984,{"$f":"IFERROR(VLOOKUP($A53,FILTRO.12!A9:K338,3,FALSE),0)","v":2},{"$f":"IFERROR(VLOOKUP($A53,FILTRO.12!A9:K338,4,FALSE),0)","v":982}]
["18020500","PROC. DE CARDIOLOGÍA",{"v":149163,"d":"149,163"},{"$f":"IFERROR(VLOOKUP($A54,FILTRO.12!A10:K339,3,FALSE),0)","v":{"v":32653,"d":"32,653"}},{"$f":"IFERROR(VLOOKUP($A54,FILTRO.12!A10:K339,4,FALSE),0)","v":{"v":116510,"d":"116,510"}}]
["18020600","PROC. DE GASTROENTEROLOGÍA",160,{"$f":"IFERROR(VLOOKUP($A55,FILTRO.12!A11:K340,3,FALSE),0)","v":142},{"$f":"IFERROR(VLOOKUP($A55,FILTRO.12!A11:K340,4,FALSE),0)","v":18}]
["18020700","PROC. DE UROLOGÍA",{"v":1458,"d":"1,458"},{"$f":"IFERROR(VLOOKUP($A56,FILTRO.12!A12:K341,3,FALSE),0)","v":{"v":1091,"d":"1,091"}},{"$f":"IFERROR(VLOOKUP($A56,FILTRO.12!A12:K341,4,FALSE),0)","v":367}]
["18020800","PROC. ORTOPEDIA Y TRAUMATOLOGÍA",974,{"$f":"IFERROR(VLOOKUP($A57,FILTRO.12!A13:K342,3,FALSE),0)","v":960},{"$f":"IFERROR(VLOOKUP($A57,FILTRO.12!A13:K342,4,FALSE),0)","v":14}]
["18020900","PROC. GINECOLOGÍA",999,{"$f":"IFERROR(VLOOKUP($A58,FILTRO.12!A14:K343,3,FALSE),0)","v":0},{"$f":"IFERROR(VLOOKUP($A58,FILTRO.12!A14:K343,4,FALSE),0)","v":999}]
[null,"TOTAL",{"$f":"SUM(C49:C58)","v":{"v":176462,"d":"176,462"}},{"$f":"SUM(D49:D58)","v":{"v":51070,"d":"51,070"}},{"$f":"SUM(E49:E58)","v":{"v":125392,"d":"125,392"}}]
[]
[null,"SECCIÓN C:  INTERVENCIONES QUIRÚRGICAS MENORES"]
[{"$nulls":3},"TOTAL","SAPU/SAR/SUR","Resto Establecimientos APS"]
[{"$nulls":4},"Total"]
["18030000","TOTAL INTERVENCIONES QUIRÚRGICAS MENORES (SUB-GRUPO TEGUMENTOS)",null,{"$f":"SUM(E64:F64)","v":{"v":5605,"d":"5,605"}},{"$f":"IFERROR(VLOOKUP($A64,FILTRO.12!A5:K334,3,FALSE),0)","v":{"v":4077,"d":"4,077"}},{"$f":"IFERROR(VLOOKUP($A64,FILTRO.12!A5:K334,4,FALSE),0)","v":{"v":1528,"d":"1,528"}}]
[null,"SECCIÓN D : INTERVENCIONES QUIRÚRGICAS MENORES, POR EDAD"]
[null,"INTERVENCIONES QUIRÚRGICAS","TOTAL","< 15 AÑOS","15 Y + AÑOS"]
[null,"TOTAL",{"$f":"SUM(D67:E67)","v":{"v":5581,"d":"5,581"}},{"$f":"SUM(D68:D69)","v":503},{"$f":"SUM(E68:E69)","v":{"v":5078,"d":"5,078"}},{"$f":"V67","v":"El Total de Intervenciones Quirúrgicas de la Sección C debe coincidir con el Total de la Seccion D"},{"$nulls":15},{"$f":"IF(C67=D64,\"\",\"El Total de Intervenciones Quirúrgicas de la Sección C debe coincidir con el Total de la Seccion D\")","v":"El Total de Intervenciones Quirúrgicas de la Sección C debe coincidir con el Total de la Seccion D"},{"$f":"IF(C67=D64,0,1)","v":1}]
["18040100","SAPU/SAR",{"$f":"SUM(D68:E68)","v":{"v":4061,"d":"4,061"}},{"$f":"IFERROR(VLOOKUP($A68,FILTRO.12!A5:K334,3,FALSE),0)","v":434},{"$f":"IFERROR(VLOOKUP($A68,FILTRO.12!A5:K334,4,FALSE),0)","v":{"v":3627,"d":"3,627"}},{"$f":"V68","v":"El Total de Intervenciones Quirúrgicas menores SAPU/SAR debe coincidir con el Total de Intervenciones Quirúrgicas menores SAPU/SAR/SUR de la Sección C. "},{"$nulls":15},{"$f":"IF(C68=E64,\"\",\"El Total de Intervenciones Quirúrgicas menores SAPU/SAR debe coincidir con el Total de Intervenciones Quirúrgicas menores SAPU/SAR/SUR de la Sección C. \")","v":"El Total de Intervenciones Quirúrgicas menores SAPU/SAR debe coincidir con el Total de Intervenciones Quirúrgicas menores SAPU/SAR/SUR de la Sección C. "},{"$f":"IF(C67<>BM18A!D585,1,0)","v":1}]
["18040200","RESTO ESTABLECIMIENTOS APS",{"$f":"SUM(D69:E69)","v":{"v":1520,"d":"1,520"}},{"$f":"IFERROR(VLOOKUP($A69,FILTRO.12!A6:K335,3,FALSE),0)","v":69},{"$f":"IFERROR(VLOOKUP($A69,FILTRO.12!A6:K335,4,FALSE),0)","v":{"v":1451,"d":"1,451"}}," * El Total de Intervenciones Quirúrgicas menores NO SAPU debe coincidir con el Total de Intervenciones Quirúrgicas menores NO SAPU/NO SUR de la Sección C. ",{"$nulls":15},{"$f":"IF(C69=F64,\"\",\" * El Total de Intervenciones Quirúrgicas menores NO SAPU debe coincidir con el Total de Intervenciones Quirúrgicas menores NO SAPU/NO SUR de la Sección C. \")","v":" * El Total de Intervenciones Quirúrgicas menores NO SAPU debe coincidir con el Total de Intervenciones Quirúrgicas menores NO SAPU/NO SUR de la Sección C. "},{"$f":"IF(C69<>BM18A!E586,1,0)","v":1}]
[null,"SECCIÓN E:  MISCELÁNEOS"]
[null,"MISCELÁNEOS","TOTAL","SAPU/SAR/SUR","Resto Establecimientos APS"]
[{"$nulls":3},"Total","Total"]
["18090000","PROCEDIMIENTOS DE PODOLOGIA",{"$f":"SUM(D73:E73)","v":{"v":33733,"d":"33,733"}},{"$f":"IFERROR(VLOOKUP($A73,FILTRO.12!A10:K339,3,FALSE),0)","v":603},{"$f":"IFERROR(VLOOKUP($A73,FILTRO.12!A10:K339,4,FALSE),0)","v":{"v":33130,"d":"33,130"}}]
["18050100","CURACIÓN SIMPLE AMBULATORIA",{"$f":"SUM(D74:E74)","v":{"v":96896,"d":"96,896"}},{"$f":"IFERROR(VLOOKUP($A74,FILTRO.12!A11:K340,3,FALSE),0)","v":{"v":16643,"d":"16,643"}},{"$f":"IFERROR(VLOOKUP($A74,FILTRO.12!A11:K340,4,FALSE),0)","v":{"v":80253,"d":"80,253"}}]
["18050400","CURACION AVANZADA UV",{"v":15091,"d":"15,091"},{"$f":"IFERROR(VLOOKUP($A75,FILTRO.12!A12:K341,3,FALSE),0)","v":310},{"$f":"IFERROR(VLOOKUP($A75,FILTRO.12!A12:K341,4,FALSE),0)","v":{"v":14781,"d":"14,781"}}]
["18050500","CURACION COMPLEJA",{"v":62619,"d":"62,619"},{"$f":"IFERROR(VLOOKUP($A76,FILTRO.12!A13:K342,3,FALSE),0)","v":{"v":2601,"d":"2,601"}},{"$f":"IFERROR(VLOOKUP($A76,FILTRO.12!A13:K342,4,FALSE),0)","v":{"v":60018,"d":"60,018"}}]
["18050200","AUTOCONTROL PERSONAS CON DIABETES INSULINO DEPENDIENTE (D.I.D. MENSUAL)",{"v":1954,"d":"1,954"},{"$f":"IFERROR(VLOOKUP($A77,FILTRO.12!A14:K343,3,FALSE),0)","v":208},{"$f":"IFERROR(VLOOKUP($A77,FILTRO.12!A14:K343,4,FALSE),0)","v":{"v":1746,"d":"1,746"}}]
["18050300","OXIGENOTERAPIA A DOMICILIO",{"$f":"SUM(D78:E78)","v":691},{"$f":"IFERROR(VLOOKUP($A78,FILTRO.12!A15:K344,3,FALSE),0)","v":327},{"$f":"IFERROR(VLOOKUP($A78,FILTRO.12!A15:K344,4,FALSE),0)","v":364}]
[null,"SECCIÓN F: PRESCRIPCIONES ADMINISTRADAS EN URGENCIA "]
[null,"ATENCIÓN","TOTAL"]
[]
["18400700","URGENCIA SAPU/SAR/SUR",{"$f":"IFERROR(VLOOKUP($A82,FILTRO.12!A5:K334,2,FALSE),0)","v":{"v":1139477,"d":"1,139,477"}}]
[null,"SECCIÓN G : OTRAS ATENCIONES A PACIENTES AMBULATORIOS"]
[null,"TIPO DE ATENCIÓN","TOTAL","ATENCIONES POR EDAD"]
[{"$nulls":3},"< 1 año","1 - 4 años","5 a 9 años","10 a 19 años","20 a 64 años","65 años y más"]
["18070100","POR TERAPÉUTICA OCUPACIONAL",{"$f":"SUM(D86:I86)","v":331},{"$f":"IFERROR(VLOOKUP($A86,FILTRO.12!A5:K334,3,FALSE),0)","v":39},{"$f":"IFERROR(VLOOKUP($A86,FILTRO.12!A5:K334,4,FALSE),0)","v":231},{"$f":"IFERROR(VLOOKUP($A86,FILTRO.12!A5:K334,5,FALSE),0)","v":40},{"$f":"IFERROR(VLOOKUP($A86,FILTRO.12!A5:K334,6,FALSE),0)","v":8},{"$f":"IFERROR(VLOOKUP($A86,FILTRO.12!A5:K334,7,FALSE),0)","v":4},{"$f":"IFERROR(VLOOKUP($A86,FILTRO.12!A5:K334,8,FALSE),0)","v":9}]
["18070300","POR KINESIOLOGO (NO SAPU)",{"$f":"SUM(D87:I87)","v":852},{"$f":"IFERROR(VLOOKUP($A87,FILTRO.12!A6:K335,3,FALSE),0)","v":296},{"$f":"IFERROR(VLOOKUP($A87,FILTRO.12!A6:K335,4,FALSE),0)","v":355},{"$f":"IFERROR(VLOOKUP($A87,FILTRO.12!A6:K335,5,FALSE),0)","v":27},{"$f":"IFERROR(VLOOKUP($A87,FILTRO.12!A6:K335,6,FALSE),0)","v":70},{"$f":"IFERROR(VLOOKUP($A87,FILTRO.12!A6:K335,7,FALSE),0)","v":22},{"$f":"IFERROR(VLOOKUP($A87,FILTRO.12!A6:K335,8,FALSE),0)","v":82}]
["18400900","POR EDUCADORA DE PÁRVULO/DIFERENCIAL",{"$f":"SUM(D88:E88)","v":{"v":5374,"d":"5,374"}},{"$f":"IFERROR(VLOOKUP($A88,FILTRO.12!A7:K336,3,FALSE),0)","v":952},{"$f":"IFERROR(VLOOKUP($A88,FILTRO.12!A7:K336,4,FALSE),0)","v":{"v":4422,"d":"4,422"}},{"$f":"IFERROR(VLOOKUP($A88,FILTRO.12!A5:K334,5,FALSE),0)","v":0},{"$f":"IFERROR(VLOOKUP($A88,FILTRO.12!A5:K334,6,FALSE),0)","v":0},{"$f":"IFERROR(VLOOKUP($A88,FILTRO.12!A5:K334,7,FALSE),0)","v":0},{"$f":"IFERROR(VLOOKUP($A88,FILTRO.12!A5:K334,8,FALSE),0)","v":0}]
[null,"SECCIÓN H: OTROS TRASLADOS DE PACIENTES"]
[null,"TIPO DE ACCION",null,"TOTAL        ","POR COMPRA \nDE SERVICIO"]
["18090200","TRASLADOS NO DE URGENCIA","AMBULANCIA",{"$f":"IFERROR(VLOOKUP($A91,FILTRO.12!A10:K339,2,FALSE),0)","v":{"v":7837,"d":"7,837"}},{"$f":"IFERROR(VLOOKUP($A91,FILTRO.12!A5:K334,3,FALSE),0)","v":{"v":1666,"d":"1,666"}}]
["18090300",null,"MARÍTIMO",{"$f":"IFERROR(VLOOKUP($A92,FILTRO.12!A11:K340,2,FALSE),0)","v":0},{"$f":"IFERROR(VLOOKUP($A92,FILTRO.12!A6:K335,3,FALSE),0)","v":0}]
["18090400",null,"AÉREO",{"$f":"IFERROR(VLOOKUP($A93,FILTRO.12!A12:K341,2,FALSE),0)","v":0},{"$f":"IFERROR(VLOOKUP($A93,FILTRO.12!A7:K336,3,FALSE),0)","v":0}]
[null,"SECCIÓN I: EXAMENES PESQUISA COVID-19 "]
[null,"TIPO DE EXÁMEN","TOTAL        ","Por grupos etarios",null,null,"POR COMPRA DE SERVICIO"]
[{"$nulls":3},"< 15 años","> 15-64 años","65 y más años"]
["18700100","0306082: Reacción de Polimerasa en Cadena (P.C.R.), virus Influenza, virus Herpes, citomegalovirus, hepatitis C, mycobacteria TBC, SARS CoV -2 c/u (incluye toma muestra hisopado nasofaríngeo).",{"$f":"SUM(D97:F97)","v":118},{"$f":"IFERROR(VLOOKUP($A97,FILTRO.12!A5:K334,3,FALSE),0)","v":22},{"$f":"IFERROR(VLOOKUP($A97,FILTRO.12!A5:K334,4,FALSE),0)","v":86},{"$f":"IFERROR(VLOOKUP($A97,FILTRO.12!A5:K334,5,FALSE),0)","v":10},{"$f":"IFERROR(VLOOKUP($A97,FILTRO.12!A5:K334,6,FALSE),0)","v":0}]
[]
[]
["CODIGOS ELIMINADOS"]
[18700110]
[18700120]
[18700130]
[18700140]
[18700150]
[18700160]
[18700170]
[18700180]
[18700190]
[18700210]
[18700220]
[18700230]

{"sheet":"BM18A","index":2,"n_rows":631,"n_cols":9,"rows_kept":631,"merged":[[5,1,5,3],[6,1,6,6],[9,1,10,1],[9,2,10,2],[9,3,10,3],[9,4,10,4],[9,5,10,5],[9,6,10,6],[11,1,11,2],[11,3,11,6],[97,1,97,2],[99,1,99,2],[99,3,99,6],[169,1,169,2],[171,1,171,2],[171,3,171,6],[178,1,178,2],[180,1,180,2],[180,3,180,6],[238,1,238,2],[240,1,240,2],[240,3,240,6],[319,1,319,2],[321,1,321,2],[366,1,366,2],[368,1,368,2],[399,1,399,2],[400,1,400,2],[402,1,402,2],[402,3,402,6],[487,1,487,8],[488,1,489,1],[488,2,489,2],[488,3,489,3],[488,4,489,4],[488,5,489,5],[488,6,488,7],[488,8,489,8],[490,1,490,2],[490,3,490,8],[493,1,493,2],[493,3,493,8],[505,1,505,2],[507,1,507,2],[514,1,514,2],[516,1,516,2],[516,3,516,8],[519,1,519,2],[521,1,521,2],[521,3,521,8],[526,1,526,2],[528,1,528,2],[528,3,528,8],[533,1,533,2],[535,1,535,2],[535,3,535,8],[539,1,539,2],[541,1,541,2],[541,3,541,8],[544,1,544,2],[546,1,546,2],[546,3,546,8],[549,1,549,2],[549,3,549,8],[557,1,557,2],[559,1,559,2],[559,3,559,8],[584,1,584,2],[586,1,586,2],[586,3,586,8],[605,1,605,2],[607,3,608,3],[607,4,608,4],[607,5,608,5],[607,6,608,6],[611,1,611,2],[613,1,613,3],[613,4,613,8],[614,1,615,2],[614,3,615,3],[614,4,615,4],[614,5,615,5],[614,6,614,7],[614,8,615,8]]}
[null,"SERVICIO DE SALUD "]
[null,{"$f":"CONCATENATE(\"COMUNA: \",NOMBRE!B2,\"  \",\"( \",NOMBRE!C2,NOMBRE!D2,NOMBRE!E2,NOMBRE!F2,NOMBRE!G2,\" )\")","v":"COMUNA:   (  )"}]
[null,{"$f":"CONCATENATE(\"ESTABLECIMIENTO/ESTRATEGIA: \",NOMBRE!B3,\"  \",\"( \",NOMBRE!C3,NOMBRE!D3,NOMBRE!E3,NOMBRE!F3,NOMBRE!G3,NOMBRE!H3,\" )\")","v":"ESTABLECIMIENTO/ESTRATEGIA:   (  )"}]
[null,{"$f":"CONCATENATE(\"MES: \",NOMBRE!B6,\"  \",\"( \",NOMBRE!C6,NOMBRE!D6,\" )\")","v":"MES:   (  )"}]
[null,{"$f":"CONCATENATE(\"AÑO: \",NOMBRE!B7)","v":"AÑO: 2024"}]
[]
[null,"REM-18A  -  LIBRO DE PRESTACIONES DE APOYO DIAGNOSTICO y TERAPÉUTICO\n(USO EXCLUSIVO DE ESTABLECIMIENTOS MUNICIPALES)"]
[]
[null,"SECCIÓN A: EXÁMENES DE DIAGNOSTICO"]
[null,"CÓDIGOS","EXÁMENES","TOTAL","SAPU/SAR/SUR","Resto Establecimientos APS","Compra de Servicios"]
[]
[null,"SANGRE HEMATOLOGÍA"]
["80301001","0301001","Acidificación del suero, test de Ham",{"$f":"SUM(E13:F13)","v":0},{"$f":"IFERROR(VLOOKUP($A13,FILTRO.12!A5:K334,3,FALSE),0)","v":0},{"$f":"IFERROR(VLOOKUP($A13,FILTRO.12!A5:K334,4,FALSE),0)","v":0},{"$f":"IFERROR(VLOOKUP($A13,FILTRO.12!A5:K334,5,FALSE),0)","v":0}]
["80301002","0301002","Acido fólico o folatos",{"$f":"SUM(E14:F14)","v":0},{"$f":"IFERROR(VLOOKUP($A14,FILTRO.12!A6:K335,3,FALSE),0)","v":0},{"$f":"IFERROR(VLOOKUP($A14,FILTRO.12!A6:K335,4,FALSE),0)","v":0},{"$f":"IFERROR(VLOOKUP($A14,FILTRO.12!A6:K335,5,FALSE),0)","v":4}]
["80301003","0301003","Adenograma, esplenograma, mielograma c/u",{"$f":"SUM(E15:F15)","v":0},{"$f":"IFERROR(VLOOKUP($A15,FILTRO.12!A7:K336,3,FALSE),0)","v":0},{"$f":"IFERROR(VLOOKUP($A15,FILTRO.12!A7:K336,4,FALSE),0)","v":0},{"$f":"IFERROR(VLOOKUP($A15,FILTRO.12!A7:K336,5,FALSE),0)","v":0}]
["80301004","0301004","Adhesividad plaquetaria",0,{"$f":"IFERROR(VLOOKUP($A16,FILTRO.12!A8:K337,3,FALSE),0)","v":0},{"$f":"IFERROR(VLOOKUP($A16,FILTRO.12!A8:K337,4,FALSE),0)","v":0},{"$f":"IFERROR(VLOOKUP($A16,FILTRO.12!A8:K337,5,FALSE),0)","v":0}]
["80301005","0301005","Aglutininas anti Rho",0,{"$f":"IFERROR(VLOOKUP($A17,FILTRO.12!A9:K338,3,FALSE),0)","v":0},{"$f":"IFERROR(VLOOKUP($A17,FILTRO.12!A9:K338,4,FALSE),0)","v":0},{"$f":"IFERROR(VLOOKUP($A17,FILTRO.12!A9:K338,5,FALSE),0)","v":0}]
["80301006","0301006","Agregación plaquetaria",0,{"$f":"IFERROR(VLOOKUP($A18,FILTRO.12!A10:K339,3,FALSE),0)","v":0},{"$f":"IFERROR(VLOOKUP($A18,FILTRO.12!A10:K339,4,FALSE),0)","v":0},{"$f":"IFERROR(VLOOKUP($A18,FILTRO.12!A10:K339,5,FALSE),0)","v":0}]
["80301007","0301007","Anticoagulantes circulantes o anticoagulante lúpico",0,{"$f":"IFERROR(VLOOKUP($A19,FILTRO.12!A11:K340,3,FALSE),0)","v":0},{"$f":"IFERROR(VLOOKUP($A19,FILTRO.12!A11:K340,4,FALSE),0)","v":0},{"$f":"IFERROR(VLOOKUP($A19,FILTRO.12!A11:K340,5,FALSE),0)","v":0}]
["80301008","0301008","Antitrombina III",0,{"$f":"IFERROR(VLOOKUP($A20,FILTRO.12!A12:K341,3,FALSE),0)","v":0},{"$f":"IFERROR(VLOOKUP($A20,FILTRO.12!A12:K341,4,FALSE),0)","v":0},{"$f":"IFERROR(VLOOKUP($A20,FILTRO.12!A12:K341,5,FALSE),0)","v":0}]
["80301009","0301009","Auto-hemólisis test,  con y sin glucosa",0,{"$f":"IFERROR(VLOOKUP($A21,FILTRO.12!A13:K342,3,FALSE),0)","v":0},{"$f":"IFERROR(VLOOKUP($A21,FILTRO.12!A13:K342,4,FALSE),0)","v":0},{"$f":"IFERROR(VLOOKUP($A21,FILTRO.12!A13:K342,5,FALSE),0)","v":0}]
["80301010","0301010","Células del lupus, cada muestra",0,{"$f":"IFERROR(VLOOKUP($A22,FILTRO.12!A14:K343,3,FALSE),0)","v":0},{"$f":"IFERROR(VLOOKUP($A22,FILTRO.12!A14:K343,4,FALSE),0)","v":0},{"$f":"IFERROR(VLOOKUP($A22,FILTRO.12!A14:K343,5,FALSE),0)","v":0}]
["80301011","0301011","Coagulación, tiempo de",7,{"$f":"IFERROR(VLOOKUP($A23,FILTRO.12!A15:K344,3,FALSE),0)","v":0},{"$f":"IFERROR(VLOOKUP($A23,FILTRO.12!A15:K344,4,FALSE),0)","v":7},{"$f":"IFERROR(VLOOKUP($A23,FILTRO.12!A15:K344,5,FALSE),0)","v":539}]
["80301012","0301012","Coágulo,  tiempo de retracción del",0,{"$f":"IFERROR(VLOOKUP($A24,FILTRO.12!A16:K345,3,FALSE),0)","v":0},{"$f":"IFERROR(VLOOKUP($A24,FILTRO.12!A16:K345,4,FALSE),0)","v":0},{"$f":"IFERROR(VLOOKUP($A24,FILTRO.12!A16:K345,5,FALSE),0)","v":0}]
["80301013","0301013","Coágulo, tiempo de lisis del",0,{"$f":"IFERROR(VLOOKUP($A25,FILTRO.12!A17:K346,3,FALSE),0)","v":0},{"$f":"IFERROR(VLOOKUP($A25,FILTRO.12!A17:K346,4,FALSE),0)","v":0},{"$f":"IFERROR(VLOOKUP($A25,FILTRO.12!A17:K346,5,FALSE),0)","v":0}]
["80301014","0301014","Coombs directo, test de",5,{"$f":"IFERROR(VLOOKUP($A26,FILTRO.12!A18:K347,3,FALSE),0)","v":0},{"$f":"IFERROR(VLOOKUP($A26,FILTRO.12!A18:K347,4,FALSE),0)","v":5},{"$f":"IFERROR(VLOOKUP($A26,FILTRO.12!A18:K347,5,FALSE),0)","v":83}]
["80301015","0301015","Coombs indirecto, prueba de",31,{"$f":"IFERROR(VLOOKUP($A27,FILTRO.12!A19:K348,3,FALSE),0)","v":0},{"$f":"IFERROR(VLOOKUP($A27,FILTRO.12!A19:K348,4,FALSE),0)","v":31},{"$f":"IFERROR(VLOOKUP($A27,FILTRO.12!A19:K348,5,FALSE),0)","v":{"v":1639,"d":"1,639"}}]
["80301016","0301016","Cuerpos de Heinz",0,{"$f":"IFERROR(VLOOKUP($A28,FILTRO.12!A20:K349,3,FALSE),0)","v":0},{"$f":"IFERROR(VLOOKUP($A28,FILTRO.12!A20:K349,4,FALSE),0)","v":0},{"$f":"IFERROR(VLOOKUP($A28,FILTRO.12!A20:K349,5,FALSE),0)","v":0}]
["80301017","0301017","Deshidrogenasa glucosa-6-fosfato en eritrocitos",0,{"$f":"IFERROR(VLOOKUP($A29,FILTRO.12!A21:K350,3,FALSE),0)","v":0},{"$f":"IFERROR(VLOOKUP($A29,FILTRO.12!A21:K350,4,FALSE),0)","v":0},{"$f":"IFERROR(VLOOKUP($A29,FILTRO.12!A21:K350,5,FALSE),0)","v":4}]
["80301020","0301020","Euglobulinas, tiempo de lisis de",0,{"$f":"IFERROR(VLOOKUP($A30,FILTRO.12!A22:K351,3,FALSE),0)","v":0},{"$f":"IFERROR(VLOOKUP($A30,FILTRO.12!A22:K351,4,FALSE),0)","v":0},{"$f":"IFERROR(VLOOKUP($A30,FILTRO.12!A22:K351,5,FALSE),0)","v":0}]
["80301021","0301021","Fibrinógeno",0,{"$f":"IFERROR(VLOOKUP($A31,FILTRO.12!A23:K352,3,FALSE),0)","v":0},{"$f":"IFERROR(VLOOKUP($A31,FILTRO.12!A23:K352,4,FALSE),0)","v":0},{"$f":"IFERROR(VLOOKUP($A31,FILTRO.12!A23:K352,5,FALSE),0)","v":0}]
["80301022","0301022","Test de neutralización plaquetaria",0,{"$f":"IFERROR(VLOOKUP($A32,FILTRO.12!A24:K353,3,FALSE),0)","v":0},{"$f":"IFERROR(VLOOKUP($A32,FILTRO.12!A24:K353,4,FALSE),0)","v":0},{"$f":"IFERROR(VLOOKUP($A32,FILTRO.12!A24:K353,5,FALSE),0)","v":0}]
["80301023","0301023","Factor III plaquetario",0,{"$f":"IFERROR(VLOOKUP($A33,FILTRO.12!A25:K354,3,FALSE),0)","v":0},{"$f":"IFERROR(VLOOKUP($A33,FILTRO.12!A25:K354,4,FALSE),0)","v":0},{"$f":"IFERROR(VLOOKUP($A33,FILTRO.12!A25:K354,5,FALSE),0)","v":0}]
["80301024","0301024","Factor V",0,{"$f":"IFERROR(VLOOKUP($A34,FILTRO.12!A26:K355,3,FALSE),0)","v":0},{"$f":"IFERROR(VLOOKUP($A34,FILTRO.12!A26:K355,4,FALSE),0)","v":0},{"$f":"IFERROR(VLOOKUP($A34,FILTRO.12!A26:K355,5,FALSE),0)","v":0}]
["80301025","0301025","Factores VII, VIII, IX, X, XI, XII, XIII, c/u",0,{"$f":"IFERROR(VLOOKUP($A35,FILTRO.12!A27:K356,3,FALSE),0)","v":0},{"$f":"IFERROR(VLOOKUP($A35,FILTRO.12!A27:K356,4,FALSE),0)","v":0},{"$f":"IFERROR(VLOOKUP($A35,FILTRO.12!A27:K356,5,FALSE),0)","v":0}]
["80301026","0301026","Ferritina",0,{"$f":"IFERROR(VLOOKUP($A36,FILTRO.12!A28:K357,3,FALSE),0)","v":0},{"$f":"IFERROR(VLOOKUP($A36,FILTRO.12!A28:K357,4,FALSE),0)","v":0},{"$f":"IFERROR(VLOOKUP($A36,FILTRO.12!A28:K357,5,FALSE),0)","v":3}]
["80301027","0301027","Fibrinógeno, productos de degradación del",0,{"$f":"IFERROR(VLOOKUP($A37,FILTRO.12!A29:K358,3,FALSE),0)","v":0},{"$f":"IFERROR(VLOOKUP($A37,FILTRO.12!A29:K358,4,FALSE),0)","v":0},{"$f":"IFERROR(VLOOKUP($A37,FILTRO.12!A29:K358,5,FALSE),0)","v":0}]
["80301028","0301028","Fierro sérico",0,{"$f":"IFERROR(VLOOKUP($A38,FILTRO.12!A30:K359,3,FALSE),0)","v":0},{"$f":"IFERROR(VLOOKUP($A38,FILTRO.12!A30:K359,4,FALSE),0)","v":0},{"$f":"IFERROR(VLOOKUP($A38,FILTRO.12!A30:K359,5,FALSE),0)","v":0}]
["80301029","0301029","Fierro, capacidad de fijación del (incluye fierro sérico)",0,{"$f":"IFERROR(VLOOKUP($A39,FILTRO.12!A31:K360,3,FALSE),0)","v":0},{"$f":"IFERROR(VLOOKUP($A39,FILTRO.12!A31:K360,4,FALSE),0)","v":0},{"$f":"IFERROR(VLOOKUP($A39,FILTRO.12!A31:K360,5,FALSE),0)","v":0}]
["80301030","0301030","Fierro, cinética del (cada determinación)",0,{"$f":"IFERROR(VLOOKUP($A40,FILTRO.12!A32:K361,3,FALSE),0)","v":0},{"$f":"IFERROR(VLOOKUP($A40,FILTRO.12!A32:K361,4,FALSE),0)","v":0},{"$f":"IFERROR(VLOOKUP($A40,FILTRO.12!A32:K361,5,FALSE),0)","v":3}]
["80301032","0301032","Gelación por etanol",0,{"$f":"IFERROR(VLOOKUP($A41,FILTRO.12!A33:K362,3,FALSE),0)","v":0},{"$f":"IFERROR(VLOOKUP($A41,FILTRO.12!A33:K362,4,FALSE),0)","v":0},{"$f":"IFERROR(VLOOKUP($A41,FILTRO.12!A33:K362,5,FALSE),0)","v":0}]
["80301033","0301033","Grupos menores. Tipificación o determinación de otros sistemas sanguíneos (Kell, Duffy, Kidd y otros) c/u.",0,{"$f":"IFERROR(VLOOKUP($A42,FILTRO.12!A34:K363,3,FALSE),0)","v":0},{"$f":"IFERROR(VLOOKUP($A42,FILTRO.12!A34:K363,4,FALSE),0)","v":0},{"$f":"IFERROR(VLOOKUP($A42,FILTRO.12!A34:K363,5,FALSE),0)","v":5}]
["80301034","0301034","Grupos sanguíneos AB0 y Rho (incluye estudio de factor Du en Rh negativos)",{"v":1236,"d":"1,236"},{"$f":"IFERROR(VLOOKUP($A43,FILTRO.12!A35:K364,3,FALSE),0)","v":0},{"$f":"IFERROR(VLOOKUP($A43,FILTRO.12!A35:K364,4,FALSE),0)","v":{"v":1236,"d":"1,236"}},{"$f":"IFERROR(VLOOKUP($A43,FILTRO.12!A35:K364,5,FALSE),0)","v":{"v":2619,"d":"2,619"}}]
["80301035","0301035","Haptoglobina cuantitativa",0,{"$f":"IFERROR(VLOOKUP($A44,FILTRO.12!A36:K365,3,FALSE),0)","v":0},{"$f":"IFERROR(VLOOKUP($A44,FILTRO.12!A36:K365,4,FALSE),0)","v":0},{"$f":"IFERROR(VLOOKUP($A44,FILTRO.12!A36:K365,5,FALSE),0)","v":489}]
["80301036","0301036","Hematocrito (proc. aut.)",{"v":3755,"d":"3,755"},{"$f":"IFERROR(VLOOKUP($A45,FILTRO.12!A37:K366,3,FALSE),0)","v":0},{"$f":"IFERROR(VLOOKUP($A45,FILTRO.12!A37:K366,4,FALSE),0)","v":{"v":3755,"d":"3,755"}},{"$f":"IFERROR(VLOOKUP($A45,FILTRO.12!A37:K366,5,FALSE),0)","v":{"v":37440,"d":"37,440"}}]
["80301038","0301038","Hemoglobina en sangre total (proc. aut.)",{"v":1719,"d":"1,719"},{"$f":"IFERROR(VLOOKUP($A46,FILTRO.12!A38:K367,3,FALSE),0)","v":0},{"$f":"IFERROR(VLOOKUP($A46,FILTRO.12!A38:K367,4,FALSE),0)","v":{"v":1719,"d":"1,719"}},{"$f":"IFERROR(VLOOKUP($A46,FILTRO.12!A38:K367,5,FALSE),0)","v":{"v":33010,"d":"33,010"}}]
["80301039","0301039","Hemoglobina fetal cualitativa",0,{"$f":"IFERROR(VLOOKUP($A47,FILTRO.12!A39:K368,3,FALSE),0)","v":0},{"$f":"IFERROR(VLOOKUP($A47,FILTRO.12!A39:K368,4,FALSE),0)","v":0},{"$f":"IFERROR(VLOOKUP($A47,FILTRO.12!A39:K368,5,FALSE),0)","v":0}]
["80301040","0301040","Hemoglobina fetal cuantitativa en eritrocitos",6,{"$f":"IFERROR(VLOOKUP($A48,FILTRO.12!A40:K369,3,FALSE),0)","v":0},{"$f":"IFERROR(VLOOKUP($A48,FILTRO.12!A40:K369,4,FALSE),0)","v":6},{"$f":"IFERROR(VLOOKUP($A48,FILTRO.12!A40:K369,5,FALSE),0)","v":6}]
["80301041","0301041","Hemoglobina glicosilada",{"v":30268,"d":"30,268"},{"$f":"IFERROR(VLOOKUP($A49,FILTRO.12!A41:K370,3,FALSE),0)","v":0},{"$f":"IFERROR(VLOOKUP($A49,FILTRO.12!A41:K370,4,FALSE),0)","v":{"v":30268,"d":"30,268"}},{"$f":"IFERROR(VLOOKUP($A49,FILTRO.12!A41:K370,5,FALSE),0)","v":{"v":58722,"d":"58,722"}}]
["80301042","0301042","Hemoglobina plasmática",0,{"$f":"IFERROR(VLOOKUP($A50,FILTRO.12!A42:K371,3,FALSE),0)","v":0},{"$f":"IFERROR(VLOOKUP($A50,FILTRO.12!A42:K371,4,FALSE),0)","v":0},{"$f":"IFERROR(VLOOKUP($A50,FILTRO.12!A42:K371,5,FALSE),0)","v":1}]
["80301043","0301043","Hemoglobina termolabil",0,{"$f":"IFERROR(VLOOKUP($A51,FILTRO.12!A43:K372,3,FALSE),0)","v":0},{"$f":"IFERROR(VLOOKUP($A51,FILTRO.12!A43:K372,4,FALSE),0)","v":0},{"$f":"IFERROR(VLOOKUP($A51,FILTRO.12!A43:K372,5,FALSE),0)","v":0}]
["80301044","0301044","Hemoglobina, electroforesis de (incluye Hb. total)",0,{"$f":"IFERROR(VLOOKUP($A52,FILTRO.12!A44:K373,3,FALSE),0)","v":0},{"$f":"IFERROR(VLOOKUP($A52,FILTRO.12!A44:K373,4,FALSE),0)","v":0},{"$f":"IFERROR(VLOOKUP($A52,FILTRO.12!A44:K373,5,FALSE),0)","v":0}]
["80301045","0301045","Hemograma (incluye recuentos de leucocitos y eritrocitos, hemoglobina, hematocrito, fórmula leucocitaria, características de los elementos figurados y velocidad de eritrosedimentación)",{"v":51290,"d":"51,290"},{"$f":"IFERROR(VLOOKUP($A53,FILTRO.12!A45:K374,3,FALSE),0)","v":0},{"$f":"IFERROR(VLOOKUP($A53,FILTRO.12!A45:K374,4,FALSE),0)","v":{"v":51290,"d":"51,290"}},{"$f":"IFERROR(VLOOKUP($A53,FILTRO.12!A45:K374,5,FALSE),0)","v":{"v":73405,"d":"73,405"}}]
["80301046","0301046","Hemolisinas",0,{"$f":"IFERROR(VLOOKUP($A54,FILTRO.12!A46:K375,3,FALSE),0)","v":0},{"$f":"IFERROR(VLOOKUP($A54,FILTRO.12!A46:K375,4,FALSE),0)","v":0},{"$f":"IFERROR(VLOOKUP($A54,FILTRO.12!A46:K375,5,FALSE),0)","v":{"v":3707,"d":"3,707"}}]
["80301047","0301047","Hemólisis con sucrosa, test de",0,{"$f":"IFERROR(VLOOKUP($A55,FILTRO.12!A47:K376,3,FALSE),0)","v":0},{"$f":"IFERROR(VLOOKUP($A55,FILTRO.12!A47:K376,4,FALSE),0)","v":0},{"$f":"IFERROR(VLOOKUP($A55,FILTRO.12!A47:K376,5,FALSE),0)","v":0}]
["80301048","0301048","Hemosiderina medular",0,{"$f":"IFERROR(VLOOKUP($A56,FILTRO.12!A48:K377,3,FALSE),0)","v":0},{"$f":"IFERROR(VLOOKUP($A56,FILTRO.12!A48:K377,4,FALSE),0)","v":0},{"$f":"IFERROR(VLOOKUP($A56,FILTRO.12!A48:K377,5,FALSE),0)","v":0}]
["80301049","0301049","Heparina, cuantificación de",0,{"$f":"IFERROR(VLOOKUP($A57,FILTRO.12!A49:K378,3,FALSE),0)","v":0},{"$f":"IFERROR(VLOOKUP($A57,FILTRO.12!A49:K378,4,FALSE),0)","v":0},{"$f":"IFERROR(VLOOKUP($A57,FILTRO.12!A49:K378,5,FALSE),0)","v":0}]
["80301050","0301050","Isoinmunización, detección de anticuerpos irregulares (proc. aut.).",0,{"$f":"IFERROR(VLOOKUP($A58,FILTRO.12!A50:K379,3,FALSE),0)","v":0},{"$f":"IFERROR(VLOOKUP($A58,FILTRO.12!A50:K379,4,FALSE),0)","v":0},{"$f":"IFERROR(VLOOKUP($A58,FILTRO.12!A50:K379,5,FALSE),0)","v":0}]
["80301051","0301051","Isoinmunización, detección e identificación de anticuerpos",0,{"$f":"IFERROR(VLOOKUP($A59,FILTRO.12!A51:K380,3,FALSE),0)","v":0},{"$f":"IFERROR(VLOOKUP($A59,FILTRO.12!A51:K380,4,FALSE),0)","v":0},{"$f":"IFERROR(VLOOKUP($A59,FILTRO.12!A51:K380,5,FALSE),0)","v":0}]
["80301052","0301052","Isopropanol, test de",0,{"$f":"IFERROR(VLOOKUP($A60,FILTRO.12!A52:K381,3,FALSE),0)","v":0},{"$f":"IFERROR(VLOOKUP($A60,FILTRO.12!A52:K381,4,FALSE),0)","v":0},{"$f":"IFERROR(VLOOKUP($A60,FILTRO.12!A52:K381,5,FALSE),0)","v":0}]
["80301053","0301053","Metahemalbúmina",0,{"$f":"IFERROR(VLOOKUP($A61,FILTRO.12!A53:K382,3,FALSE),0)","v":0},{"$f":"IFERROR(VLOOKUP($A61,FILTRO.12!A53:K382,4,FALSE),0)","v":0},{"$f":"IFERROR(VLOOKUP($A61,FILTRO.12!A53:K382,5,FALSE),0)","v":0}]
["80301054","0301054","Metahemoglobina",0,{"$f":"IFERROR(VLOOKUP($A62,FILTRO.12!A54:K383,3,FALSE),0)","v":0},{"$f":"IFERROR(VLOOKUP($A62,FILTRO.12!A54:K383,4,FALSE),0)","v":0},{"$f":"IFERROR(VLOOKUP($A62,FILTRO.12!A54:K383,5,FALSE),0)","v":0}]
["80301055","0301055","Muraminidasa en eritrocitos",0,{"$f":"IFERROR(VLOOKUP($A63,FILTRO.12!A55:K384,3,FALSE),0)","v":0},{"$f":"IFERROR(VLOOKUP($A63,FILTRO.12!A55:K384,4,FALSE),0)","v":0},{"$f":"IFERROR(VLOOKUP($A63,FILTRO.12!A55:K384,5,FALSE),0)","v":0}]
["80301056","0301056","Piruvatoquinasa en eritrocitos",0,{"$f":"IFERROR(VLOOKUP($A64,FILTRO.12!A56:K385,3,FALSE),0)","v":0},{"$f":"IFERROR(VLOOKUP($A64,FILTRO.12!A56:K385,4,FALSE),0)","v":0},{"$f":"IFERROR(VLOOKUP($A64,FILTRO.12!A56:K385,5,FALSE),0)","v":0}]
["80301057","0301057","Protamina sulfato, determinación de",0,{"$f":"IFERROR(VLOOKUP($A65,FILTRO.12!A57:K386,3,FALSE),0)","v":0},{"$f":"IFERROR(VLOOKUP($A65,FILTRO.12!A57:K386,4,FALSE),0)","v":0},{"$f":"IFERROR(VLOOKUP($A65,FILTRO.12!A57:K386,5,FALSE),0)","v":0}]
["80301058","0301058","Protoporfirinas en eritrocitos",0,{"$f":"IFERROR(VLOOKUP($A66,FILTRO.12!A58:K387,3,FALSE),0)","v":0},{"$f":"IFERROR(VLOOKUP($A66,FILTRO.12!A58:K387,4,FALSE),0)","v":0},{"$f":"IFERROR(VLOOKUP($A66,FILTRO.12!A58:K387,5,FALSE),0)","v":0}]
["80301059","0301059","Protrombina, tiempo de o consumo de (incluye INR, Relación Internacional Normalizada)",{"v":3350,"d":"3,350"},{"$f":"IFERROR(VLOOKUP($A67,FILTRO.12!A59:K388,3,FALSE),0)","v":0},{"$f":"IFERROR(VLOOKUP($A67,FILTRO.12!A59:K388,4,FALSE),0)","v":{"v":3350,"d":"3,350"}},{"$f":"IFERROR(VLOOKUP($A67,FILTRO.12!A59:K388,5,FALSE),0)","v":{"v":3183,"d":"3,183"}}]
["80301062","0301062","Recuento de basófilos (absoluto)",0,{"$f":"IFERROR(VLOOKUP($A68,FILTRO.12!A60:K389,3,FALSE),0)","v":0},{"$f":"IFERROR(VLOOKUP($A68,FILTRO.12!A60:K389,4,FALSE),0)","v":0},{"$f":"IFERROR(VLOOKUP($A68,FILTRO.12!A60:K389,5,FALSE),0)","v":0}]
["80301063","0301063","Recuento de eosinófilos (absoluto)",0,{"$f":"IFERROR(VLOOKUP($A69,FILTRO.12!A61:K390,3,FALSE),0)","v":0},{"$f":"IFERROR(VLOOKUP($A69,FILTRO.12!A61:K390,4,FALSE),0)","v":0},{"$f":"IFERROR(VLOOKUP($A69,FILTRO.12!A61:K390,5,FALSE),0)","v":0}]
["80301064","0301064","Recuento de eritrocitos, absoluto (proc. aut.)",0,{"$f":"IFERROR(VLOOKUP($A70,FILTRO.12!A62:K391,3,FALSE),0)","v":0},{"$f":"IFERROR(VLOOKUP($A70,FILTRO.12!A62:K391,4,FALSE),0)","v":0},{"$f":"IFERROR(VLOOKUP($A70,FILTRO.12!A62:K391,5,FALSE),0)","v":0}]
["80301065","0301065","Recuento de leucocitos, absoluto (proc. aut.)",24,{"$f":"IFERROR(VLOOKUP($A71,FILTRO.12!A63:K392,3,FALSE),0)","v":0},{"$f":"IFERROR(VLOOKUP($A71,FILTRO.12!A63:K392,4,FALSE),0)","v":24},{"$f":"IFERROR(VLOOKUP($A71,FILTRO.12!A63:K392,5,FALSE),0)","v":36}]
["80301066","0301066","Recuento de linfocitos (absoluto)",0,{"$f":"IFERROR(VLOOKUP($A72,FILTRO.12!A64:K393,3,FALSE),0)","v":0},{"$f":"IFERROR(VLOOKUP($A72,FILTRO.12!A64:K393,4,FALSE),0)","v":0},{"$f":"IFERROR(VLOOKUP($A72,FILTRO.12!A64:K393,5,FALSE),0)","v":0}]
["80301067","0301067","Recuento de plaquetas (absoluto)",159,{"$f":"IFERROR(VLOOKUP($A73,FILTRO.12!A65:K394,3,FALSE),0)","v":0},{"$f":"IFERROR(VLOOKUP($A73,FILTRO.12!A65:K394,4,FALSE),0)","v":159},{"$f":"IFERROR(VLOOKUP($A73,FILTRO.12!A65:K394,5,FALSE),0)","v":67}]
["80301068","0301068","Recuento de reticulocitos (absoluto o porcentual)",0,{"$f":"IFERROR(VLOOKUP($A74,FILTRO.12!A66:K395,3,FALSE),0)","v":0},{"$f":"IFERROR(VLOOKUP($A74,FILTRO.12!A66:K395,4,FALSE),0)","v":0},{"$f":"IFERROR(VLOOKUP($A74,FILTRO.12!A66:K395,5,FALSE),0)","v":0}]
["80301069","0301069","Recuento diferencial o fórmula leucocitaria (proc. aut.)",0,{"$f":"IFERROR(VLOOKUP($A75,FILTRO.12!A67:K396,3,FALSE),0)","v":0},{"$f":"IFERROR(VLOOKUP($A75,FILTRO.12!A67:K396,4,FALSE),0)","v":0},{"$f":"IFERROR(VLOOKUP($A75,FILTRO.12!A67:K396,5,FALSE),0)","v":1}]
["80301070","0301070","Resistencia globular osmótica",0,{"$f":"IFERROR(VLOOKUP($A76,FILTRO.12!A68:K397,3,FALSE),0)","v":0},{"$f":"IFERROR(VLOOKUP($A76,FILTRO.12!A68:K397,4,FALSE),0)","v":0},{"$f":"IFERROR(VLOOKUP($A76,FILTRO.12!A68:K397,5,FALSE),0)","v":0}]
["80301071","0301071","Sacarosa, prueba de la",0,{"$f":"IFERROR(VLOOKUP($A77,FILTRO.12!A69:K398,3,FALSE),0)","v":0},{"$f":"IFERROR(VLOOKUP($A77,FILTRO.12!A69:K398,4,FALSE),0)","v":0},{"$f":"IFERROR(VLOOKUP($A77,FILTRO.12!A69:K398,5,FALSE),0)","v":0}]
["80301072","0301072","Sangría, tiempo de (Ivy) (no incluye dispositivo asociado )",0,{"$f":"IFERROR(VLOOKUP($A78,FILTRO.12!A70:K399,3,FALSE),0)","v":0},{"$f":"IFERROR(VLOOKUP($A78,FILTRO.12!A70:K399,4,FALSE),0)","v":0},{"$f":"IFERROR(VLOOKUP($A78,FILTRO.12!A70:K399,5,FALSE),0)","v":0}]
["80301074","0301074","Sobrevida del eritrocito (Cr 51 o similar)",{"$f":"SUM(E79:F79)","v":0},{"$f":"IFERROR(VLOOKUP($A79,FILTRO.12!A71:K400,3,FALSE),0)","v":0},{"$f":"IFERROR(VLOOKUP($A79,FILTRO.12!A71:K400,4,FALSE),0)","v":0},{"$f":"IFERROR(VLOOKUP($A79,FILTRO.12!A71:K400,5,FALSE),0)","v":0}]
["80301075","0301075","Subgrupo ABO y Rh fenotipo - genotipo Rh, c/u",32,{"$f":"IFERROR(VLOOKUP($A80,FILTRO.12!A72:K401,3,FALSE),0)","v":0},{"$f":"IFERROR(VLOOKUP($A80,FILTRO.12!A72:K401,4,FALSE),0)","v":32},{"$f":"IFERROR(VLOOKUP($A80,FILTRO.12!A72:K401,5,FALSE),0)","v":363}]
["80301076","0301076","Thorn, prueba de (no incluye ACTH)",0,{"$f":"IFERROR(VLOOKUP($A81,FILTRO.12!A73:K402,3,FALSE),0)","v":0},{"$f":"IFERROR(VLOOKUP($A81,FILTRO.12!A73:K402,4,FALSE),0)","v":0},{"$f":"IFERROR(VLOOKUP($A81,FILTRO.12!A73:K402,5,FALSE),0)","v":0}]
["80301077","0301077","Tinción de estearasa",0,{"$f":"IFERROR(VLOOKUP($A82,FILTRO.12!A74:K403,3,FALSE),0)","v":0},{"$f":"IFERROR(VLOOKUP($A82,FILTRO.12!A74:K403,4,FALSE),0)","v":0},{"$f":"IFERROR(VLOOKUP($A82,FILTRO.12!A74:K403,5,FALSE),0)","v":0}]
["80301078","0301078","Tinción de fosfatasas alcalinas o ácidas",0,{"$f":"IFERROR(VLOOKUP($A83,FILTRO.12!A75:K404,3,FALSE),0)","v":0},{"$f":"IFERROR(VLOOKUP($A83,FILTRO.12!A75:K404,4,FALSE),0)","v":0},{"$f":"IFERROR(VLOOKUP($A83,FILTRO.12!A75:K404,5,FALSE),0)","v":4}]
["80301079","0301079","Tinción de glicógeno o PAS",0,{"$f":"IFERROR(VLOOKUP($A84,FILTRO.12!A76:K405,3,FALSE),0)","v":0},{"$f":"IFERROR(VLOOKUP($A84,FILTRO.12!A76:K405,4,FALSE),0)","v":0},{"$f":"IFERROR(VLOOKUP($A84,FILTRO.12!A76:K405,5,FALSE),0)","v":0}]
["80301080","0301080","Tinción de lípidos",0,{"$f":"IFERROR(VLOOKUP($A85,FILTRO.12!A77:K406,3,FALSE),0)","v":0},{"$f":"IFERROR(VLOOKUP($A85,FILTRO.12!A77:K406,4,FALSE),0)","v":0},{"$f":"IFERROR(VLOOKUP($A85,FILTRO.12!A77:K406,5,FALSE),0)","v":0}]
["80301081","0301081","Tinción de peroxidasas",0,{"$f":"IFERROR(VLOOKUP($A86,FILTRO.12!A78:K407,3,FALSE),0)","v":0},{"$f":"IFERROR(VLOOKUP($A86,FILTRO.12!A78:K407,4,FALSE),0)","v":0},{"$f":"IFERROR(VLOOKUP($A86,FILTRO.12!A78:K407,5,FALSE),0)","v":0}]
["80301082","0301082","Transferrina",0,{"$f":"IFERROR(VLOOKUP($A87,FILTRO.12!A79:K408,3,FALSE),0)","v":0},{"$f":"IFERROR(VLOOKUP($A87,FILTRO.12!A79:K408,4,FALSE),0)","v":0},{"$f":"IFERROR(VLOOKUP($A87,FILTRO.12!A79:K408,5,FALSE),0)","v":0}]
["80301083","0301083","Trombina, tiempo de",3,{"$f":"IFERROR(VLOOKUP($A88,FILTRO.12!A80:K409,3,FALSE),0)","v":0},{"$f":"IFERROR(VLOOKUP($A88,FILTRO.12!A80:K409,4,FALSE),0)","v":3},{"$f":"IFERROR(VLOOKUP($A88,FILTRO.12!A80:K409,5,FALSE),0)","v":140}]
["80301085","0301085","Tromboplastina, tiempo parcial de (TTPA, TTPK o similares)",{"v":1010,"d":"1,010"},{"$f":"IFERROR(VLOOKUP($A89,FILTRO.12!A81:K410,3,FALSE),0)","v":0},{"$f":"IFERROR(VLOOKUP($A89,FILTRO.12!A81:K410,4,FALSE),0)","v":{"v":1010,"d":"1,010"}},{"$f":"IFERROR(VLOOKUP($A89,FILTRO.12!A81:K410,5,FALSE),0)","v":{"v":1799,"d":"1,799"}}]
["80301086","0301086","Velocidad de eritrosedimentación (proc. aut.)",175,{"$f":"IFERROR(VLOOKUP($A90,FILTRO.12!A82:K411,3,FALSE),0)","v":0},{"$f":"IFERROR(VLOOKUP($A90,FILTRO.12!A82:K411,4,FALSE),0)","v":175},{"$f":"IFERROR(VLOOKUP($A90,FILTRO.12!A82:K411,5,FALSE),0)","v":{"v":1440,"d":"1,440"}}]
["80301087","0301087","Vitamina B12, absorción de (Co 57 o similar)",467,{"$f":"IFERROR(VLOOKUP($A91,FILTRO.12!A83:K412,3,FALSE),0)","v":0},{"$f":"IFERROR(VLOOKUP($A91,FILTRO.12!A83:K412,4,FALSE),0)","v":467},{"$f":"IFERROR(VLOOKUP($A91,FILTRO.12!A83:K412,5,FALSE),0)","v":{"v":4060,"d":"4,060"}}]
["80301088","0301088","Volemia (incluye volumen globular total, volumen plasmático total y volumen sanguíneo total)",0,{"$f":"IFERROR(VLOOKUP($A92,FILTRO.12!A84:K413,3,FALSE),0)","v":0},{"$f":"IFERROR(VLOOKUP($A92,FILTRO.12!A84:K413,4,FALSE),0)","v":0},{"$f":"IFERROR(VLOOKUP($A92,FILTRO.12!A84:K413,5,FALSE),0)","v":2}]
["80301089","0301089","Von Willebrand, Ag de (factor VIII Ag.)",0,{"$f":"IFERROR(VLOOKUP($A93,FILTRO.12!A85:K414,3,FALSE),0)","v":0},{"$f":"IFERROR(VLOOKUP($A93,FILTRO.12!A85:K414,4,FALSE),0)","v":0},{"$f":"IFERROR(VLOOKUP($A93,FILTRO.12!A85:K414,5,FALSE),0)","v":0}]
["80301090","0301090","Cofactor de Ristocetina",0,{"$f":"IFERROR(VLOOKUP($A94,FILTRO.12!A86:K415,3,FALSE),0)","v":0},{"$f":"IFERROR(VLOOKUP($A94,FILTRO.12!A86:K415,4,FALSE),0)","v":0},{"$f":"IFERROR(VLOOKUP($A94,FILTRO.12!A86:K415,5,FALSE),0)","v":0}]
["80301091","0301091","Proteína C",0,{"$f":"IFERROR(VLOOKUP($A95,FILTRO.12!A87:K416,3,FALSE),0)","v":0},{"$f":"IFERROR(VLOOKUP($A95,FILTRO.12!A87:K416,4,FALSE),0)","v":0},{"$f":"IFERROR(VLOOKUP($A95,FILTRO.12!A87:K416,5,FALSE),0)","v":1}]
["80301092","0301092","Proteína S",0,{"$f":"IFERROR(VLOOKUP($A96,FILTRO.12!A88:K417,3,FALSE),0)","v":0},{"$f":"IFERROR(VLOOKUP($A96,FILTRO.12!A88:K417,4,FALSE),0)","v":0},{"$f":"IFERROR(VLOOKUP($A96,FILTRO.12!A88:K417,5,FALSE),0)","v":0}]
["80301093","0301093","Resistencia Proteína C",0,{"$f":"IFERROR(VLOOKUP($A97,FILTRO.12!A89:K418,3,FALSE),0)","v":0},{"$f":"IFERROR(VLOOKUP($A97,FILTRO.12!A89:K418,4,FALSE),0)","v":0},{"$f":"IFERROR(VLOOKUP($A97,FILTRO.12!A89:K418,5,FALSE),0)","v":0}]
[null,"TOTAL",null,{"$f":"SUM(D13:D97)","v":{"v":93537,"d":"93,537"}},{"$f":"SUM(E13:E97)","v":0},{"$f":"SUM(F13:F97)","v":{"v":93537,"d":"93,537"}},{"$f":"SUM(G13:G97)","v":{"v":222775,"d":"222,775"}}]
[]
[null,"SANGRE BIOQUÍMICO"]
["80302001","0302001","Acetona cualitativa",{"$f":"SUM(E101:F101)","v":0},{"$f":"IFERROR(VLOOKUP($A101,FILTRO.12!A5:K334,3,FALSE),0)","v":0},{"$f":"IFERROR(VLOOKUP($A101,FILTRO.12!A5:K334,4,FALSE),0)","v":0},{"$f":"IFERROR(VLOOKUP($A101,FILTRO.12!A5:K334,5,FALSE),0)","v":0}]
["80302002","0302002","Acido cítrico",{"$f":"SUM(E102:F102)","v":0},{"$f":"IFERROR(VLOOKUP($A102,FILTRO.12!A6:K335,3,FALSE),0)","v":0},{"$f":"IFERROR(VLOOKUP($A102,FILTRO.12!A6:K335,4,FALSE),0)","v":0},{"$f":"IFERROR(VLOOKUP($A102,FILTRO.12!A6:K335,5,FALSE),0)","v":0}]
["80302004","0302004","Acido láctico",0,{"$f":"IFERROR(VLOOKUP($A103,FILTRO.12!A7:K336,3,FALSE),0)","v":0},{"$f":"IFERROR(VLOOKUP($A103,FILTRO.12!A7:K336,4,FALSE),0)","v":0},{"$f":"IFERROR(VLOOKUP($A103,FILTRO.12!A7:K336,5,FALSE),0)","v":4}]
["80302005","0302005","Acido úrico, en sangre",{"v":28331,"d":"28,331"},{"$f":"IFERROR(VLOOKUP($A104,FILTRO.12!A8:K337,3,FALSE),0)","v":0},{"$f":"IFERROR(VLOOKUP($A104,FILTRO.12!A8:K337,4,FALSE),0)","v":{"v":28331,"d":"28,331"}},{"$f":"IFERROR(VLOOKUP($A104,FILTRO.12!A8:K337,5,FALSE),0)","v":{"v":38916,"d":"38,916"}}]
["80302006","0302006","Alcohol etílico",30,{"$f":"IFERROR(VLOOKUP($A105,FILTRO.12!A9:K338,3,FALSE),0)","v":30},{"$f":"IFERROR(VLOOKUP($A105,FILTRO.12!A9:K338,4,FALSE),0)","v":0},{"$f":"IFERROR(VLOOKUP($A105,FILTRO.12!A9:K338,5,FALSE),0)","v":119}]
["80302007","0302007","Aldolasa",0,{"$f":"IFERROR(VLOOKUP($A106,FILTRO.12!A10:K339,3,FALSE),0)","v":0},{"$f":"IFERROR(VLOOKUP($A106,FILTRO.12!A10:K339,4,FALSE),0)","v":0},{"$f":"IFERROR(VLOOKUP($A106,FILTRO.12!A10:K339,5,FALSE),0)","v":0}]
["80302008","0302008","Amilasa, en sangre",0,{"$f":"IFERROR(VLOOKUP($A107,FILTRO.12!A11:K340,3,FALSE),0)","v":0},{"$f":"IFERROR(VLOOKUP($A107,FILTRO.12!A11:K340,4,FALSE),0)","v":0},{"$f":"IFERROR(VLOOKUP($A107,FILTRO.12!A11:K340,5,FALSE),0)","v":17}]
["80302009","0302009","Aminoácidos, cualitativo en sangre",0,{"$f":"IFERROR(VLOOKUP($A108,FILTRO.12!A12:K341,3,FALSE),0)","v":0},{"$f":"IFERROR(VLOOKUP($A108,FILTRO.12!A12:K341,4,FALSE),0)","v":0},{"$f":"IFERROR(VLOOKUP($A108,FILTRO.12!A12:K341,5,FALSE),0)","v":0}]
["80302010","0302010","Amonio",0,{"$f":"IFERROR(VLOOKUP($A109,FILTRO.12!A13:K342,3,FALSE),0)","v":0},{"$f":"IFERROR(VLOOKUP($A109,FILTRO.12!A13:K342,4,FALSE),0)","v":0},{"$f":"IFERROR(VLOOKUP($A109,FILTRO.12!A13:K342,5,FALSE),0)","v":0}]
["80302070","0302070","Apolipoproteínas (A1, B u otras)",{"$f":"SUM(E110:F110)","v":0},{"$f":"IFERROR(VLOOKUP($A110,FILTRO.12!A14:K343,3,FALSE),0)","v":0},{"$f":"IFERROR(VLOOKUP($A110,FILTRO.12!A14:K343,4,FALSE),0)","v":0},{"$f":"IFERROR(VLOOKUP($A110,FILTRO.12!A14:K343,5,FALSE),0)","v":0}]
["80302011","0302011","Bicarbonato (proc. aut.)",0,{"$f":"IFERROR(VLOOKUP($A111,FILTRO.12!A15:K344,3,FALSE),0)","v":0},{"$f":"IFERROR(VLOOKUP($A111,FILTRO.12!A15:K344,4,FALSE),0)","v":0},{"$f":"IFERROR(VLOOKUP($A111,FILTRO.12!A15:K344,5,FALSE),0)","v":0}]
["80302012","0302012","Bilirrubina total (proc. aut.)",{"$f":"SUM(E112:F112)","v":203},{"$f":"IFERROR(VLOOKUP($A112,FILTRO.12!A16:K345,3,FALSE),0)","v":0},{"$f":"IFERROR(VLOOKUP($A112,FILTRO.12!A16:K345,4,FALSE),0)","v":203},{"$f":"IFERROR(VLOOKUP($A112,FILTRO.12!A16:K345,5,FALSE),0)","v":811}]
["80302013","0302013","Bilirrubina total y conjugada",457,{"$f":"IFERROR(VLOOKUP($A113,FILTRO.12!A17:K346,3,FALSE),0)","v":0},{"$f":"IFERROR(VLOOKUP($A113,FILTRO.12!A17:K346,4,FALSE),0)","v":457},{"$f":"IFERROR(VLOOKUP($A113,FILTRO.12!A17:K346,5,FALSE),0)","v":{"v":8207,"d":"8,207"}}]
["80302014","0302014","Bromosulftaleína, prueba de (incluye medicamento y tomas de muestra)",0,{"$f":"IFERROR(VLOOKUP($A114,FILTRO.12!A18:K347,3,FALSE),0)","v":0},{"$f":"IFERROR(VLOOKUP($A114,FILTRO.12!A18:K347,4,FALSE),0)","v":0},{"$f":"IFERROR(VLOOKUP($A114,FILTRO.12!A18:K347,5,FALSE),0)","v":0}]
["80302015","0302015","Calcio en sangre",140,{"$f":"IFERROR(VLOOKUP($A115,FILTRO.12!A19:K348,3,FALSE),0)","v":0},{"$f":"IFERROR(VLOOKUP($A115,FILTRO.12!A19:K348,4,FALSE),0)","v":140},{"$f":"IFERROR(VLOOKUP($A115,FILTRO.12!A19:K348,5,FALSE),0)","v":{"v":1935,"d":"1,935"}}]
["80302016","0302016","Calcio iónico, incluye proteínas totales",0,{"$f":"IFERROR(VLOOKUP($A116,FILTRO.12!A20:K349,3,FALSE),0)","v":0},{"$f":"IFERROR(VLOOKUP($A116,FILTRO.12!A20:K349,4,FALSE),0)","v":0},{"$f":"IFERROR(VLOOKUP($A116,FILTRO.12!A20:K349,5,FALSE),0)","v":0}]
["80302017","0302017","Caroteno",0,{"$f":"IFERROR(VLOOKUP($A117,FILTRO.12!A21:K350,3,FALSE),0)","v":0},{"$f":"IFERROR(VLOOKUP($A117,FILTRO.12!A21:K350,4,FALSE),0)","v":0},{"$f":"IFERROR(VLOOKUP($A117,FILTRO.12!A21:K350,5,FALSE),0)","v":0}]
["80302018","0302018","Caroteno, prueba de sobrecarga de (incluye tomas de muestra)",0,{"$f":"IFERROR(VLOOKUP($A118,FILTRO.12!A22:K351,3,FALSE),0)","v":0},{"$f":"IFERROR(VLOOKUP($A118,FILTRO.12!A22:K351,4,FALSE),0)","v":0},{"$f":"IFERROR(VLOOKUP($A118,FILTRO.12!A22:K351,5,FALSE),0)","v":0}]
["80302019","0302019","Ceruloplasmina",0,{"$f":"IFERROR(VLOOKUP($A119,FILTRO.12!A23:K352,3,FALSE),0)","v":0},{"$f":"IFERROR(VLOOKUP($A119,FILTRO.12!A23:K352,4,FALSE),0)","v":0},{"$f":"IFERROR(VLOOKUP($A119,FILTRO.12!A23:K352,5,FALSE),0)","v":0}]
["80302020","0302020","Cobre",0,{"$f":"IFERROR(VLOOKUP($A120,FILTRO.12!A24:K353,3,FALSE),0)","v":0},{"$f":"IFERROR(VLOOKUP($A120,FILTRO.12!A24:K353,4,FALSE),0)","v":0},{"$f":"IFERROR(VLOOKUP($A120,FILTRO.12!A24:K353,5,FALSE),0)","v":32}]
["80302067","0302067","Colesterol total (proc. aut.)",{"v":4612,"d":"4,612"},{"$f":"IFERROR(VLOOKUP($A121,FILTRO.12!A25:K354,3,FALSE),0)","v":0},{"$f":"IFERROR(VLOOKUP($A121,FILTRO.12!A25:K354,4,FALSE),0)","v":{"v":4612,"d":"4,612"}},{"$f":"IFERROR(VLOOKUP($A121,FILTRO.12!A25:K354,5,FALSE),0)","v":{"v":61386,"d":"61,386"}}]
["80302068","0302068","Colesterol HDL (proc. aut.)",{"v":1509,"d":"1,509"},{"$f":"IFERROR(VLOOKUP($A122,FILTRO.12!A26:K355,3,FALSE),0)","v":0},{"$f":"IFERROR(VLOOKUP($A122,FILTRO.12!A26:K355,4,FALSE),0)","v":{"v":1509,"d":"1,509"}},{"$f":"IFERROR(VLOOKUP($A122,FILTRO.12!A26:K355,5,FALSE),0)","v":{"v":50980,"d":"50,980"}}]
["80302021","0302021","Colinesterasa en plasma o sangre total",0,{"$f":"IFERROR(VLOOKUP($A123,FILTRO.12!A27:K356,3,FALSE),0)","v":0},{"$f":"IFERROR(VLOOKUP($A123,FILTRO.12!A27:K356,4,FALSE),0)","v":0},{"$f":"IFERROR(VLOOKUP($A123,FILTRO.12!A27:K356,5,FALSE),0)","v":68}]
["80302022","0302022","Creatina",0,{"$f":"IFERROR(VLOOKUP($A124,FILTRO.12!A28:K357,3,FALSE),0)","v":0},{"$f":"IFERROR(VLOOKUP($A124,FILTRO.12!A28:K357,4,FALSE),0)","v":0},{"$f":"IFERROR(VLOOKUP($A124,FILTRO.12!A28:K357,5,FALSE),0)","v":{"v":5225,"d":"5,225"}}]
["80302023","0302023","Creatinina en sangre",{"v":45733,"d":"45,733"},{"$f":"IFERROR(VLOOKUP($A125,FILTRO.12!A29:K358,3,FALSE),0)","v":0},{"$f":"IFERROR(VLOOKUP($A125,FILTRO.12!A29:K358,4,FALSE),0)","v":{"v":45733,"d":"45,733"}},{"$f":"IFERROR(VLOOKUP($A125,FILTRO.12!A29:K358,5,FALSE),0)","v":{"v":97295,"d":"97,295"}}]
["80302024","0302024","Creatinina, depuración de (Clearence) (proc. aut.)",92,{"$f":"IFERROR(VLOOKUP($A126,FILTRO.12!A30:K359,3,FALSE),0)","v":0},{"$f":"IFERROR(VLOOKUP($A126,FILTRO.12!A30:K359,4,FALSE),0)","v":92},{"$f":"IFERROR(VLOOKUP($A126,FILTRO.12!A30:K359,5,FALSE),0)","v":316}]
["80302025","0302025","Creatinquinasa CK - MB  miocárdica",0,{"$f":"IFERROR(VLOOKUP($A127,FILTRO.12!A31:K360,3,FALSE),0)","v":0},{"$f":"IFERROR(VLOOKUP($A127,FILTRO.12!A31:K360,4,FALSE),0)","v":0},{"$f":"IFERROR(VLOOKUP($A127,FILTRO.12!A31:K360,5,FALSE),0)","v":10}]
["80302026","0302026","Creatinquinasa CK - total",6,{"$f":"IFERROR(VLOOKUP($A128,FILTRO.12!A32:K361,3,FALSE),0)","v":0},{"$f":"IFERROR(VLOOKUP($A128,FILTRO.12!A32:K361,4,FALSE),0)","v":6},{"$f":"IFERROR(VLOOKUP($A128,FILTRO.12!A32:K361,5,FALSE),0)","v":311}]
["80302028","0302028","Depuraciones (Clearance) exógenas de Hipurán, Rojo Congo, manitol e inulina, c/u (no incluye medicamento)",21,{"$f":"IFERROR(VLOOKUP($A129,FILTRO.12!A33:K362,3,FALSE),0)","v":0},{"$f":"IFERROR(VLOOKUP($A129,FILTRO.12!A33:K362,4,FALSE),0)","v":21},{"$f":"IFERROR(VLOOKUP($A129,FILTRO.12!A33:K362,5,FALSE),0)","v":0}]
["80302029","0302029","Deshidrogenasa hidroxibutírica (HBDH)",0,{"$f":"IFERROR(VLOOKUP($A130,FILTRO.12!A34:K363,3,FALSE),0)","v":0},{"$f":"IFERROR(VLOOKUP($A130,FILTRO.12!A34:K363,4,FALSE),0)","v":0},{"$f":"IFERROR(VLOOKUP($A130,FILTRO.12!A34:K363,5,FALSE),0)","v":0}]
["80302030","0302030","Deshidrogenasa láctica total (LDH)",78,{"$f":"IFERROR(VLOOKUP($A131,FILTRO.12!A35:K364,3,FALSE),0)","v":0},{"$f":"IFERROR(VLOOKUP($A131,FILTRO.12!A35:K364,4,FALSE),0)","v":78},{"$f":"IFERROR(VLOOKUP($A131,FILTRO.12!A35:K364,5,FALSE),0)","v":{"v":1454,"d":"1,454"}}]
["80302031","0302031","Deshidrogenasa láctica total (LDH), con separación de isoenzimas",0,{"$f":"IFERROR(VLOOKUP($A132,FILTRO.12!A36:K365,3,FALSE),0)","v":0},{"$f":"IFERROR(VLOOKUP($A132,FILTRO.12!A36:K365,4,FALSE),0)","v":0},{"$f":"IFERROR(VLOOKUP($A132,FILTRO.12!A36:K365,5,FALSE),0)","v":0}]
["80302032","0302032","Electrolitos plasmáticos (sodio, potasio, cloro) c/u",{"v":68255,"d":"68,255"},{"$f":"IFERROR(VLOOKUP($A133,FILTRO.12!A37:K366,3,FALSE),0)","v":0},{"$f":"IFERROR(VLOOKUP($A133,FILTRO.12!A37:K366,4,FALSE),0)","v":{"v":68255,"d":"68,255"}},{"$f":"IFERROR(VLOOKUP($A133,FILTRO.12!A37:K366,5,FALSE),0)","v":{"v":82122,"d":"82,122"}}]
["80302033","0302033","Enzima convertidora de angiotensina I",0,{"$f":"IFERROR(VLOOKUP($A134,FILTRO.12!A38:K367,3,FALSE),0)","v":0},{"$f":"IFERROR(VLOOKUP($A134,FILTRO.12!A38:K367,4,FALSE),0)","v":0},{"$f":"IFERROR(VLOOKUP($A134,FILTRO.12!A38:K367,5,FALSE),0)","v":12}]
["80302034","0302034","Perfil Lipídico (incluye: colesterol total, HDL, LDL, VLDL y triglicéridos) ",{"v":49828,"d":"49,828"},{"$f":"IFERROR(VLOOKUP($A135,FILTRO.12!A39:K368,3,FALSE),0)","v":0},{"$f":"IFERROR(VLOOKUP($A135,FILTRO.12!A39:K368,4,FALSE),0)","v":{"v":49828,"d":"49,828"}},{"$f":"IFERROR(VLOOKUP($A135,FILTRO.12!A39:K368,5,FALSE),0)","v":{"v":68680,"d":"68,680"}}]
["80302035","0302035","Fármacos y/o drogas; niveles plasmáticos de (alcohol, anorexígenos, antiarrítmicos, antibióticos, antidepresivos, antiepilépticos, antihistamínicos, antiinflamatorios y analgésicos, estimulantes respiratorios, tranquilizantes mayores y menores, etc.) c/u",2,{"$f":"IFERROR(VLOOKUP($A136,FILTRO.12!A40:K369,3,FALSE),0)","v":0},{"$f":"IFERROR(VLOOKUP($A136,FILTRO.12!A40:K369,4,FALSE),0)","v":2},{"$f":"IFERROR(VLOOKUP($A136,FILTRO.12!A40:K369,5,FALSE),0)","v":167}]
["80302036","0302036","Fenilalanina",0,{"$f":"IFERROR(VLOOKUP($A137,FILTRO.12!A41:K370,3,FALSE),0)","v":0},{"$f":"IFERROR(VLOOKUP($A137,FILTRO.12!A41:K370,4,FALSE),0)","v":0},{"$f":"IFERROR(VLOOKUP($A137,FILTRO.12!A41:K370,5,FALSE),0)","v":0}]
["80302037","0302037","Fosfatasas ácidas totales",0,{"$f":"IFERROR(VLOOKUP($A138,FILTRO.12!A42:K371,3,FALSE),0)","v":0},{"$f":"IFERROR(VLOOKUP($A138,FILTRO.12!A42:K371,4,FALSE),0)","v":0},{"$f":"IFERROR(VLOOKUP($A138,FILTRO.12!A42:K371,5,FALSE),0)","v":0}]
["80302038","0302038","Fosfatasas ácidas totales y fracción prostática",0,{"$f":"IFERROR(VLOOKUP($A139,FILTRO.12!A43:K372,3,FALSE),0)","v":0},{"$f":"IFERROR(VLOOKUP($A139,FILTRO.12!A43:K372,4,FALSE),0)","v":0},{"$f":"IFERROR(VLOOKUP($A139,FILTRO.12!A43:K372,5,FALSE),0)","v":92}]
["80302039","0302039","Fosfatasas alcalinas con separación de isoenzimas hepáticas, intestinales, óseas c/u",0,{"$f":"IFERROR(VLOOKUP($A140,FILTRO.12!A44:K373,3,FALSE),0)","v":0},{"$f":"IFERROR(VLOOKUP($A140,FILTRO.12!A44:K373,4,FALSE),0)","v":0},{"$f":"IFERROR(VLOOKUP($A140,FILTRO.12!A44:K373,5,FALSE),0)","v":0}]
["80302040","0302040","Fosfatasas alcalinas totales",440,{"$f":"IFERROR(VLOOKUP($A141,FILTRO.12!A45:K374,3,FALSE),0)","v":0},{"$f":"IFERROR(VLOOKUP($A141,FILTRO.12!A45:K374,4,FALSE),0)","v":440},{"$f":"IFERROR(VLOOKUP($A141,FILTRO.12!A45:K374,5,FALSE),0)","v":{"v":8060,"d":"8,060"}}]
["80302041","0302041","Fosfolípidos",0,{"$f":"IFERROR(VLOOKUP($A142,FILTRO.12!A46:K375,3,FALSE),0)","v":0},{"$f":"IFERROR(VLOOKUP($A142,FILTRO.12!A46:K375,4,FALSE),0)","v":0},{"$f":"IFERROR(VLOOKUP($A142,FILTRO.12!A46:K375,5,FALSE),0)","v":0}]
["80302042","0302042","Fósforo (fosfatos) en sangre",73,{"$f":"IFERROR(VLOOKUP($A143,FILTRO.12!A47:K376,3,FALSE),0)","v":0},{"$f":"IFERROR(VLOOKUP($A143,FILTRO.12!A47:K376,4,FALSE),0)","v":73},{"$f":"IFERROR(VLOOKUP($A143,FILTRO.12!A47:K376,5,FALSE),0)","v":{"v":1157,"d":"1,157"}}]
["80302043","0302043","Galactosa",0,{"$f":"IFERROR(VLOOKUP($A144,FILTRO.12!A48:K377,3,FALSE),0)","v":0},{"$f":"IFERROR(VLOOKUP($A144,FILTRO.12!A48:K377,4,FALSE),0)","v":0},{"$f":"IFERROR(VLOOKUP($A144,FILTRO.12!A48:K377,5,FALSE),0)","v":0}]
["80302044","0302044","Galactosa, curva de tolerancia, (mínimo cuatro determinaciones) (no incluye la galactosa que se administra) (incluye los valores de todas las tomas de muestras necesarias)",0,{"$f":"IFERROR(VLOOKUP($A145,FILTRO.12!A49:K378,3,FALSE),0)","v":0},{"$f":"IFERROR(VLOOKUP($A145,FILTRO.12!A49:K378,4,FALSE),0)","v":0},{"$f":"IFERROR(VLOOKUP($A145,FILTRO.12!A49:K378,5,FALSE),0)","v":50}]
["80302045","0302045","Gamma glutamiltranspeptidasa (GGT)",50,{"$f":"IFERROR(VLOOKUP($A146,FILTRO.12!A50:K379,3,FALSE),0)","v":0},{"$f":"IFERROR(VLOOKUP($A146,FILTRO.12!A50:K379,4,FALSE),0)","v":50},{"$f":"IFERROR(VLOOKUP($A146,FILTRO.12!A50:K379,5,FALSE),0)","v":{"v":2596,"d":"2,596"}}]
["80302046","0302046","Gases y equilibrio ácido base en sangre (incluye: pH, O2, CO2, exceso de base y bicarbonato), todos o cada uno de los parámetros",0,{"$f":"IFERROR(VLOOKUP($A147,FILTRO.12!A51:K380,3,FALSE),0)","v":0},{"$f":"IFERROR(VLOOKUP($A147,FILTRO.12!A51:K380,4,FALSE),0)","v":0},{"$f":"IFERROR(VLOOKUP($A147,FILTRO.12!A51:K380,5,FALSE),0)","v":0}]
["80302047","0302047","Glucosa en sangre",{"v":60280,"d":"60,280"},{"$f":"IFERROR(VLOOKUP($A148,FILTRO.12!A52:K381,3,FALSE),0)","v":447},{"$f":"IFERROR(VLOOKUP($A148,FILTRO.12!A52:K381,4,FALSE),0)","v":{"v":59833,"d":"59,833"}},{"$f":"IFERROR(VLOOKUP($A148,FILTRO.12!A52:K381,5,FALSE),0)","v":{"v":127506,"d":"127,506"}}]
["80302048","0302048","Glucosa, Prueba de Tolerancia a la Glucosa Oral (PTGO), (dos determinaciones) (no incluye la glucosa que se administra) (incluye el valor de las dos tomas de muestras)",{"v":4385,"d":"4,385"},{"$f":"IFERROR(VLOOKUP($A149,FILTRO.12!A53:K382,3,FALSE),0)","v":0},{"$f":"IFERROR(VLOOKUP($A149,FILTRO.12!A53:K382,4,FALSE),0)","v":{"v":4385,"d":"4,385"}},{"$f":"IFERROR(VLOOKUP($A149,FILTRO.12!A53:K382,5,FALSE),0)","v":{"v":11573,"d":"11,573"}}]
["80302050","0302050","Adenosindeaminasa en sangre u otro fluído biológico.",0,{"$f":"IFERROR(VLOOKUP($A150,FILTRO.12!A54:K383,3,FALSE),0)","v":0},{"$f":"IFERROR(VLOOKUP($A150,FILTRO.12!A54:K383,4,FALSE),0)","v":0},{"$f":"IFERROR(VLOOKUP($A150,FILTRO.12!A54:K383,5,FALSE),0)","v":103}]
["80302051","0302051","Lactosa, curva de tolerancia, (mínimo cuatro determinaciones) (no incluye la lactosa que se administra) (incluye los valores de todas las tomas de muestras necesarias)",0,{"$f":"IFERROR(VLOOKUP($A151,FILTRO.12!A55:K384,3,FALSE),0)","v":0},{"$f":"IFERROR(VLOOKUP($A151,FILTRO.12!A55:K384,4,FALSE),0)","v":0},{"$f":"IFERROR(VLOOKUP($A151,FILTRO.12!A55:K384,5,FALSE),0)","v":38}]
["80302052","0302052","Leucinaminopeptidasa (LAP)",0,{"$f":"IFERROR(VLOOKUP($A152,FILTRO.12!A56:K385,3,FALSE),0)","v":0},{"$f":"IFERROR(VLOOKUP($A152,FILTRO.12!A56:K385,4,FALSE),0)","v":0},{"$f":"IFERROR(VLOOKUP($A152,FILTRO.12!A56:K385,5,FALSE),0)","v":0}]
["80302053","0302053","Lipasa",0,{"$f":"IFERROR(VLOOKUP($A153,FILTRO.12!A57:K386,3,FALSE),0)","v":0},{"$f":"IFERROR(VLOOKUP($A153,FILTRO.12!A57:K386,4,FALSE),0)","v":0},{"$f":"IFERROR(VLOOKUP($A153,FILTRO.12!A57:K386,5,FALSE),0)","v":7}]
["80302069","0302069","Lípidos totales (proc. aut.)",0,{"$f":"IFERROR(VLOOKUP($A154,FILTRO.12!A58:K387,3,FALSE),0)","v":0},{"$f":"IFERROR(VLOOKUP($A154,FILTRO.12!A58:K387,4,FALSE),0)","v":0},{"$f":"IFERROR(VLOOKUP($A154,FILTRO.12!A58:K387,5,FALSE),0)","v":{"v":5414,"d":"5,414"}}]
["80302054","0302054","Lipoproteínas, electroforesis de (incluye lípidos totales)",0,{"$f":"IFERROR(VLOOKUP($A155,FILTRO.12!A59:K388,3,FALSE),0)","v":0},{"$f":"IFERROR(VLOOKUP($A155,FILTRO.12!A59:K388,4,FALSE),0)","v":0},{"$f":"IFERROR(VLOOKUP($A155,FILTRO.12!A59:K388,5,FALSE),0)","v":58}]
["80302055","0302055","Litio",0,{"$f":"IFERROR(VLOOKUP($A156,FILTRO.12!A60:K389,3,FALSE),0)","v":0},{"$f":"IFERROR(VLOOKUP($A156,FILTRO.12!A60:K389,4,FALSE),0)","v":0},{"$f":"IFERROR(VLOOKUP($A156,FILTRO.12!A60:K389,5,FALSE),0)","v":0}]
["80302056","0302056","Magnesio",0,{"$f":"IFERROR(VLOOKUP($A157,FILTRO.12!A61:K390,3,FALSE),0)","v":0},{"$f":"IFERROR(VLOOKUP($A157,FILTRO.12!A61:K390,4,FALSE),0)","v":0},{"$f":"IFERROR(VLOOKUP($A157,FILTRO.12!A61:K390,5,FALSE),0)","v":0}]
["80302057","0302057","Nitrógeno ureico y/o úrea en sangre",{"v":26894,"d":"26,894"},{"$f":"IFERROR(VLOOKUP($A158,FILTRO.12!A62:K391,3,FALSE),0)","v":0},{"$f":"IFERROR(VLOOKUP($A158,FILTRO.12!A62:K391,4,FALSE),0)","v":{"v":26894,"d":"26,894"}},{"$f":"IFERROR(VLOOKUP($A158,FILTRO.12!A62:K391,5,FALSE),0)","v":{"v":43452,"d":"43,452"}}]
["80302058","0302058","Osmolalidad en sangre",1,{"$f":"IFERROR(VLOOKUP($A159,FILTRO.12!A63:K392,3,FALSE),0)","v":0},{"$f":"IFERROR(VLOOKUP($A159,FILTRO.12!A63:K392,4,FALSE),0)","v":1},{"$f":"IFERROR(VLOOKUP($A159,FILTRO.12!A63:K392,5,FALSE),0)","v":1}]
["80302075","0302075","Perfil bioquímico (determinación automatizada de 12 parámetros)",65,{"$f":"IFERROR(VLOOKUP($A160,FILTRO.12!A64:K393,3,FALSE),0)","v":0},{"$f":"IFERROR(VLOOKUP($A160,FILTRO.12!A64:K393,4,FALSE),0)","v":65},{"$f":"IFERROR(VLOOKUP($A160,FILTRO.12!A64:K393,5,FALSE),0)","v":{"v":1701,"d":"1,701"}}]
["80302059","0302059","Proteínas fraccionadas albúmina/globulina (incluye código 03-02-060)",{"v":1394,"d":"1,394"},{"$f":"IFERROR(VLOOKUP($A161,FILTRO.12!A65:K394,3,FALSE),0)","v":0},{"$f":"IFERROR(VLOOKUP($A161,FILTRO.12!A65:K394,4,FALSE),0)","v":{"v":1394,"d":"1,394"}},{"$f":"IFERROR(VLOOKUP($A161,FILTRO.12!A65:K394,5,FALSE),0)","v":0}]
["80302060","0302060","Proteínas totales o albúminas, c/u en sangre",{"v":1274,"d":"1,274"},{"$f":"IFERROR(VLOOKUP($A162,FILTRO.12!A66:K395,3,FALSE),0)","v":0},{"$f":"IFERROR(VLOOKUP($A162,FILTRO.12!A66:K395,4,FALSE),0)","v":{"v":1274,"d":"1,274"}},{"$f":"IFERROR(VLOOKUP($A162,FILTRO.12!A66:K395,5,FALSE),0)","v":{"v":4237,"d":"4,237"}}]
["80302061","0302061","Proteínas, electroforesis (incluye cód. 03-02-060)",0,{"$f":"IFERROR(VLOOKUP($A163,FILTRO.12!A67:K396,3,FALSE),0)","v":0},{"$f":"IFERROR(VLOOKUP($A163,FILTRO.12!A67:K396,4,FALSE),0)","v":0},{"$f":"IFERROR(VLOOKUP($A163,FILTRO.12!A67:K396,5,FALSE),0)","v":0}]
["80302062","0302062","Salicilemia cuantitativa        ",0,{"$f":"IFERROR(VLOOKUP($A164,FILTRO.12!A68:K397,3,FALSE),0)","v":0},{"$f":"IFERROR(VLOOKUP($A164,FILTRO.12!A68:K397,4,FALSE),0)","v":0},{"$f":"IFERROR(VLOOKUP($A164,FILTRO.12!A68:K397,5,FALSE),0)","v":0}]
["80302076","0302076","Perfil Hepático (incluye tiempo de protrombina, bilirrubina total y conjugada, fosfatasas alcalinas totales, GGT, transaminasas GOT/AST y GPT/ALT)",{"v":25355,"d":"25,355"},{"$f":"IFERROR(VLOOKUP($A165,FILTRO.12!A69:K398,3,FALSE),0)","v":0},{"$f":"IFERROR(VLOOKUP($A165,FILTRO.12!A69:K398,4,FALSE),0)","v":{"v":25355,"d":"25,355"}},{"$f":"IFERROR(VLOOKUP($A165,FILTRO.12!A69:K398,5,FALSE),0)","v":{"v":24635,"d":"24,635"}}]
["80302063","0302063","Transaminasas, oxalacética (GOT/AST), Pirúvica (GPT/ALT), c/u",{"$f":"SUM(E166:F166)","v":749},{"$f":"IFERROR(VLOOKUP($A166,FILTRO.12!A70:K399,3,FALSE),0)","v":0},{"$f":"IFERROR(VLOOKUP($A166,FILTRO.12!A70:K399,4,FALSE),0)","v":749},{"$f":"IFERROR(VLOOKUP($A166,FILTRO.12!A70:K399,5,FALSE),0)","v":{"v":20518,"d":"20,518"}}]
["80302064","0302064","Triglicéridos (proc. aut.)",{"v":2745,"d":"2,745"},{"$f":"IFERROR(VLOOKUP($A167,FILTRO.12!A71:K400,3,FALSE),0)","v":0},{"$f":"IFERROR(VLOOKUP($A167,FILTRO.12!A71:K400,4,FALSE),0)","v":{"v":2745,"d":"2,745"}},{"$f":"IFERROR(VLOOKUP($A167,FILTRO.12!A71:K400,5,FALSE),0)","v":{"v":54344,"d":"54,344"}}]
["80302065","0302065","Vitaminas A, B, C, D, E, etc., c/u",0,{"$f":"IFERROR(VLOOKUP($A168,FILTRO.12!A72:K401,3,FALSE),0)","v":0},{"$f":"IFERROR(VLOOKUP($A168,FILTRO.12!A72:K401,4,FALSE),0)","v":0},{"$f":"IFERROR(VLOOKUP($A168,FILTRO.12!A72:K401,5,FALSE),0)","v":124}]
["80302066","0302066","Xilosa, prueba de absorción (no incluye la xilosa que se administra)",0,{"$f":"IFERROR(VLOOKUP($A169,FILTRO.12!A73:K402,3,FALSE),0)","v":0},{"$f":"IFERROR(VLOOKUP($A169,FILTRO.12!A73:K402,4,FALSE),0)","v":0},{"$f":"IFERROR(VLOOKUP($A169,FILTRO.12!A73:K402,5,FALSE),0)","v":0}]
[null,"TOTAL",null,{"$f":"SUM(D101:D169)","v":{"v":323002,"d":"323,002"}},{"$f":"SUM(E101:E169)","v":477},{"$f":"SUM(F101:F169)","v":{"v":322525,"d":"322,525"}},{"$f":"SUM(G101:G169)","v":{"v":723733,"d":"723,733"}}]
[]
[null," EXÁMENES HORMONALES"]
["80303015","0303015","Hormona folículo estimulante (FSH)",{"$f":"SUM(E173:F173)","v":2},{"$f":"IFERROR(VLOOKUP($A173,FILTRO.12!A5:K334,3,FALSE),0)","v":0},{"$f":"IFERROR(VLOOKUP($A173,FILTRO.12!A5:K334,4,FALSE),0)","v":2},{"$f":"IFERROR(VLOOKUP($A173,FILTRO.12!A5:K334,5,FALSE),0)","v":{"v":1230,"d":"1,230"}}]
["80303024","0303024","Tiroestimulante (TSH), hormona (adulto, niño o R.N.)                            ",{"$f":"SUM(E174:F174)","v":{"v":35829,"d":"35,829"}},{"$f":"IFERROR(VLOOKUP($A174,FILTRO.12!A6:K335,3,FALSE),0)","v":0},{"$f":"IFERROR(VLOOKUP($A174,FILTRO.12!A6:K335,4,FALSE),0)","v":{"v":35829,"d":"35,829"}},{"$f":"IFERROR(VLOOKUP($A174,FILTRO.12!A6:K335,5,FALSE),0)","v":{"v":84098,"d":"84,098"}}]
["80303025","0303025","Tiroglobulina                                                                                   ",0,{"$f":"IFERROR(VLOOKUP($A175,FILTRO.12!A7:K336,3,FALSE),0)","v":0},{"$f":"IFERROR(VLOOKUP($A175,FILTRO.12!A7:K336,4,FALSE),0)","v":0},{"$f":"IFERROR(VLOOKUP($A175,FILTRO.12!A7:K336,5,FALSE),0)","v":17}]
["80303026","0303026","Tiroxina libre (T4L)                                                                       ",{"v":26930,"d":"26,930"},{"$f":"IFERROR(VLOOKUP($A176,FILTRO.12!A8:K337,3,FALSE),0)","v":0},{"$f":"IFERROR(VLOOKUP($A176,FILTRO.12!A8:K337,4,FALSE),0)","v":{"v":26930,"d":"26,930"}},{"$f":"IFERROR(VLOOKUP($A176,FILTRO.12!A8:K337,5,FALSE),0)","v":{"v":29718,"d":"29,718"}}]
["80303027","0303027","Tiroxina o tetrayodotironina (T4)                                               ",451,{"$f":"IFERROR(VLOOKUP($A177,FILTRO.12!A9:K338,3,FALSE),0)","v":0},{"$f":"IFERROR(VLOOKUP($A177,FILTRO.12!A9:K338,4,FALSE),0)","v":451},{"$f":"IFERROR(VLOOKUP($A177,FILTRO.12!A9:K338,5,FALSE),0)","v":81}]
["80303028","0303028","Triyodotironina (T3)                                                               ",360,{"$f":"IFERROR(VLOOKUP($A178,FILTRO.12!A10:K339,3,FALSE),0)","v":0},{"$f":"IFERROR(VLOOKUP($A178,FILTRO.12!A10:K339,4,FALSE),0)","v":360},{"$f":"IFERROR(VLOOKUP($A178,FILTRO.12!A10:K339,5,FALSE),0)","v":37}]
[null,"TOTAL",null,{"$f":"SUM(D173:D178)","v":{"v":63572,"d":"63,572"}},{"$f":"SUM(E173:E178)","v":0},{"$f":"SUM(F173:F178)","v":{"v":63572,"d":"63,572"}},{"$f":"SUM(G173:G178)","v":{"v":115181,"d":"115,181"}}]
[]
[null,"INMUNOLÓGICOS"]
["80305001","0305001","Alfa -1- antitripsina cuantitativa",{"$f":"SUM(E182:F182)","v":0},{"$f":"IFERROR(VLOOKUP($A182,FILTRO.12!A5:K334,3,FALSE),0)","v":0},{"$f":"IFERROR(VLOOKUP($A182,FILTRO.12!A5:K334,4,FALSE),0)","v":0},{"$f":"IFERROR(VLOOKUP($A182,FILTRO.12!A5:K334,5,FALSE),0)","v":0}]
["80305002","0305002","Alfa -2- macroglobulina",{"$f":"SUM(E183:F183)","v":0},{"$f":"IFERROR(VLOOKUP($A183,FILTRO.12!A6:K335,3,FALSE),0)","v":0},{"$f":"IFERROR(VLOOKUP($A183,FILTRO.12!A6:K335,4,FALSE),0)","v":0},{"$f":"IFERROR(VLOOKUP($A183,FILTRO.12!A6:K335,5,FALSE),0)","v":0}]
["80305003","0305003","Alfa fetoproteínas",0,{"$f":"IFERROR(VLOOKUP($A184,FILTRO.12!A7:K336,3,FALSE),0)","v":0},{"$f":"IFERROR(VLOOKUP($A184,FILTRO.12!A7:K336,4,FALSE),0)","v":0},{"$f":"IFERROR(VLOOKUP($A184,FILTRO.12!A7:K336,5,FALSE),0)","v":1}]
["80305004","0305004","Tamizaje de Anticuerpos anti antígenos nucleares extractables (a- ENA: Sm, RNP, Ro, La, Scl- 70 y Jo- 1)",0,{"$f":"IFERROR(VLOOKUP($A185,FILTRO.12!A8:K337,3,FALSE),0)","v":0},{"$f":"IFERROR(VLOOKUP($A185,FILTRO.12!A8:K337,4,FALSE),0)","v":0},{"$f":"IFERROR(VLOOKUP($A185,FILTRO.12!A8:K337,5,FALSE),0)","v":5}]
["80305005","0305005","Anticuerpos antinucleares (ANA), antimitocondriales, anti DNA (ADNA), anti músculo liso, anticentrómero, u otros, c/u.",0,{"$f":"IFERROR(VLOOKUP($A186,FILTRO.12!A9:K338,3,FALSE),0)","v":0},{"$f":"IFERROR(VLOOKUP($A186,FILTRO.12!A9:K338,4,FALSE),0)","v":0},{"$f":"IFERROR(VLOOKUP($A186,FILTRO.12!A9:K338,5,FALSE),0)","v":{"v":2046,"d":"2,046"}}]
["80305006","0305006","Anticuerpos atípicos, pannel de identificación",0,{"$f":"IFERROR(VLOOKUP($A187,FILTRO.12!A10:K339,3,FALSE),0)","v":0},{"$f":"IFERROR(VLOOKUP($A187,FILTRO.12!A10:K339,4,FALSE),0)","v":0},{"$f":"IFERROR(VLOOKUP($A187,FILTRO.12!A10:K339,5,FALSE),0)","v":0}]
["80305007","0305007","Anticuerpos específicos y otros autoanticuerpos (anticuerpos antitiroídeos: anticuerpos antimicrosomales y antitiroglobulinas y otros anticuerpos: prostático, espermios, etc.) c/u",0,{"$f":"IFERROR(VLOOKUP($A188,FILTRO.12!A11:K340,3,FALSE),0)","v":0},{"$f":"IFERROR(VLOOKUP($A188,FILTRO.12!A11:K340,4,FALSE),0)","v":0},{"$f":"IFERROR(VLOOKUP($A188,FILTRO.12!A11:K340,5,FALSE),0)","v":2}]
["80305008","0305008","Antiestreptolisina O, por técnica de látex ",0,{"$f":"IFERROR(VLOOKUP($A189,FILTRO.12!A12:K341,3,FALSE),0)","v":0},{"$f":"IFERROR(VLOOKUP($A189,FILTRO.12!A12:K341,4,FALSE),0)","v":0},{"$f":"IFERROR(VLOOKUP($A189,FILTRO.12!A12:K341,5,FALSE),0)","v":0}]
["80305009","0305009","Antígeno carcinoembrionario (CEA)",0,{"$f":"IFERROR(VLOOKUP($A190,FILTRO.12!A13:K342,3,FALSE),0)","v":0},{"$f":"IFERROR(VLOOKUP($A190,FILTRO.12!A13:K342,4,FALSE),0)","v":0},{"$f":"IFERROR(VLOOKUP($A190,FILTRO.12!A13:K342,5,FALSE),0)","v":2}]
["80305070","0305070","Antígeno prostático específico",{"v":1892,"d":"1,892"},{"$f":"IFERROR(VLOOKUP($A191,FILTRO.12!A14:K343,3,FALSE),0)","v":0},{"$f":"IFERROR(VLOOKUP($A191,FILTRO.12!A14:K343,4,FALSE),0)","v":{"v":1892,"d":"1,892"}},{"$f":"IFERROR(VLOOKUP($A191,FILTRO.12!A14:K343,5,FALSE),0)","v":{"v":8103,"d":"8,103"}}]
["80305170","0305170","Antígeno Ca 125, Ca 15-3 y Ca 19-9, c/u",0,{"$f":"IFERROR(VLOOKUP($A192,FILTRO.12!A15:K344,3,FALSE),0)","v":0},{"$f":"IFERROR(VLOOKUP($A192,FILTRO.12!A15:K344,4,FALSE),0)","v":0},{"$f":"IFERROR(VLOOKUP($A192,FILTRO.12!A15:K344,5,FALSE),0)","v":12}]
["80305010","0305010","Beta-2-microglobulina",0,{"$f":"IFERROR(VLOOKUP($A193,FILTRO.12!A16:K345,3,FALSE),0)","v":0},{"$f":"IFERROR(VLOOKUP($A193,FILTRO.12!A16:K345,4,FALSE),0)","v":0},{"$f":"IFERROR(VLOOKUP($A193,FILTRO.12!A16:K345,5,FALSE),0)","v":0}]
["80305011","0305011","Complejos inmunes circulantes",0,{"$f":"IFERROR(VLOOKUP($A194,FILTRO.12!A17:K346,3,FALSE),0)","v":0},{"$f":"IFERROR(VLOOKUP($A194,FILTRO.12!A17:K346,4,FALSE),0)","v":0},{"$f":"IFERROR(VLOOKUP($A194,FILTRO.12!A17:K346,5,FALSE),0)","v":0}]
["80305012","0305012","Complemento C1Q, C2, C3, C4, etc., c/u",0,{"$f":"IFERROR(VLOOKUP($A195,FILTRO.12!A18:K347,3,FALSE),0)","v":0},{"$f":"IFERROR(VLOOKUP($A195,FILTRO.12!A18:K347,4,FALSE),0)","v":0},{"$f":"IFERROR(VLOOKUP($A195,FILTRO.12!A18:K347,5,FALSE),0)","v":14}]
["80305013","0305013","Complemento hemolítico (CH 50)",0,{"$f":"IFERROR(VLOOKUP($A196,FILTRO.12!A19:K348,3,FALSE),0)","v":0},{"$f":"IFERROR(VLOOKUP($A196,FILTRO.12!A19:K348,4,FALSE),0)","v":0},{"$f":"IFERROR(VLOOKUP($A196,FILTRO.12!A19:K348,5,FALSE),0)","v":0}]
["80305014","0305014","Crioglobulinas, precipitación en frío (cualitativa) o cuantitativa c/u",0,{"$f":"IFERROR(VLOOKUP($A197,FILTRO.12!A20:K349,3,FALSE),0)","v":0},{"$f":"IFERROR(VLOOKUP($A197,FILTRO.12!A20:K349,4,FALSE),0)","v":0},{"$f":"IFERROR(VLOOKUP($A197,FILTRO.12!A20:K349,5,FALSE),0)","v":0}]
["80305015","0305015","Depósito de complejos inmunes por inmunofluorescencia",0,{"$f":"IFERROR(VLOOKUP($A198,FILTRO.12!A21:K350,3,FALSE),0)","v":0},{"$f":"IFERROR(VLOOKUP($A198,FILTRO.12!A21:K350,4,FALSE),0)","v":0},{"$f":"IFERROR(VLOOKUP($A198,FILTRO.12!A21:K350,5,FALSE),0)","v":0}]
["80305016","0305016","Depósito de complemento por inmunofluorescencia (C3, C4), c/u",0,{"$f":"IFERROR(VLOOKUP($A199,FILTRO.12!A22:K351,3,FALSE),0)","v":0},{"$f":"IFERROR(VLOOKUP($A199,FILTRO.12!A22:K351,4,FALSE),0)","v":0},{"$f":"IFERROR(VLOOKUP($A199,FILTRO.12!A22:K351,5,FALSE),0)","v":0}]
["80305017","0305017","Depósito de fibrinógeno por inmunofluorescencia",0,{"$f":"IFERROR(VLOOKUP($A200,FILTRO.12!A23:K352,3,FALSE),0)","v":0},{"$f":"IFERROR(VLOOKUP($A200,FILTRO.12!A23:K352,4,FALSE),0)","v":0},{"$f":"IFERROR(VLOOKUP($A200,FILTRO.12!A23:K352,5,FALSE),0)","v":0}]
["80305018","0305018","Depósito de inmunoglobulina por inmunofluorescencia (IgG, IgA, IgM) c/u",0,{"$f":"IFERROR(VLOOKUP($A201,FILTRO.12!A24:K353,3,FALSE),0)","v":0},{"$f":"IFERROR(VLOOKUP($A201,FILTRO.12!A24:K353,4,FALSE),0)","v":0},{"$f":"IFERROR(VLOOKUP($A201,FILTRO.12!A24:K353,5,FALSE),0)","v":1}]
["80305019","0305019","Factor reumatoídeo por técnica de látex u otras similares",{"v":1564,"d":"1,564"},{"$f":"IFERROR(VLOOKUP($A202,FILTRO.12!A25:K354,3,FALSE),0)","v":0},{"$f":"IFERROR(VLOOKUP($A202,FILTRO.12!A25:K354,4,FALSE),0)","v":{"v":1564,"d":"1,564"}},{"$f":"IFERROR(VLOOKUP($A202,FILTRO.12!A25:K354,5,FALSE),0)","v":{"v":3359,"d":"3,359"}}]
["80305020","0305020","Factor reumatoídeo por técnica Scat, Waaler Rose, nefelométricas y/o turbidimétricas",9,{"$f":"IFERROR(VLOOKUP($A203,FILTRO.12!A26:K355,3,FALSE),0)","v":0},{"$f":"IFERROR(VLOOKUP($A203,FILTRO.12!A26:K355,4,FALSE),0)","v":9},{"$f":"IFERROR(VLOOKUP($A203,FILTRO.12!A26:K355,5,FALSE),0)","v":418}]
["80305021","0305021","Inhibidor de C1Q, C2 y C3, c/u",0,{"$f":"IFERROR(VLOOKUP($A204,FILTRO.12!A27:K356,3,FALSE),0)","v":0},{"$f":"IFERROR(VLOOKUP($A204,FILTRO.12!A27:K356,4,FALSE),0)","v":0},{"$f":"IFERROR(VLOOKUP($A204,FILTRO.12!A27:K356,5,FALSE),0)","v":0}]
["80305025","0305025","Inmunofijación de inmunoglobulina, c/u",0,{"$f":"IFERROR(VLOOKUP($A205,FILTRO.12!A28:K357,3,FALSE),0)","v":0},{"$f":"IFERROR(VLOOKUP($A205,FILTRO.12!A28:K357,4,FALSE),0)","v":0},{"$f":"IFERROR(VLOOKUP($A205,FILTRO.12!A28:K357,5,FALSE),0)","v":0}]
["80305026","0305026","Inmunoglobulina IgA secretora",0,{"$f":"IFERROR(VLOOKUP($A206,FILTRO.12!A29:K358,3,FALSE),0)","v":0},{"$f":"IFERROR(VLOOKUP($A206,FILTRO.12!A29:K358,4,FALSE),0)","v":0},{"$f":"IFERROR(VLOOKUP($A206,FILTRO.12!A29:K358,5,FALSE),0)","v":0}]
["80305027","0305027","Inmunoglobulinas IgA, IgG, IgM, c/u",0,{"$f":"IFERROR(VLOOKUP($A207,FILTRO.12!A30:K359,3,FALSE),0)","v":0},{"$f":"IFERROR(VLOOKUP($A207,FILTRO.12!A30:K359,4,FALSE),0)","v":0},{"$f":"IFERROR(VLOOKUP($A207,FILTRO.12!A30:K359,5,FALSE),0)","v":12}]
["80305028","0305028","Inmunoglobulinas IgE, IgD total, c/u",0,{"$f":"IFERROR(VLOOKUP($A208,FILTRO.12!A31:K360,3,FALSE),0)","v":0},{"$f":"IFERROR(VLOOKUP($A208,FILTRO.12!A31:K360,4,FALSE),0)","v":0},{"$f":"IFERROR(VLOOKUP($A208,FILTRO.12!A31:K360,5,FALSE),0)","v":2}]
["80305029","0305029","Inmunoglobulinas IgE, IgG específicas, c/u",0,{"$f":"IFERROR(VLOOKUP($A209,FILTRO.12!A32:K361,3,FALSE),0)","v":0},{"$f":"IFERROR(VLOOKUP($A209,FILTRO.12!A32:K361,4,FALSE),0)","v":0},{"$f":"IFERROR(VLOOKUP($A209,FILTRO.12!A32:K361,5,FALSE),0)","v":4}]
["80305030","0305030","Proteína C reactiva por técnica de látex u otras similares",4,{"$f":"IFERROR(VLOOKUP($A210,FILTRO.12!A33:K362,3,FALSE),0)","v":0},{"$f":"IFERROR(VLOOKUP($A210,FILTRO.12!A33:K362,4,FALSE),0)","v":4},{"$f":"IFERROR(VLOOKUP($A210,FILTRO.12!A33:K362,5,FALSE),0)","v":196}]
["80305031","0305031","Proteína C reactiva por técnicas nefelométricas y/o turbidimétricas",0,{"$f":"IFERROR(VLOOKUP($A211,FILTRO.12!A34:K363,3,FALSE),0)","v":0},{"$f":"IFERROR(VLOOKUP($A211,FILTRO.12!A34:K363,4,FALSE),0)","v":0},{"$f":"IFERROR(VLOOKUP($A211,FILTRO.12!A34:K363,5,FALSE),0)","v":1}]
["80305034","0305034","Quimiotaxis-leucotaxis",0,{"$f":"IFERROR(VLOOKUP($A212,FILTRO.12!A35:K364,3,FALSE),0)","v":0},{"$f":"IFERROR(VLOOKUP($A212,FILTRO.12!A35:K364,4,FALSE),0)","v":0},{"$f":"IFERROR(VLOOKUP($A212,FILTRO.12!A35:K364,5,FALSE),0)","v":0}]
["80305035","0305035","Crioaglutininas",0,{"$f":"IFERROR(VLOOKUP($A213,FILTRO.12!A36:K365,3,FALSE),0)","v":0},{"$f":"IFERROR(VLOOKUP($A213,FILTRO.12!A36:K365,4,FALSE),0)","v":0},{"$f":"IFERROR(VLOOKUP($A213,FILTRO.12!A36:K365,5,FALSE),0)","v":0}]
["80305036","0305036","Criohemolisinas",0,{"$f":"IFERROR(VLOOKUP($A214,FILTRO.12!A37:K366,3,FALSE),0)","v":0},{"$f":"IFERROR(VLOOKUP($A214,FILTRO.12!A37:K366,4,FALSE),0)","v":0},{"$f":"IFERROR(VLOOKUP($A214,FILTRO.12!A37:K366,5,FALSE),0)","v":0}]
["80305037","0305037","Digestión fagocítica nitroblue-tetrazolium cualitativo y cuantitativo",0,{"$f":"IFERROR(VLOOKUP($A215,FILTRO.12!A38:K367,3,FALSE),0)","v":0},{"$f":"IFERROR(VLOOKUP($A215,FILTRO.12!A38:K367,4,FALSE),0)","v":0},{"$f":"IFERROR(VLOOKUP($A215,FILTRO.12!A38:K367,5,FALSE),0)","v":0}]
["80305038","0305038","Fagocitosis: ingestión y digestión (killing) de levaduras por polimorfonucleares",0,{"$f":"IFERROR(VLOOKUP($A216,FILTRO.12!A39:K368,3,FALSE),0)","v":0},{"$f":"IFERROR(VLOOKUP($A216,FILTRO.12!A39:K368,4,FALSE),0)","v":0},{"$f":"IFERROR(VLOOKUP($A216,FILTRO.12!A39:K368,5,FALSE),0)","v":0}]
["80305039","0305039","Fagocitosis: ingestión y digestión (killing) de bacterias por polimorfonucleares",0,{"$f":"IFERROR(VLOOKUP($A217,FILTRO.12!A40:K369,3,FALSE),0)","v":0},{"$f":"IFERROR(VLOOKUP($A217,FILTRO.12!A40:K369,4,FALSE),0)","v":0},{"$f":"IFERROR(VLOOKUP($A217,FILTRO.12!A40:K369,5,FALSE),0)","v":0}]
["80305040","0305040","Inmunoadherencia de leucocitos macrófagos",0,{"$f":"IFERROR(VLOOKUP($A218,FILTRO.12!A41:K370,3,FALSE),0)","v":0},{"$f":"IFERROR(VLOOKUP($A218,FILTRO.12!A41:K370,4,FALSE),0)","v":0},{"$f":"IFERROR(VLOOKUP($A218,FILTRO.12!A41:K370,5,FALSE),0)","v":0}]
["80305041","0305041","Intradermoreacción (PPD, histoplasmina, aspergilina, u otros, incluye el valor del antígeno y reacción de control), c/u. ",0,{"$f":"IFERROR(VLOOKUP($A219,FILTRO.12!A42:K371,3,FALSE),0)","v":0},{"$f":"IFERROR(VLOOKUP($A219,FILTRO.12!A42:K371,4,FALSE),0)","v":0},{"$f":"IFERROR(VLOOKUP($A219,FILTRO.12!A42:K371,5,FALSE),0)","v":0}]
["80305042","0305042","LIF o MIF",0,{"$f":"IFERROR(VLOOKUP($A220,FILTRO.12!A43:K372,3,FALSE),0)","v":0},{"$f":"IFERROR(VLOOKUP($A220,FILTRO.12!A43:K372,4,FALSE),0)","v":0},{"$f":"IFERROR(VLOOKUP($A220,FILTRO.12!A43:K372,5,FALSE),0)","v":0}]
["80305043","0305043","Linfocitos B (inmunofluorescencia)",0,{"$f":"IFERROR(VLOOKUP($A221,FILTRO.12!A44:K373,3,FALSE),0)","v":0},{"$f":"IFERROR(VLOOKUP($A221,FILTRO.12!A44:K373,4,FALSE),0)","v":0},{"$f":"IFERROR(VLOOKUP($A221,FILTRO.12!A44:K373,5,FALSE),0)","v":0}]
["80305044","0305044","Linfocitos B (rosetas EAC) y linfocitos T (rosetas E) c/u",0,{"$f":"IFERROR(VLOOKUP($A222,FILTRO.12!A45:K374,3,FALSE),0)","v":0},{"$f":"IFERROR(VLOOKUP($A222,FILTRO.12!A45:K374,4,FALSE),0)","v":0},{"$f":"IFERROR(VLOOKUP($A222,FILTRO.12!A45:K374,5,FALSE),0)","v":0}]
["80305045","0305045","Linfocitos T \"helper\" (OKT4) o supresores (OKT8) con antisuero monoclonal, c/u",0,{"$f":"IFERROR(VLOOKUP($A223,FILTRO.12!A46:K375,3,FALSE),0)","v":0},{"$f":"IFERROR(VLOOKUP($A223,FILTRO.12!A46:K375,4,FALSE),0)","v":0},{"$f":"IFERROR(VLOOKUP($A223,FILTRO.12!A46:K375,5,FALSE),0)","v":0}]
["80305047","0305047","Linfotoxinas humanas, detección de",0,{"$f":"IFERROR(VLOOKUP($A224,FILTRO.12!A47:K376,3,FALSE),0)","v":0},{"$f":"IFERROR(VLOOKUP($A224,FILTRO.12!A47:K376,4,FALSE),0)","v":0},{"$f":"IFERROR(VLOOKUP($A224,FILTRO.12!A47:K376,5,FALSE),0)","v":0}]
["80305048","0305048","Reacción cutánea 16 alergenos por escarificación (incluye el valor de los antígenos)",0,{"$f":"IFERROR(VLOOKUP($A225,FILTRO.12!A48:K377,3,FALSE),0)","v":0},{"$f":"IFERROR(VLOOKUP($A225,FILTRO.12!A48:K377,4,FALSE),0)","v":0},{"$f":"IFERROR(VLOOKUP($A225,FILTRO.12!A48:K377,5,FALSE),0)","v":0}]
["80305049","0305049","Transformación linfoblástica a drogas, análisis de transformación espontanea con estimulo inespecífico y con diferentes concentraciones de la droga en 1000 células",0,{"$f":"IFERROR(VLOOKUP($A226,FILTRO.12!A49:K378,3,FALSE),0)","v":0},{"$f":"IFERROR(VLOOKUP($A226,FILTRO.12!A49:K378,4,FALSE),0)","v":0},{"$f":"IFERROR(VLOOKUP($A226,FILTRO.12!A49:K378,5,FALSE),0)","v":0}]
["80305051","0305051","Absorción de autoanticuerpos del receptor",0,{"$f":"IFERROR(VLOOKUP($A227,FILTRO.12!A50:K379,3,FALSE),0)","v":0},{"$f":"IFERROR(VLOOKUP($A227,FILTRO.12!A50:K379,4,FALSE),0)","v":0},{"$f":"IFERROR(VLOOKUP($A227,FILTRO.12!A50:K379,5,FALSE),0)","v":0}]
["80305052","0305052","Anticuerpos linfocitotóxicos (PRA) por microlinfocitotoxicidad",0,{"$f":"IFERROR(VLOOKUP($A228,FILTRO.12!A51:K380,3,FALSE),0)","v":0},{"$f":"IFERROR(VLOOKUP($A228,FILTRO.12!A51:K380,4,FALSE),0)","v":0},{"$f":"IFERROR(VLOOKUP($A228,FILTRO.12!A51:K380,5,FALSE),0)","v":0}]
["80305053","0305053","Autocrossmatch con linfocitos T y B",0,{"$f":"IFERROR(VLOOKUP($A229,FILTRO.12!A52:K381,3,FALSE),0)","v":0},{"$f":"IFERROR(VLOOKUP($A229,FILTRO.12!A52:K381,4,FALSE),0)","v":0},{"$f":"IFERROR(VLOOKUP($A229,FILTRO.12!A52:K381,5,FALSE),0)","v":0}]
["80305054","0305054","Autocross match con linfocitos totales",0,{"$f":"IFERROR(VLOOKUP($A230,FILTRO.12!A53:K382,3,FALSE),0)","v":0},{"$f":"IFERROR(VLOOKUP($A230,FILTRO.12!A53:K382,4,FALSE),0)","v":0},{"$f":"IFERROR(VLOOKUP($A230,FILTRO.12!A53:K382,5,FALSE),0)","v":0}]
["80305056","0305056","Alocrossmatch con linfocitos totales",0,{"$f":"IFERROR(VLOOKUP($A231,FILTRO.12!A54:K383,3,FALSE),0)","v":0},{"$f":"IFERROR(VLOOKUP($A231,FILTRO.12!A54:K383,4,FALSE),0)","v":0},{"$f":"IFERROR(VLOOKUP($A231,FILTRO.12!A54:K383,5,FALSE),0)","v":0}]
["80305057","0305057","Alocrossmatch con linfocitos T y B",0,{"$f":"IFERROR(VLOOKUP($A232,FILTRO.12!A55:K384,3,FALSE),0)","v":0},{"$f":"IFERROR(VLOOKUP($A232,FILTRO.12!A55:K384,4,FALSE),0)","v":0},{"$f":"IFERROR(VLOOKUP($A232,FILTRO.12!A55:K384,5,FALSE),0)","v":0}]
["80305058","0305058","Cultivo mixto de linfocitos",0,{"$f":"IFERROR(VLOOKUP($A233,FILTRO.12!A56:K385,3,FALSE),0)","v":0},{"$f":"IFERROR(VLOOKUP($A233,FILTRO.12!A56:K385,4,FALSE),0)","v":0},{"$f":"IFERROR(VLOOKUP($A233,FILTRO.12!A56:K385,5,FALSE),0)","v":0}]
["80305059","0305059","Identificación de clase de inmunoglobulinas de auto o alo cross match positivo",0,{"$f":"IFERROR(VLOOKUP($A234,FILTRO.12!A57:K386,3,FALSE),0)","v":0},{"$f":"IFERROR(VLOOKUP($A234,FILTRO.12!A57:K386,4,FALSE),0)","v":0},{"$f":"IFERROR(VLOOKUP($A234,FILTRO.12!A57:K386,5,FALSE),0)","v":0}]
["80305060","0305060","Tipificación HLA B-27",0,{"$f":"IFERROR(VLOOKUP($A235,FILTRO.12!A58:K387,3,FALSE),0)","v":0},{"$f":"IFERROR(VLOOKUP($A235,FILTRO.12!A58:K387,4,FALSE),0)","v":0},{"$f":"IFERROR(VLOOKUP($A235,FILTRO.12!A58:K387,5,FALSE),0)","v":1}]
["80305061","0305061","Tipificación HLA B-8",0,{"$f":"IFERROR(VLOOKUP($A236,FILTRO.12!A59:K388,3,FALSE),0)","v":0},{"$f":"IFERROR(VLOOKUP($A236,FILTRO.12!A59:K388,4,FALSE),0)","v":0},{"$f":"IFERROR(VLOOKUP($A236,FILTRO.12!A59:K388,5,FALSE),0)","v":0}]
["80305062","0305062","Tipificación HLA  - DR serológica",0,{"$f":"IFERROR(VLOOKUP($A237,FILTRO.12!A60:K389,3,FALSE),0)","v":0},{"$f":"IFERROR(VLOOKUP($A237,FILTRO.12!A60:K389,4,FALSE),0)","v":0},{"$f":"IFERROR(VLOOKUP($A237,FILTRO.12!A60:K389,5,FALSE),0)","v":0}]
["80305063","0305063","Tipificación HLA - A, B serológica",0,{"$f":"IFERROR(VLOOKUP($A238,FILTRO.12!A61:K390,3,FALSE),0)","v":0},{"$f":"IFERROR(VLOOKUP($A238,FILTRO.12!A61:K390,4,FALSE),0)","v":0},{"$f":"IFERROR(VLOOKUP($A238,FILTRO.12!A61:K390,5,FALSE),0)","v":0}]
[null,"TOTAL",null,{"$f":"SUM(D182:D238)","v":{"v":3469,"d":"3,469"}},{"$f":"SUM(E182:E238)","v":0},{"$f":"SUM(F182:F238)","v":{"v":3469,"d":"3,469"}},{"$f":"SUM(G182:G238)","v":{"v":14179,"d":"14,179"}}]
[]
[null,"MICROBIOLÓGICOS"]
["80306001","0306001","Baciloscopía Ziehl-Neelsen por concentración de líquidos (orina u otros), c/u",{"$f":"SUM(E242:F242)","v":27},{"$f":"IFERROR(VLOOKUP($A242,FILTRO.12!A5:K334,3,FALSE),0)","v":2},{"$f":"IFERROR(VLOOKUP($A242,FILTRO.12!A5:K334,4,FALSE),0)","v":25},{"$f":"IFERROR(VLOOKUP($A242,FILTRO.12!A5:K334,5,FALSE),0)","v":230}]
["80306002","0306002","Baciloscopía Ziehl-Neelsen, c/u",{"$f":"SUM(E243:F243)","v":128},{"$f":"IFERROR(VLOOKUP($A243,FILTRO.12!A6:K335,3,FALSE),0)","v":25},{"$f":"IFERROR(VLOOKUP($A243,FILTRO.12!A6:K335,4,FALSE),0)","v":103},{"$f":"IFERROR(VLOOKUP($A243,FILTRO.12!A6:K335,5,FALSE),0)","v":867}]
["80306004","0306004","Examen directo al fresco, c/s tinción (incluye trichomonas)",478,{"$f":"IFERROR(VLOOKUP($A244,FILTRO.12!A7:K336,3,FALSE),0)","v":0},{"$f":"IFERROR(VLOOKUP($A244,FILTRO.12!A7:K336,4,FALSE),0)","v":478},{"$f":"IFERROR(VLOOKUP($A244,FILTRO.12!A7:K336,5,FALSE),0)","v":8}]
["80306005","0306005","Tinción de Gram",288,{"$f":"IFERROR(VLOOKUP($A245,FILTRO.12!A8:K337,3,FALSE),0)","v":0},{"$f":"IFERROR(VLOOKUP($A245,FILTRO.12!A8:K337,4,FALSE),0)","v":288},{"$f":"IFERROR(VLOOKUP($A245,FILTRO.12!A8:K337,5,FALSE),0)","v":8}]
["80306006","0306006","Ultramicroscopía (incluye toma de muestras)",0,{"$f":"IFERROR(VLOOKUP($A246,FILTRO.12!A9:K338,3,FALSE),0)","v":0},{"$f":"IFERROR(VLOOKUP($A246,FILTRO.12!A9:K338,4,FALSE),0)","v":0},{"$f":"IFERROR(VLOOKUP($A246,FILTRO.12!A9:K338,5,FALSE),0)","v":0}]
["80306007","0306007","Coprocultivo, c/u",230,{"$f":"IFERROR(VLOOKUP($A247,FILTRO.12!A10:K339,3,FALSE),0)","v":0},{"$f":"IFERROR(VLOOKUP($A247,FILTRO.12!A10:K339,4,FALSE),0)","v":230},{"$f":"IFERROR(VLOOKUP($A247,FILTRO.12!A10:K339,5,FALSE),0)","v":472}]
["80306008","0306008","Corriente (excepto coprocultivo, hemocultivo y urocultivo) c/u",273,{"$f":"IFERROR(VLOOKUP($A248,FILTRO.12!A11:K340,3,FALSE),0)","v":0},{"$f":"IFERROR(VLOOKUP($A248,FILTRO.12!A11:K340,4,FALSE),0)","v":273},{"$f":"IFERROR(VLOOKUP($A248,FILTRO.12!A11:K340,5,FALSE),0)","v":77}]
["80306009","0306009","Hemocultivo aerobio, c/u",0,{"$f":"IFERROR(VLOOKUP($A249,FILTRO.12!A12:K341,3,FALSE),0)","v":0},{"$f":"IFERROR(VLOOKUP($A249,FILTRO.12!A12:K341,4,FALSE),0)","v":0},{"$f":"IFERROR(VLOOKUP($A249,FILTRO.12!A12:K341,5,FALSE),0)","v":0}]
["80306010","0306010","Hemocultivo anaerobio, c/u",0,{"$f":"IFERROR(VLOOKUP($A250,FILTRO.12!A13:K342,3,FALSE),0)","v":0},{"$f":"IFERROR(VLOOKUP($A250,FILTRO.12!A13:K342,4,FALSE),0)","v":0},{"$f":"IFERROR(VLOOKUP($A250,FILTRO.12!A13:K342,5,FALSE),0)","v":0}]
["80306011","0306011","Urocultivo, recuento de colonias y antibiograma (cualquier técnica) (incluye toma de orina aséptica) (no incluye recolector pediátrico)",{"v":10024,"d":"10,024"},{"$f":"IFERROR(VLOOKUP($A251,FILTRO.12!A14:K343,3,FALSE),0)","v":0},{"$f":"IFERROR(VLOOKUP($A251,FILTRO.12!A14:K343,4,FALSE),0)","v":{"v":10024,"d":"10,024"}},{"$f":"IFERROR(VLOOKUP($A251,FILTRO.12!A14:K343,5,FALSE),0)","v":{"v":20508,"d":"20,508"}}]
["80306012","0306012","Anaerobios (incluye cód. 03-06-008)",0,{"$f":"IFERROR(VLOOKUP($A252,FILTRO.12!A15:K344,3,FALSE),0)","v":0},{"$f":"IFERROR(VLOOKUP($A252,FILTRO.12!A15:K344,4,FALSE),0)","v":0},{"$f":"IFERROR(VLOOKUP($A252,FILTRO.12!A15:K344,5,FALSE),0)","v":0}]
["80306013","0306013","Cultivo específico para Bordetella",0,{"$f":"IFERROR(VLOOKUP($A253,FILTRO.12!A16:K345,3,FALSE),0)","v":0},{"$f":"IFERROR(VLOOKUP($A253,FILTRO.12!A16:K345,4,FALSE),0)","v":0},{"$f":"IFERROR(VLOOKUP($A253,FILTRO.12!A16:K345,5,FALSE),0)","v":0}]
["80306014","0306014","Cultivo para Campylobacter, Yersinia, Vibrio, c/u",0,{"$f":"IFERROR(VLOOKUP($A254,FILTRO.12!A17:K346,3,FALSE),0)","v":0},{"$f":"IFERROR(VLOOKUP($A254,FILTRO.12!A17:K346,4,FALSE),0)","v":0},{"$f":"IFERROR(VLOOKUP($A254,FILTRO.12!A17:K346,5,FALSE),0)","v":0}]
["80306015","0306015","Difteria",0,{"$f":"IFERROR(VLOOKUP($A255,FILTRO.12!A18:K347,3,FALSE),0)","v":0},{"$f":"IFERROR(VLOOKUP($A255,FILTRO.12!A18:K347,4,FALSE),0)","v":0},{"$f":"IFERROR(VLOOKUP($A255,FILTRO.12!A18:K347,5,FALSE),0)","v":0}]
["80306016","0306016","Neisseria gonorrhoeae (gonococo)",0,{"$f":"IFERROR(VLOOKUP($A256,FILTRO.12!A19:K348,3,FALSE),0)","v":0},{"$f":"IFERROR(VLOOKUP($A256,FILTRO.12!A19:K348,4,FALSE),0)","v":0},{"$f":"IFERROR(VLOOKUP($A256,FILTRO.12!A19:K348,5,FALSE),0)","v":5}]
["80306017","0306017","Cultivo para Levaduras",0,{"$f":"IFERROR(VLOOKUP($A257,FILTRO.12!A20:K349,3,FALSE),0)","v":0},{"$f":"IFERROR(VLOOKUP($A257,FILTRO.12!A20:K349,4,FALSE),0)","v":0},{"$f":"IFERROR(VLOOKUP($A257,FILTRO.12!A20:K349,5,FALSE),0)","v":0}]
["80306117","0306117","Hongos Filamentosos",24,{"$f":"IFERROR(VLOOKUP($A258,FILTRO.12!A21:K350,3,FALSE),0)","v":0},{"$f":"IFERROR(VLOOKUP($A258,FILTRO.12!A21:K350,4,FALSE),0)","v":24},{"$f":"IFERROR(VLOOKUP($A258,FILTRO.12!A21:K350,5,FALSE),0)","v":0}]
["80306018","0306018","Cultivo para bacilo de Koch, (incluye otras micobacterias)",7,{"$f":"IFERROR(VLOOKUP($A259,FILTRO.12!A22:K351,3,FALSE),0)","v":0},{"$f":"IFERROR(VLOOKUP($A259,FILTRO.12!A22:K351,4,FALSE),0)","v":7},{"$f":"IFERROR(VLOOKUP($A259,FILTRO.12!A22:K351,5,FALSE),0)","v":67}]
["80306019","0306019","Cultivo para Legionella",0,{"$f":"IFERROR(VLOOKUP($A260,FILTRO.12!A23:K352,3,FALSE),0)","v":0},{"$f":"IFERROR(VLOOKUP($A260,FILTRO.12!A23:K352,4,FALSE),0)","v":0},{"$f":"IFERROR(VLOOKUP($A260,FILTRO.12!A23:K352,5,FALSE),0)","v":0}]
["80306020","0306020","Listeria",0,{"$f":"IFERROR(VLOOKUP($A261,FILTRO.12!A24:K353,3,FALSE),0)","v":0},{"$f":"IFERROR(VLOOKUP($A261,FILTRO.12!A24:K353,4,FALSE),0)","v":0},{"$f":"IFERROR(VLOOKUP($A261,FILTRO.12!A24:K353,5,FALSE),0)","v":0}]
["80306021","0306021","Neisseria meningitidis (meningococo)",0,{"$f":"IFERROR(VLOOKUP($A262,FILTRO.12!A25:K354,3,FALSE),0)","v":0},{"$f":"IFERROR(VLOOKUP($A262,FILTRO.12!A25:K354,4,FALSE),0)","v":0},{"$f":"IFERROR(VLOOKUP($A262,FILTRO.12!A25:K354,5,FALSE),0)","v":0}]
["80306022","0306022","Cultivo y Tipificación de micobacterias",0,{"$f":"IFERROR(VLOOKUP($A263,FILTRO.12!A26:K355,3,FALSE),0)","v":0},{"$f":"IFERROR(VLOOKUP($A263,FILTRO.12!A26:K355,4,FALSE),0)","v":0},{"$f":"IFERROR(VLOOKUP($A263,FILTRO.12!A26:K355,5,FALSE),0)","v":1}]
["80306023","0306023","Mycoplasma y Ureaplasma, c/u",0,{"$f":"IFERROR(VLOOKUP($A264,FILTRO.12!A27:K356,3,FALSE),0)","v":0},{"$f":"IFERROR(VLOOKUP($A264,FILTRO.12!A27:K356,4,FALSE),0)","v":0},{"$f":"IFERROR(VLOOKUP($A264,FILTRO.12!A27:K356,5,FALSE),0)","v":54}]
["80306024","0306024","Anaerobios  (mínimo 4 fármacos)",0,{"$f":"IFERROR(VLOOKUP($A265,FILTRO.12!A28:K357,3,FALSE),0)","v":0},{"$f":"IFERROR(VLOOKUP($A265,FILTRO.12!A28:K357,4,FALSE),0)","v":0},{"$f":"IFERROR(VLOOKUP($A265,FILTRO.12!A28:K357,5,FALSE),0)","v":0}]
["80306025","0306025","Bacilo de Koch (cada fármaco)",0,{"$f":"IFERROR(VLOOKUP($A266,FILTRO.12!A29:K358,3,FALSE),0)","v":0},{"$f":"IFERROR(VLOOKUP($A266,FILTRO.12!A29:K358,4,FALSE),0)","v":0},{"$f":"IFERROR(VLOOKUP($A266,FILTRO.12!A29:K358,5,FALSE),0)","v":0}]
["80306026","0306026","Corriente (mínimo 10 fármacos) (en caso de urocultivo no corresponde su cobro; incluido en el valor 03-06-011)",{"v":1763,"d":"1,763"},{"$f":"IFERROR(VLOOKUP($A267,FILTRO.12!A30:K359,3,FALSE),0)","v":0},{"$f":"IFERROR(VLOOKUP($A267,FILTRO.12!A30:K359,4,FALSE),0)","v":{"v":1763,"d":"1,763"}},{"$f":"IFERROR(VLOOKUP($A267,FILTRO.12!A30:K359,5,FALSE),0)","v":10}]
["80306027","0306027","Estudio de sensibilidad por dilución (CIM) (mínimo 6 fármacos) (en caso de urocultivo, no corresponde su cobro; incluido en el valor código 03-06-011)",0,{"$f":"IFERROR(VLOOKUP($A268,FILTRO.12!A31:K360,3,FALSE),0)","v":0},{"$f":"IFERROR(VLOOKUP($A268,FILTRO.12!A31:K360,4,FALSE),0)","v":0},{"$f":"IFERROR(VLOOKUP($A268,FILTRO.12!A31:K360,5,FALSE),0)","v":0}]
["80306028","0306028","Antifungigrama (mínimo 4 fármacos antihongos)",0,{"$f":"IFERROR(VLOOKUP($A269,FILTRO.12!A32:K361,3,FALSE),0)","v":0},{"$f":"IFERROR(VLOOKUP($A269,FILTRO.12!A32:K361,4,FALSE),0)","v":0},{"$f":"IFERROR(VLOOKUP($A269,FILTRO.12!A32:K361,5,FALSE),0)","v":0}]
["80306029","0306029","Autovacunas, incluye cultivo y preparación  de mínimo 10 ampollas",0,{"$f":"IFERROR(VLOOKUP($A270,FILTRO.12!A33:K362,3,FALSE),0)","v":0},{"$f":"IFERROR(VLOOKUP($A270,FILTRO.12!A33:K362,4,FALSE),0)","v":0},{"$f":"IFERROR(VLOOKUP($A270,FILTRO.12!A33:K362,5,FALSE),0)","v":0}]
["80306030","0306030","Poder bactericida del suero",0,{"$f":"IFERROR(VLOOKUP($A271,FILTRO.12!A34:K363,3,FALSE),0)","v":0},{"$f":"IFERROR(VLOOKUP($A271,FILTRO.12!A34:K363,4,FALSE),0)","v":0},{"$f":"IFERROR(VLOOKUP($A271,FILTRO.12!A34:K363,5,FALSE),0)","v":0}]
["80306031","0306031","Preparación de vacunas uni o polivalentes mantenidas en stock (mínimo 5 ampollas)",0,{"$f":"IFERROR(VLOOKUP($A272,FILTRO.12!A35:K364,3,FALSE),0)","v":0},{"$f":"IFERROR(VLOOKUP($A272,FILTRO.12!A35:K364,4,FALSE),0)","v":0},{"$f":"IFERROR(VLOOKUP($A272,FILTRO.12!A35:K364,5,FALSE),0)","v":0}]
["80306032","0306032","Aspergilosis, candidiasis, histoplasmosis u otros hongos por inmunodiagnóstico c/u",0,{"$f":"IFERROR(VLOOKUP($A273,FILTRO.12!A36:K365,3,FALSE),0)","v":0},{"$f":"IFERROR(VLOOKUP($A273,FILTRO.12!A36:K365,4,FALSE),0)","v":0},{"$f":"IFERROR(VLOOKUP($A273,FILTRO.12!A36:K365,5,FALSE),0)","v":0}]
["80306033","0306033","Brucella, reacción de aglutinación para (Wright-Hudleson) o similares",0,{"$f":"IFERROR(VLOOKUP($A274,FILTRO.12!A37:K366,3,FALSE),0)","v":0},{"$f":"IFERROR(VLOOKUP($A274,FILTRO.12!A37:K366,4,FALSE),0)","v":0},{"$f":"IFERROR(VLOOKUP($A274,FILTRO.12!A37:K366,5,FALSE),0)","v":0}]
["80306034","0306034","Clamidias por inmunofluorescencia, peroxidasa, Elisa o similares",0,{"$f":"IFERROR(VLOOKUP($A275,FILTRO.12!A38:K367,3,FALSE),0)","v":0},{"$f":"IFERROR(VLOOKUP($A275,FILTRO.12!A38:K367,4,FALSE),0)","v":0},{"$f":"IFERROR(VLOOKUP($A275,FILTRO.12!A38:K367,5,FALSE),0)","v":0}]
["80306036","0306036","Mononucleosis, reacción de Paul Bunnell, Anticuerpos Heterófilos o similares",0,{"$f":"IFERROR(VLOOKUP($A276,FILTRO.12!A39:K368,3,FALSE),0)","v":0},{"$f":"IFERROR(VLOOKUP($A276,FILTRO.12!A39:K368,4,FALSE),0)","v":0},{"$f":"IFERROR(VLOOKUP($A276,FILTRO.12!A39:K368,5,FALSE),0)","v":0}]
["80306037","0306037","Mycoplasma IgG, IgM, c/u. ",0,{"$f":"IFERROR(VLOOKUP($A277,FILTRO.12!A40:K369,3,FALSE),0)","v":0},{"$f":"IFERROR(VLOOKUP($A277,FILTRO.12!A40:K369,4,FALSE),0)","v":0},{"$f":"IFERROR(VLOOKUP($A277,FILTRO.12!A40:K369,5,FALSE),0)","v":28}]
["80306038","0306038","R.P.R.",{"v":6469,"d":"6,469"},{"$f":"IFERROR(VLOOKUP($A278,FILTRO.12!A41:K370,3,FALSE),0)","v":0},{"$f":"IFERROR(VLOOKUP($A278,FILTRO.12!A41:K370,4,FALSE),0)","v":{"v":6469,"d":"6,469"}},{"$f":"IFERROR(VLOOKUP($A278,FILTRO.12!A41:K370,5,FALSE),0)","v":{"v":11208,"d":"11,208"}}]
["80306039","0306039","Tíficas, reacciones de aglutinación  (Eberth H y O, paratyphi A y B) (Widal)",0,{"$f":"IFERROR(VLOOKUP($A279,FILTRO.12!A42:K371,3,FALSE),0)","v":0},{"$f":"IFERROR(VLOOKUP($A279,FILTRO.12!A42:K371,4,FALSE),0)","v":0},{"$f":"IFERROR(VLOOKUP($A279,FILTRO.12!A42:K371,5,FALSE),0)","v":0}]
["80306041","0306041","Treponema pallidum FTA - ABS, MHA-TP c/u",0,{"$f":"IFERROR(VLOOKUP($A280,FILTRO.12!A43:K372,3,FALSE),0)","v":0},{"$f":"IFERROR(VLOOKUP($A280,FILTRO.12!A43:K372,4,FALSE),0)","v":0},{"$f":"IFERROR(VLOOKUP($A280,FILTRO.12!A43:K372,5,FALSE),0)","v":4}]
["80306042","0306042","V.D.R.L.",298,{"$f":"IFERROR(VLOOKUP($A281,FILTRO.12!A44:K373,3,FALSE),0)","v":0},{"$f":"IFERROR(VLOOKUP($A281,FILTRO.12!A44:K373,4,FALSE),0)","v":298},{"$f":"IFERROR(VLOOKUP($A281,FILTRO.12!A44:K373,5,FALSE),0)","v":{"v":10204,"d":"10,204"}}]
["80306043","0306043","Artrópodos macroscópicos y microscópicos (imagos y/o pupas y/o larvas), diagnóstico de",0,{"$f":"IFERROR(VLOOKUP($A282,FILTRO.12!A45:K374,3,FALSE),0)","v":0},{"$f":"IFERROR(VLOOKUP($A282,FILTRO.12!A45:K374,4,FALSE),0)","v":0},{"$f":"IFERROR(VLOOKUP($A282,FILTRO.12!A45:K374,5,FALSE),0)","v":0}]
["80306045","0306045","Coproparasitario seriado con técnica  para Cryptosporidium sp o para Diantamoeba fragilis (incluye los códigos 03-06-048 y/o 03-06-059 más aplicación de técnica de frotis con tinción tricrómica o tinción Ziehl-Neelsen en por lo menos 3 muestras, según corresponda)",0,{"$f":"IFERROR(VLOOKUP($A283,FILTRO.12!A46:K375,3,FALSE),0)","v":0},{"$f":"IFERROR(VLOOKUP($A283,FILTRO.12!A46:K375,4,FALSE),0)","v":0},{"$f":"IFERROR(VLOOKUP($A283,FILTRO.12!A46:K375,5,FALSE),0)","v":100}]
["80306046","0306046","Coproparasitario seriado para Fasciola hepática (incluye diagnostico de gusanos macroscópicos y ex. microscópico de 10 muestras separadas por método de Telemann y de otras 10 muestras separadas y simultáneas con las ant. por téc. de sedimentación)",0,{"$f":"IFERROR(VLOOKUP($A284,FILTRO.12!A47:K376,3,FALSE),0)","v":0},{"$f":"IFERROR(VLOOKUP($A284,FILTRO.12!A47:K376,4,FALSE),0)","v":0},{"$f":"IFERROR(VLOOKUP($A284,FILTRO.12!A47:K376,5,FALSE),0)","v":0}]
["80306047","0306047","Coproparasitario seriado para Isospora y Sarcocystis (incluye diagnóstico de gusanos macroscópicos y examen  microscópico de 3 muestras separadas)",0,{"$f":"IFERROR(VLOOKUP($A285,FILTRO.12!A48:K377,3,FALSE),0)","v":0},{"$f":"IFERROR(VLOOKUP($A285,FILTRO.12!A48:K377,4,FALSE),0)","v":0},{"$f":"IFERROR(VLOOKUP($A285,FILTRO.12!A48:K377,5,FALSE),0)","v":25}]
["80306048","0306048","Coproparasitológico seriado simple (incluye diagnostico de gusanos macroscópicos y examen microscópico por concentración de 3 muestras separadas método Telemann) (proc. aut.)",311,{"$f":"IFERROR(VLOOKUP($A286,FILTRO.12!A49:K378,3,FALSE),0)","v":0},{"$f":"IFERROR(VLOOKUP($A286,FILTRO.12!A49:K378,4,FALSE),0)","v":311},{"$f":"IFERROR(VLOOKUP($A286,FILTRO.12!A49:K378,5,FALSE),0)","v":{"v":1086,"d":"1,086"}}]
["80306049","0306049","Diagnostico de parásitos en jugo duodenal y/o bilis, examen macroscópico y microscópico (directo y/o concentración, c/s tinción)",0,{"$f":"IFERROR(VLOOKUP($A287,FILTRO.12!A50:K379,3,FALSE),0)","v":0},{"$f":"IFERROR(VLOOKUP($A287,FILTRO.12!A50:K379,4,FALSE),0)","v":0},{"$f":"IFERROR(VLOOKUP($A287,FILTRO.12!A50:K379,5,FALSE),0)","v":20}]
["80306050","0306050","Diagnostico parasitario en exudados, secreciones y otros líquidos orgánicos (no especificados mas adelante), examen macro y microscópico de (incluye concentración y/o tinción cuando proceda), c/u",0,{"$f":"IFERROR(VLOOKUP($A288,FILTRO.12!A51:K380,3,FALSE),0)","v":0},{"$f":"IFERROR(VLOOKUP($A288,FILTRO.12!A51:K380,4,FALSE),0)","v":0},{"$f":"IFERROR(VLOOKUP($A288,FILTRO.12!A51:K380,5,FALSE),0)","v":63}]
["80306051","0306051","Graham, examen de (incluye diagnostico de gusanos macroscópicos y examen microscópico de 5 muestras separadas)",164,{"$f":"IFERROR(VLOOKUP($A289,FILTRO.12!A52:K381,3,FALSE),0)","v":0},{"$f":"IFERROR(VLOOKUP($A289,FILTRO.12!A52:K381,4,FALSE),0)","v":164},{"$f":"IFERROR(VLOOKUP($A289,FILTRO.12!A52:K381,5,FALSE),0)","v":345}]
["80306052","0306052","Gusanos macroscópicos, diagnóstico de (proc. aut.)",2,{"$f":"IFERROR(VLOOKUP($A290,FILTRO.12!A53:K382,3,FALSE),0)","v":0},{"$f":"IFERROR(VLOOKUP($A290,FILTRO.12!A53:K382,4,FALSE),0)","v":2},{"$f":"IFERROR(VLOOKUP($A290,FILTRO.12!A53:K382,5,FALSE),0)","v":49}]
["80306053","0306053","Hemoparásitos, diagnóstico microscópico de (mínimo 10 frotis y/o gotas gruesas, c/s examen directo al fresco), cada sesión",0,{"$f":"IFERROR(VLOOKUP($A291,FILTRO.12!A54:K383,3,FALSE),0)","v":0},{"$f":"IFERROR(VLOOKUP($A291,FILTRO.12!A54:K383,4,FALSE),0)","v":0},{"$f":"IFERROR(VLOOKUP($A291,FILTRO.12!A54:K383,5,FALSE),0)","v":0}]
["80306054","0306054","Hemoparásitos, diagnóstico por técnica de Strout o similar en hasta 10 tubos capilares, cada sesión",0,{"$f":"IFERROR(VLOOKUP($A292,FILTRO.12!A55:K384,3,FALSE),0)","v":0},{"$f":"IFERROR(VLOOKUP($A292,FILTRO.12!A55:K384,4,FALSE),0)","v":0},{"$f":"IFERROR(VLOOKUP($A292,FILTRO.12!A55:K384,5,FALSE),0)","v":0}]
["80306056","0306056","Raspado de piel, examen microscópico de (\"Acarotest\"): de 6 a 10 preparaciones",0,{"$f":"IFERROR(VLOOKUP($A293,FILTRO.12!A56:K385,3,FALSE),0)","v":0},{"$f":"IFERROR(VLOOKUP($A293,FILTRO.12!A56:K385,4,FALSE),0)","v":0},{"$f":"IFERROR(VLOOKUP($A293,FILTRO.12!A56:K385,5,FALSE),0)","v":0}]
["80306057","0306057","Tenias post. trat., Diagnostico y búsqueda de escólex de",0,{"$f":"IFERROR(VLOOKUP($A294,FILTRO.12!A57:K386,3,FALSE),0)","v":0},{"$f":"IFERROR(VLOOKUP($A294,FILTRO.12!A57:K386,4,FALSE),0)","v":0},{"$f":"IFERROR(VLOOKUP($A294,FILTRO.12!A57:K386,5,FALSE),0)","v":0}]
["80306058","0306058","Xenodiagnóstico (cada aplicación de 2 cajas, con 6 ninfas por lo menos c/u, examinadas a los 20 y/o 30 días y hasta por 60 días más si procede)",0,{"$f":"IFERROR(VLOOKUP($A295,FILTRO.12!A58:K387,3,FALSE),0)","v":0},{"$f":"IFERROR(VLOOKUP($A295,FILTRO.12!A58:K387,4,FALSE),0)","v":0},{"$f":"IFERROR(VLOOKUP($A295,FILTRO.12!A58:K387,5,FALSE),0)","v":0}]
["80306059","0306059","Coproparasitológico seriado simple (incluye diagnóstico de gusanos macroscopicos  y exámen microscopico por concentración de tres muestras separadas método PAFS (proc. aut.)",245,{"$f":"IFERROR(VLOOKUP($A296,FILTRO.12!A59:K388,3,FALSE),0)","v":0},{"$f":"IFERROR(VLOOKUP($A296,FILTRO.12!A59:K388,4,FALSE),0)","v":245},{"$f":"IFERROR(VLOOKUP($A296,FILTRO.12!A59:K388,5,FALSE),0)","v":68}]
["80306061","0306061","Elisa indirecta (Chagas, hidatidosis, toxocariasis y otras), c/u",{"v":1952,"d":"1,952"},{"$f":"IFERROR(VLOOKUP($A297,FILTRO.12!A60:K389,3,FALSE),0)","v":0},{"$f":"IFERROR(VLOOKUP($A297,FILTRO.12!A5:K334,4,FALSE),0)","v":{"v":1952,"d":"1,952"}},{"$f":"IFERROR(VLOOKUP($A297,FILTRO.12!A60:K389,5,FALSE),0)","v":{"v":4539,"d":"4,539"}}]
["80306062","0306062","Fijación del complemento (distomatosis, toxoplasmosis, cisticercosis y otras) c/u",0,{"$f":"IFERROR(VLOOKUP($A298,FILTRO.12!A61:K390,3,FALSE),0)","v":0},{"$f":"IFERROR(VLOOKUP($A298,FILTRO.12!A6:K335,4,FALSE),0)","v":0},{"$f":"IFERROR(VLOOKUP($A298,FILTRO.12!A61:K390,5,FALSE),0)","v":1}]
["80306063","0306063","Floculación en bentonita, látex, precipitinas o similar (triquinosis, hidatidosis y otros), c/u",0,{"$f":"IFERROR(VLOOKUP($A299,FILTRO.12!A62:K391,3,FALSE),0)","v":0},{"$f":"IFERROR(VLOOKUP($A299,FILTRO.12!A7:K336,4,FALSE),0)","v":0},{"$f":"IFERROR(VLOOKUP($A299,FILTRO.12!A62:K391,5,FALSE),0)","v":1}]
["80306064","0306064","Hemaglutinación indirecta (toxoplasmosis, Chagas, hidatidosis y otras), c/u",0,{"$f":"IFERROR(VLOOKUP($A300,FILTRO.12!A63:K392,3,FALSE),0)","v":0},{"$f":"IFERROR(VLOOKUP($A300,FILTRO.12!A8:K337,4,FALSE),0)","v":0},{"$f":"IFERROR(VLOOKUP($A300,FILTRO.12!A63:K392,5,FALSE),0)","v":33}]
["80306065","0306065","Inmunoelectroforesis o contrainmunoelectroforesis (hidatidosis, distomatosis, amebiasis y otras), c/u",0,{"$f":"IFERROR(VLOOKUP($A301,FILTRO.12!A64:K393,3,FALSE),0)","v":0},{"$f":"IFERROR(VLOOKUP($A301,FILTRO.12!A9:K338,4,FALSE),0)","v":0},{"$f":"IFERROR(VLOOKUP($A301,FILTRO.12!A64:K393,5,FALSE),0)","v":0}]
["80306066","0306066","Inmunofluorescencia indirecta (toxoplasmosis, Chagas, amebiasis y otras), c/u",4,{"$f":"IFERROR(VLOOKUP($A302,FILTRO.12!A65:K394,3,FALSE),0)","v":0},{"$f":"IFERROR(VLOOKUP($A302,FILTRO.12!A10:K339,4,FALSE),0)","v":4},{"$f":"IFERROR(VLOOKUP($A302,FILTRO.12!A65:K394,5,FALSE),0)","v":117}]
["80306067","0306067","Reacción intradérmica (incluye el valor y la aplicación del antígeno y del control y examen de las reacciones inmediatas y retardadas, cada antígeno) (bachmann, distomatosis u otras)",0,{"$f":"IFERROR(VLOOKUP($A303,FILTRO.12!A66:K395,3,FALSE),0)","v":0},{"$f":"IFERROR(VLOOKUP($A303,FILTRO.12!A11:K340,4,FALSE),0)","v":0},{"$f":"IFERROR(VLOOKUP($A303,FILTRO.12!A66:K395,5,FALSE),0)","v":84}]
["80306068","0306068","Aislamiento de virus (adenovirus, citomegalovirus, Coxsakie, herpes, influenza, polio, sarampión y otros), c/u",0,{"$f":"IFERROR(VLOOKUP($A304,FILTRO.12!A67:K396,3,FALSE),0)","v":0},{"$f":"IFERROR(VLOOKUP($A304,FILTRO.12!A12:K341,4,FALSE),0)","v":0},{"$f":"IFERROR(VLOOKUP($A304,FILTRO.12!A67:K396,5,FALSE),0)","v":0}]
["80306069","0306069","Anticuerpos virales, determ. de (adenovirus, citomegalovirus, herpes simple, rubéola, Influenza  A y B; virus varicela-zoster; virus sincicial respiratorio; parainfluenza 1, 2 y 3, Epstein Barr y otros), c/u",0,{"$f":"IFERROR(VLOOKUP($A305,FILTRO.12!A68:K397,3,FALSE),0)","v":0},{"$f":"IFERROR(VLOOKUP($A305,FILTRO.12!A13:K342,4,FALSE),0)","v":0},{"$f":"IFERROR(VLOOKUP($A305,FILTRO.12!A68:K397,5,FALSE),0)","v":25}]
["80306169","0306169","Anticuerpos virales, determ. de H.I.V.",64,{"$f":"IFERROR(VLOOKUP($A306,FILTRO.12!A69:K398,3,FALSE),0)","v":0},{"$f":"IFERROR(VLOOKUP($A306,FILTRO.12!A14:K343,4,FALSE),0)","v":64},{"$f":"IFERROR(VLOOKUP($A306,FILTRO.12!A69:K398,5,FALSE),0)","v":{"v":2622,"d":"2,622"}}]
["80306070","0306070","Antígenos virales determ. de (adenovirus, citomegalovirus, herpes simple, rubéola, influenza y otros), (por cualquier técnica ej: inmunofluorescencia), c/u",{"$f":"SUM(E307:F307)","v":0},{"$f":"IFERROR(VLOOKUP($A307,FILTRO.12!A70:K399,3,FALSE),0)","v":0},{"$f":"IFERROR(VLOOKUP($A307,FILTRO.12!A15:K344,4,FALSE),0)","v":0},{"$f":"IFERROR(VLOOKUP($A307,FILTRO.12!A70:K399,5,FALSE),0)","v":0}]
["80306170","0306170","Antígenos virales determ. de rotavirus, por cualquier técnica ",12,{"$f":"IFERROR(VLOOKUP($A308,FILTRO.12!A71:K400,3,FALSE),0)","v":0},{"$f":"IFERROR(VLOOKUP($A308,FILTRO.12!A16:K345,4,FALSE),0)","v":12},{"$f":"IFERROR(VLOOKUP($A308,FILTRO.12!A71:K400,5,FALSE),0)","v":0}]
["80306270","0306270","Antígenos virales determ. de virus sincicial, por cualquier técnica ",0,{"$f":"IFERROR(VLOOKUP($A309,FILTRO.12!A72:K401,3,FALSE),0)","v":0},{"$f":"IFERROR(VLOOKUP($A309,FILTRO.12!A17:K346,4,FALSE),0)","v":0},{"$f":"IFERROR(VLOOKUP($A309,FILTRO.12!A72:K401,5,FALSE),0)","v":0}]
["80306072","0306072","Reacción de seroneutralización para: virus polio, ECHO, Coxsakie, c/u",0,{"$f":"IFERROR(VLOOKUP($A310,FILTRO.12!A73:K402,3,FALSE),0)","v":0},{"$f":"IFERROR(VLOOKUP($A310,FILTRO.12!A18:K347,4,FALSE),0)","v":0},{"$f":"IFERROR(VLOOKUP($A310,FILTRO.12!A73:K402,5,FALSE),0)","v":0}]
["80306073","0306073","Virus hepatitis A, Anticore",0,{"$f":"IFERROR(VLOOKUP($A311,FILTRO.12!A74:K403,3,FALSE),0)","v":0},{"$f":"IFERROR(VLOOKUP($A311,FILTRO.12!A19:K348,4,FALSE),0)","v":0},{"$f":"IFERROR(VLOOKUP($A311,FILTRO.12!A74:K403,5,FALSE),0)","v":65}]
["80306074","0306074","Virus hepatitis A, anticuerpos IgM del",0,{"$f":"IFERROR(VLOOKUP($A312,FILTRO.12!A75:K404,3,FALSE),0)","v":0},{"$f":"IFERROR(VLOOKUP($A312,FILTRO.12!A20:K349,4,FALSE),0)","v":0},{"$f":"IFERROR(VLOOKUP($A312,FILTRO.12!A75:K404,5,FALSE),0)","v":0}]
["80306075","0306075","Virus hepatitis B, anticuerpo del antígeno E del",0,{"$f":"IFERROR(VLOOKUP($A313,FILTRO.12!A76:K405,3,FALSE),0)","v":0},{"$f":"IFERROR(VLOOKUP($A313,FILTRO.12!A21:K350,4,FALSE),0)","v":0},{"$f":"IFERROR(VLOOKUP($A313,FILTRO.12!A76:K405,5,FALSE),0)","v":387}]
["80306076","0306076","Virus hepatitis B, anticore total del (anti HBc total)",0,{"$f":"IFERROR(VLOOKUP($A314,FILTRO.12!A77:K406,3,FALSE),0)","v":0},{"$f":"IFERROR(VLOOKUP($A314,FILTRO.12!A22:K351,4,FALSE),0)","v":0},{"$f":"IFERROR(VLOOKUP($A314,FILTRO.12!A77:K406,5,FALSE),0)","v":18}]
["80306077","0306077","Virus hepatitis B, anticuerpos de antígeno de superficie (australiano)",2,{"$f":"IFERROR(VLOOKUP($A315,FILTRO.12!A78:K407,3,FALSE),0)","v":0},{"$f":"IFERROR(VLOOKUP($A315,FILTRO.12!A23:K352,4,FALSE),0)","v":2},{"$f":"IFERROR(VLOOKUP($A315,FILTRO.12!A78:K407,5,FALSE),0)","v":54}]
["80306078","0306078","Virus hepatitis B, antígeno E del (HBEAg)",32,{"$f":"IFERROR(VLOOKUP($A316,FILTRO.12!A79:K408,3,FALSE),0)","v":0},{"$f":"IFERROR(VLOOKUP($A316,FILTRO.12!A24:K353,4,FALSE),0)","v":32},{"$f":"IFERROR(VLOOKUP($A316,FILTRO.12!A79:K408,5,FALSE),0)","v":{"v":1192,"d":"1,192"}}]
["80306079","0306079","Virus hepatitis B, antígeno superficie",20,{"$f":"IFERROR(VLOOKUP($A317,FILTRO.12!A80:K409,3,FALSE),0)","v":0},{"$f":"IFERROR(VLOOKUP($A317,FILTRO.12!A25:K354,4,FALSE),0)","v":20},{"$f":"IFERROR(VLOOKUP($A317,FILTRO.12!A80:K409,5,FALSE),0)","v":978}]
["80306080","0306080","Virus hepatitis B, anticore IgM del (anti HBc IgM)",11,{"$f":"IFERROR(VLOOKUP($A318,FILTRO.12!A81:K410,3,FALSE),0)","v":0},{"$f":"IFERROR(VLOOKUP($A318,FILTRO.12!A26:K355,4,FALSE),0)","v":11},{"$f":"IFERROR(VLOOKUP($A318,FILTRO.12!A81:K410,5,FALSE),0)","v":74}]
["80306081","0306081","Virus hepatitis C, anticuerpos de (anti HCV)",0,{"$f":"IFERROR(VLOOKUP($A319,FILTRO.12!A82:K411,3,FALSE),0)","v":0},{"$f":"IFERROR(VLOOKUP($A319,FILTRO.12!A27:K356,4,FALSE),0)","v":0},{"$f":"IFERROR(VLOOKUP($A319,FILTRO.12!A5:K334,5,FALSE),0)","v":23}]
[null,"TOTAL",null,{"$f":"SUM(D242:D319)","v":{"v":22828,"d":"22,828"}},{"$f":"SUM(E242:E319)","v":27},{"$f":"SUM(F242:F319)","v":{"v":22801,"d":"22,801"}},{"$f":"SUM(G242:G319)","v":{"v":55720,"d":"55,720"}}]
[]
[null,"EXÁMENES DE DEPOSICIONES, EXUDADOS, SECRESIONES Y OTROS LÍQUIDOS"]
["80308001","0308001","Azúcares reductores (Benedict-Fehling o similar)",{"$f":"SUM(E323:F323)","v":3},{"$f":"IFERROR(VLOOKUP($A323,FILTRO.12!A5:K334,3,FALSE),0)","v":0},{"$f":"IFERROR(VLOOKUP($A323,FILTRO.12!A5:K334,4,FALSE),0)","v":3},{"$f":"IFERROR(VLOOKUP($A323,FILTRO.12!A5:K334,5,FALSE),0)","v":54}]
["80308002","0308002","Balance graso (Van de Kamer) muestra de tres o más días",{"$f":"SUM(E324:F324)","v":0},{"$f":"IFERROR(VLOOKUP($A324,FILTRO.12!A6:K335,3,FALSE),0)","v":0},{"$f":"IFERROR(VLOOKUP($A324,FILTRO.12!A6:K335,4,FALSE),0)","v":0},{"$f":"IFERROR(VLOOKUP($A324,FILTRO.12!A6:K335,5,FALSE),0)","v":0}]
["80308003","0308003","Grasas neutras (Sudán III)",0,{"$f":"IFERROR(VLOOKUP($A325,FILTRO.12!A7:K336,3,FALSE),0)","v":0},{"$f":"IFERROR(VLOOKUP($A325,FILTRO.12!A7:K336,4,FALSE),0)","v":0},{"$f":"IFERROR(VLOOKUP($A325,FILTRO.12!A7:K336,5,FALSE),0)","v":5}]
["80308004","0308004","Hemorragias ocultas, (bencidina, guayaco o test de Weber y similares), cualquier método, c/muestra",169,{"$f":"IFERROR(VLOOKUP($A326,FILTRO.12!A8:K337,3,FALSE),0)","v":0},{"$f":"IFERROR(VLOOKUP($A326,FILTRO.12!A8:K337,4,FALSE),0)","v":169},{"$f":"IFERROR(VLOOKUP($A326,FILTRO.12!A8:K337,5,FALSE),0)","v":{"v":1363,"d":"1,363"}}]
["80308005","0308005","Leucocitos fecales",242,{"$f":"IFERROR(VLOOKUP($A327,FILTRO.12!A9:K338,3,FALSE),0)","v":0},{"$f":"IFERROR(VLOOKUP($A327,FILTRO.12!A9:K338,4,FALSE),0)","v":242},{"$f":"IFERROR(VLOOKUP($A327,FILTRO.12!A9:K338,5,FALSE),0)","v":188}]
["80308006","0308006","PH",0,{"$f":"IFERROR(VLOOKUP($A328,FILTRO.12!A10:K339,3,FALSE),0)","v":0},{"$f":"IFERROR(VLOOKUP($A328,FILTRO.12!A10:K339,4,FALSE),0)","v":0},{"$f":"IFERROR(VLOOKUP($A328,FILTRO.12!A10:K339,5,FALSE),0)","v":0}]
["80308007","0308007","Porfirinas, c/u",0,{"$f":"IFERROR(VLOOKUP($A329,FILTRO.12!A11:K340,3,FALSE),0)","v":0},{"$f":"IFERROR(VLOOKUP($A329,FILTRO.12!A11:K340,4,FALSE),0)","v":0},{"$f":"IFERROR(VLOOKUP($A329,FILTRO.12!A11:K340,5,FALSE),0)","v":0}]
["80308008","0308008","Urobilinógeno cuantitativo",0,{"$f":"IFERROR(VLOOKUP($A330,FILTRO.12!A12:K341,3,FALSE),0)","v":0},{"$f":"IFERROR(VLOOKUP($A330,FILTRO.12!A12:K341,4,FALSE),0)","v":0},{"$f":"IFERROR(VLOOKUP($A330,FILTRO.12!A12:K341,5,FALSE),0)","v":0}]
["80308009","0308009","Células neoplásicas en fluídos biológicos",0,{"$f":"IFERROR(VLOOKUP($A331,FILTRO.12!A13:K342,3,FALSE),0)","v":0},{"$f":"IFERROR(VLOOKUP($A331,FILTRO.12!A13:K342,4,FALSE),0)","v":0},{"$f":"IFERROR(VLOOKUP($A331,FILTRO.12!A13:K342,5,FALSE),0)","v":0}]
["80308010","0308010","Citológico c/s tinción (incluye examen al fresco, recuento celular y citológico porcentual)",{"v":2874,"d":"2,874"},{"$f":"IFERROR(VLOOKUP($A332,FILTRO.12!A14:K343,3,FALSE),0)","v":0},{"$f":"IFERROR(VLOOKUP($A332,FILTRO.12!A14:K343,4,FALSE),0)","v":{"v":2874,"d":"2,874"}},{"$f":"IFERROR(VLOOKUP($A332,FILTRO.12!A14:K343,5,FALSE),0)","v":0}]
["80308011","0308011","Directo al fresco c/s tinción, (incluye trichomonas)",0,{"$f":"IFERROR(VLOOKUP($A333,FILTRO.12!A15:K344,3,FALSE),0)","v":0},{"$f":"IFERROR(VLOOKUP($A333,FILTRO.12!A15:K344,4,FALSE),0)","v":0},{"$f":"IFERROR(VLOOKUP($A333,FILTRO.12!A15:K344,5,FALSE),0)","v":0}]
["80308012","0308012","Electrolitos (sodio, potasio, cloro), c/u",0,{"$f":"IFERROR(VLOOKUP($A334,FILTRO.12!A16:K345,3,FALSE),0)","v":0},{"$f":"IFERROR(VLOOKUP($A334,FILTRO.12!A16:K345,4,FALSE),0)","v":0},{"$f":"IFERROR(VLOOKUP($A334,FILTRO.12!A16:K345,5,FALSE),0)","v":481}]
["80308013","0308013","Eosinófilos, recuento de",0,{"$f":"IFERROR(VLOOKUP($A335,FILTRO.12!A17:K346,3,FALSE),0)","v":0},{"$f":"IFERROR(VLOOKUP($A335,FILTRO.12!A17:K346,4,FALSE),0)","v":0},{"$f":"IFERROR(VLOOKUP($A335,FILTRO.12!A17:K346,5,FALSE),0)","v":1}]
["80308014","0308014","Físico-químico (incluye aspecto, color, pH, glucosa, proteína, Pandy y filancia)",0,{"$f":"IFERROR(VLOOKUP($A336,FILTRO.12!A18:K347,3,FALSE),0)","v":0},{"$f":"IFERROR(VLOOKUP($A336,FILTRO.12!A18:K347,4,FALSE),0)","v":0},{"$f":"IFERROR(VLOOKUP($A336,FILTRO.12!A18:K347,5,FALSE),0)","v":0}]
["80308015","0308015","Glucosa en exudados secreciones y otros liquidos",0,{"$f":"IFERROR(VLOOKUP($A337,FILTRO.12!A19:K348,3,FALSE),0)","v":0},{"$f":"IFERROR(VLOOKUP($A337,FILTRO.12!A19:K348,4,FALSE),0)","v":0},{"$f":"IFERROR(VLOOKUP($A337,FILTRO.12!A19:K348,5,FALSE),0)","v":0}]
["80308016","0308016","Mucina, determinación de",0,{"$f":"IFERROR(VLOOKUP($A338,FILTRO.12!A20:K349,3,FALSE),0)","v":0},{"$f":"IFERROR(VLOOKUP($A338,FILTRO.12!A20:K349,4,FALSE),0)","v":0},{"$f":"IFERROR(VLOOKUP($A338,FILTRO.12!A20:K349,5,FALSE),0)","v":0}]
["80308017","0308017","pH, (proc. aut.)",0,{"$f":"IFERROR(VLOOKUP($A339,FILTRO.12!A21:K350,3,FALSE),0)","v":0},{"$f":"IFERROR(VLOOKUP($A339,FILTRO.12!A21:K350,4,FALSE),0)","v":0},{"$f":"IFERROR(VLOOKUP($A339,FILTRO.12!A21:K350,5,FALSE),0)","v":0}]
["80308018","0308018","Proteínas totales o albúmina (proc. aut.) c/u",0,{"$f":"IFERROR(VLOOKUP($A340,FILTRO.12!A22:K351,3,FALSE),0)","v":0},{"$f":"IFERROR(VLOOKUP($A340,FILTRO.12!A22:K351,4,FALSE),0)","v":0},{"$f":"IFERROR(VLOOKUP($A340,FILTRO.12!A22:K351,5,FALSE),0)","v":25}]
["80308019","0308019","Proteínas, electroforesis de (incluye proteínas totales)",0,{"$f":"IFERROR(VLOOKUP($A341,FILTRO.12!A23:K352,3,FALSE),0)","v":0},{"$f":"IFERROR(VLOOKUP($A341,FILTRO.12!A23:K352,4,FALSE),0)","v":0},{"$f":"IFERROR(VLOOKUP($A341,FILTRO.12!A23:K352,5,FALSE),0)","v":0}]
["80308020","0308020","Bandas oligoclonales (incluye electroforesis de L.C.R., suero e inmunofijación)",0,{"$f":"IFERROR(VLOOKUP($A342,FILTRO.12!A24:K353,3,FALSE),0)","v":0},{"$f":"IFERROR(VLOOKUP($A342,FILTRO.12!A24:K353,4,FALSE),0)","v":0},{"$f":"IFERROR(VLOOKUP($A342,FILTRO.12!A24:K353,5,FALSE),0)","v":0}]
["80308021","0308021","Glutamina",0,{"$f":"IFERROR(VLOOKUP($A343,FILTRO.12!A25:K354,3,FALSE),0)","v":0},{"$f":"IFERROR(VLOOKUP($A343,FILTRO.12!A25:K354,4,FALSE),0)","v":0},{"$f":"IFERROR(VLOOKUP($A343,FILTRO.12!A25:K354,5,FALSE),0)","v":0}]
["80308022","0308022","Indice IgG/albúmina (incluye determ. de IgG y albúmina en L.C.R. y suero)",0,{"$f":"IFERROR(VLOOKUP($A344,FILTRO.12!A26:K355,3,FALSE),0)","v":0},{"$f":"IFERROR(VLOOKUP($A344,FILTRO.12!A26:K355,4,FALSE),0)","v":0},{"$f":"IFERROR(VLOOKUP($A344,FILTRO.12!A26:K355,5,FALSE),0)","v":6}]
["80308023","0308023","Estudio de cristales (con luz polarizada)",0,{"$f":"IFERROR(VLOOKUP($A345,FILTRO.12!A27:K356,3,FALSE),0)","v":0},{"$f":"IFERROR(VLOOKUP($A345,FILTRO.12!A27:K356,4,FALSE),0)","v":0},{"$f":"IFERROR(VLOOKUP($A345,FILTRO.12!A27:K356,5,FALSE),0)","v":0}]
["80308024","0308024","Acidez titulable, pH, volumen (una muestra)",0,{"$f":"IFERROR(VLOOKUP($A346,FILTRO.12!A28:K357,3,FALSE),0)","v":0},{"$f":"IFERROR(VLOOKUP($A346,FILTRO.12!A28:K357,4,FALSE),0)","v":0},{"$f":"IFERROR(VLOOKUP($A346,FILTRO.12!A28:K357,5,FALSE),0)","v":0}]
["80308025","0308025","Prueba de estimulación máxima con histamina, mínimo 5 muestras (no incluye la histamina ni el antihistamínico).",0,{"$f":"IFERROR(VLOOKUP($A347,FILTRO.12!A29:K358,3,FALSE),0)","v":0},{"$f":"IFERROR(VLOOKUP($A347,FILTRO.12!A29:K358,4,FALSE),0)","v":0},{"$f":"IFERROR(VLOOKUP($A347,FILTRO.12!A29:K358,5,FALSE),0)","v":0}]
["80308026","0308026","Volumen, anhídrido carbónico, amilasa y lipasa",0,{"$f":"IFERROR(VLOOKUP($A348,FILTRO.12!A30:K359,3,FALSE),0)","v":0},{"$f":"IFERROR(VLOOKUP($A348,FILTRO.12!A30:K359,4,FALSE),0)","v":0},{"$f":"IFERROR(VLOOKUP($A348,FILTRO.12!A30:K359,5,FALSE),0)","v":0}]
["80308027","0308027","Cristales de colesterol",0,{"$f":"IFERROR(VLOOKUP($A349,FILTRO.12!A31:K360,3,FALSE),0)","v":0},{"$f":"IFERROR(VLOOKUP($A349,FILTRO.12!A31:K360,4,FALSE),0)","v":0},{"$f":"IFERROR(VLOOKUP($A349,FILTRO.12!A31:K360,5,FALSE),0)","v":0}]
["80308028","0308028","Lípidos biliares",0,{"$f":"IFERROR(VLOOKUP($A350,FILTRO.12!A32:K361,3,FALSE),0)","v":0},{"$f":"IFERROR(VLOOKUP($A350,FILTRO.12!A32:K361,4,FALSE),0)","v":0},{"$f":"IFERROR(VLOOKUP($A350,FILTRO.12!A32:K361,5,FALSE),0)","v":0}]
["80308029","0308029","Espermiograma (físico y microscópico, con o sin observación hasta 24 horas)",0,{"$f":"IFERROR(VLOOKUP($A351,FILTRO.12!A33:K362,3,FALSE),0)","v":0},{"$f":"IFERROR(VLOOKUP($A351,FILTRO.12!A33:K362,4,FALSE),0)","v":0},{"$f":"IFERROR(VLOOKUP($A351,FILTRO.12!A33:K362,5,FALSE),0)","v":0}]
["80308030","0308030","Fosfatasa ácida prostática",0,{"$f":"IFERROR(VLOOKUP($A352,FILTRO.12!A34:K363,3,FALSE),0)","v":0},{"$f":"IFERROR(VLOOKUP($A352,FILTRO.12!A34:K363,4,FALSE),0)","v":0},{"$f":"IFERROR(VLOOKUP($A352,FILTRO.12!A34:K363,5,FALSE),0)","v":0}]
["80308031","0308031","Fructosa, consumo de",0,{"$f":"IFERROR(VLOOKUP($A353,FILTRO.12!A35:K364,3,FALSE),0)","v":0},{"$f":"IFERROR(VLOOKUP($A353,FILTRO.12!A35:K364,4,FALSE),0)","v":0},{"$f":"IFERROR(VLOOKUP($A353,FILTRO.12!A35:K364,5,FALSE),0)","v":0}]
["80308032","0308032","Bilirrubina                               ",0,{"$f":"IFERROR(VLOOKUP($A354,FILTRO.12!A36:K365,3,FALSE),0)","v":0},{"$f":"IFERROR(VLOOKUP($A354,FILTRO.12!A36:K365,4,FALSE),0)","v":0},{"$f":"IFERROR(VLOOKUP($A354,FILTRO.12!A36:K365,5,FALSE),0)","v":0}]
["80308033","0308033","Células anaranjadas (proc. aut.)",0,{"$f":"IFERROR(VLOOKUP($A355,FILTRO.12!A37:K366,3,FALSE),0)","v":0},{"$f":"IFERROR(VLOOKUP($A355,FILTRO.12!A37:K366,4,FALSE),0)","v":0},{"$f":"IFERROR(VLOOKUP($A355,FILTRO.12!A37:K366,5,FALSE),0)","v":0}]
["80308034","0308034","Contaminantes (meconio y sangre) (proc. aut.)",0,{"$f":"IFERROR(VLOOKUP($A356,FILTRO.12!A38:K367,3,FALSE),0)","v":0},{"$f":"IFERROR(VLOOKUP($A356,FILTRO.12!A38:K367,4,FALSE),0)","v":0},{"$f":"IFERROR(VLOOKUP($A356,FILTRO.12!A38:K367,5,FALSE),0)","v":0}]
["80308035","0308035","Creatinina (proc. aut.)",0,{"$f":"IFERROR(VLOOKUP($A357,FILTRO.12!A39:K368,3,FALSE),0)","v":0},{"$f":"IFERROR(VLOOKUP($A357,FILTRO.12!A39:K368,4,FALSE),0)","v":0},{"$f":"IFERROR(VLOOKUP($A357,FILTRO.12!A39:K368,5,FALSE),0)","v":6}]
["80308036","0308036","Fosfatidil glicerol y/o fosfatidil inositol",0,{"$f":"IFERROR(VLOOKUP($A358,FILTRO.12!A40:K369,3,FALSE),0)","v":0},{"$f":"IFERROR(VLOOKUP($A358,FILTRO.12!A40:K369,4,FALSE),0)","v":0},{"$f":"IFERROR(VLOOKUP($A358,FILTRO.12!A40:K369,5,FALSE),0)","v":0}]
["80308037","0308037","Indice de bilirrubina (prueba de Liley)",0,{"$f":"IFERROR(VLOOKUP($A359,FILTRO.12!A41:K370,3,FALSE),0)","v":0},{"$f":"IFERROR(VLOOKUP($A359,FILTRO.12!A41:K370,4,FALSE),0)","v":0},{"$f":"IFERROR(VLOOKUP($A359,FILTRO.12!A41:K370,5,FALSE),0)","v":462}]
["80308038","0308038","Indice lecitina/esfingomielina",0,{"$f":"IFERROR(VLOOKUP($A360,FILTRO.12!A42:K371,3,FALSE),0)","v":0},{"$f":"IFERROR(VLOOKUP($A360,FILTRO.12!A42:K371,4,FALSE),0)","v":0},{"$f":"IFERROR(VLOOKUP($A360,FILTRO.12!A42:K371,5,FALSE),0)","v":0}]
["80308039","0308039","Madurez fetal completa (físico; células anaranjadas, bilirrubina, test de Clements, creatinina, contaminantes)",0,{"$f":"IFERROR(VLOOKUP($A361,FILTRO.12!A43:K372,3,FALSE),0)","v":0},{"$f":"IFERROR(VLOOKUP($A361,FILTRO.12!A43:K372,4,FALSE),0)","v":0},{"$f":"IFERROR(VLOOKUP($A361,FILTRO.12!A43:K372,5,FALSE),0)","v":0}]
["80308040","0308040","Test de Clements (proc. aut.)",0,{"$f":"IFERROR(VLOOKUP($A362,FILTRO.12!A44:K373,3,FALSE),0)","v":0},{"$f":"IFERROR(VLOOKUP($A362,FILTRO.12!A44:K373,4,FALSE),0)","v":0},{"$f":"IFERROR(VLOOKUP($A362,FILTRO.12!A44:K373,5,FALSE),0)","v":0}]
["80308041","0308041","Colpocitograma",0,{"$f":"IFERROR(VLOOKUP($A363,FILTRO.12!A45:K374,3,FALSE),0)","v":0},{"$f":"IFERROR(VLOOKUP($A363,FILTRO.12!A45:K374,4,FALSE),0)","v":0},{"$f":"IFERROR(VLOOKUP($A363,FILTRO.12!A45:K374,5,FALSE),0)","v":0}]
["80308042","0308042","Cristalización y filancia de moco cervical",0,{"$f":"IFERROR(VLOOKUP($A364,FILTRO.12!A46:K375,3,FALSE),0)","v":0},{"$f":"IFERROR(VLOOKUP($A364,FILTRO.12!A46:K375,4,FALSE),0)","v":0},{"$f":"IFERROR(VLOOKUP($A364,FILTRO.12!A46:K375,5,FALSE),0)","v":0}]
["80308043","0308043","Moco-semen, prueba de compatibilidad",0,{"$f":"IFERROR(VLOOKUP($A365,FILTRO.12!A47:K376,3,FALSE),0)","v":0},{"$f":"IFERROR(VLOOKUP($A365,FILTRO.12!A47:K376,4,FALSE),0)","v":0},{"$f":"IFERROR(VLOOKUP($A365,FILTRO.12!A47:K376,5,FALSE),0)","v":0}]
["80308044","0308044","Flujo vaginal o secreción uretral, estudio de (incluye toma de muestra y códigos 03-06-004, 03-06-005, 03-06-008, 03-06-017, y 03-06-026 )",391,{"$f":"IFERROR(VLOOKUP($A366,FILTRO.12!A48:K377,3,FALSE),0)","v":0},{"$f":"IFERROR(VLOOKUP($A366,FILTRO.12!A48:K377,4,FALSE),0)","v":391},{"$f":"IFERROR(VLOOKUP($A366,FILTRO.12!A48:K377,5,FALSE),0)","v":346}]
[null,"TOTAL",null,{"$f":"SUM(D323:D366)","v":{"v":3679,"d":"3,679"}},{"$f":"SUM(E323:E366)","v":0},{"$f":"SUM(F323:F366)","v":{"v":3679,"d":"3,679"}},{"$f":"SUM(G323:G366)","v":{"v":2937,"d":"2,937"}}]
[]
[null,"EXÁMENES DE ORINA"]
["80309001","0309001","Acido ascórbico",{"$f":"SUM(E370:F370)","v":0},{"$f":"IFERROR(VLOOKUP($A370,FILTRO.12!A5:K334,3,FALSE),0)","v":0},{"$f":"IFERROR(VLOOKUP($A370,FILTRO.12!A5:K334,4,FALSE),0)","v":0},{"$f":"IFERROR(VLOOKUP($A370,FILTRO.12!A5:K334,5,FALSE),0)","v":0}]
["80309002","0309002","Acido delta aminolevulínico",0,{"$f":"IFERROR(VLOOKUP($A371,FILTRO.12!A6:K335,3,FALSE),0)","v":0},{"$f":"IFERROR(VLOOKUP($A371,FILTRO.12!A6:K335,4,FALSE),0)","v":0},{"$f":"IFERROR(VLOOKUP($A371,FILTRO.12!A6:K335,5,FALSE),0)","v":0}]
["80309003","0309003","Acido fenilpirúvico (PKU, cualitativo)",0,{"$f":"IFERROR(VLOOKUP($A372,FILTRO.12!A7:K336,3,FALSE),0)","v":0},{"$f":"IFERROR(VLOOKUP($A372,FILTRO.12!A7:K336,4,FALSE),0)","v":0},{"$f":"IFERROR(VLOOKUP($A372,FILTRO.12!A7:K336,5,FALSE),0)","v":0}]
["80309004","0309004","Acido úrico cuantitativo",0,{"$f":"IFERROR(VLOOKUP($A373,FILTRO.12!A8:K337,3,FALSE),0)","v":0},{"$f":"IFERROR(VLOOKUP($A373,FILTRO.12!A8:K337,4,FALSE),0)","v":0},{"$f":"IFERROR(VLOOKUP($A373,FILTRO.12!A8:K337,5,FALSE),0)","v":{"v":1237,"d":"1,237"}}]
["80309005","0309005","Acido 5 hidroxiindolacético cuantitativo",0,{"$f":"IFERROR(VLOOKUP($A374,FILTRO.12!A9:K338,3,FALSE),0)","v":0},{"$f":"IFERROR(VLOOKUP($A374,FILTRO.12!A9:K338,4,FALSE),0)","v":0},{"$f":"IFERROR(VLOOKUP($A374,FILTRO.12!A9:K338,5,FALSE),0)","v":0}]
["80309006","0309006","Amilasa cuantitativa en orina",0,{"$f":"IFERROR(VLOOKUP($A375,FILTRO.12!A10:K339,3,FALSE),0)","v":0},{"$f":"IFERROR(VLOOKUP($A375,FILTRO.12!A10:K339,4,FALSE),0)","v":0},{"$f":"IFERROR(VLOOKUP($A375,FILTRO.12!A10:K339,5,FALSE),0)","v":0}]
["80309007","0309007","Aminoácidos (cualitativo) (excepto fenilalanina, PKU)",0,{"$f":"IFERROR(VLOOKUP($A376,FILTRO.12!A11:K340,3,FALSE),0)","v":0},{"$f":"IFERROR(VLOOKUP($A376,FILTRO.12!A11:K340,4,FALSE),0)","v":0},{"$f":"IFERROR(VLOOKUP($A376,FILTRO.12!A11:K340,5,FALSE),0)","v":0}]
["80309008","0309008","Calcio cuantitativo en orina",0,{"$f":"IFERROR(VLOOKUP($A377,FILTRO.12!A12:K341,3,FALSE),0)","v":0},{"$f":"IFERROR(VLOOKUP($A377,FILTRO.12!A12:K341,4,FALSE),0)","v":0},{"$f":"IFERROR(VLOOKUP($A377,FILTRO.12!A12:K341,5,FALSE),0)","v":147}]
["80309009","0309009","Cálculo urinario (examen físico y químico)",0,{"$f":"IFERROR(VLOOKUP($A378,FILTRO.12!A13:K342,3,FALSE),0)","v":0},{"$f":"IFERROR(VLOOKUP($A378,FILTRO.12!A13:K342,4,FALSE),0)","v":0},{"$f":"IFERROR(VLOOKUP($A378,FILTRO.12!A13:K342,5,FALSE),0)","v":0}]
["80309010","0309010","Creatinina cuantitativa en orina",{"v":26436,"d":"26,436"},{"$f":"IFERROR(VLOOKUP($A379,FILTRO.12!A14:K343,3,FALSE),0)","v":0},{"$f":"IFERROR(VLOOKUP($A379,FILTRO.12!A14:K343,4,FALSE),0)","v":{"v":26436,"d":"26,436"}},{"$f":"IFERROR(VLOOKUP($A379,FILTRO.12!A14:K343,5,FALSE),0)","v":{"v":31991,"d":"31,991"}}]
["80309011","0309011","Cuerpos cetónicos",0,{"$f":"IFERROR(VLOOKUP($A380,FILTRO.12!A15:K344,3,FALSE),0)","v":0},{"$f":"IFERROR(VLOOKUP($A380,FILTRO.12!A15:K344,4,FALSE),0)","v":0},{"$f":"IFERROR(VLOOKUP($A380,FILTRO.12!A15:K344,5,FALSE),0)","v":235}]
["80309012","0309012","Electrolitos (sodio, potasio, cloro) c/u en orina",0,{"$f":"IFERROR(VLOOKUP($A381,FILTRO.12!A16:K345,3,FALSE),0)","v":0},{"$f":"IFERROR(VLOOKUP($A381,FILTRO.12!A16:K345,4,FALSE),0)","v":0},{"$f":"IFERROR(VLOOKUP($A381,FILTRO.12!A16:K345,5,FALSE),0)","v":264}]
["80309013","0309013","Microalbuminuria cuantitativa",{"v":33456,"d":"33,456"},{"$f":"IFERROR(VLOOKUP($A382,FILTRO.12!A17:K346,3,FALSE),0)","v":0},{"$f":"IFERROR(VLOOKUP($A382,FILTRO.12!A17:K346,4,FALSE),0)","v":{"v":33456,"d":"33,456"}},{"$f":"IFERROR(VLOOKUP($A382,FILTRO.12!A17:K346,5,FALSE),0)","v":{"v":43215,"d":"43,215"}}]
["80309014","0309014","Embarazo, detección de (cualquier técnica)",266,{"$f":"IFERROR(VLOOKUP($A383,FILTRO.12!A18:K347,3,FALSE),0)","v":103},{"$f":"IFERROR(VLOOKUP($A383,FILTRO.12!A18:K347,4,FALSE),0)","v":163},{"$f":"IFERROR(VLOOKUP($A383,FILTRO.12!A18:K347,5,FALSE),0)","v":220}]
["80309040","0309040","Fenilquetonuria (PKU), cuantitativo",0,{"$f":"IFERROR(VLOOKUP($A384,FILTRO.12!A19:K348,3,FALSE),0)","v":0},{"$f":"IFERROR(VLOOKUP($A384,FILTRO.12!A19:K348,4,FALSE),0)","v":0},{"$f":"IFERROR(VLOOKUP($A384,FILTRO.12!A19:K348,5,FALSE),0)","v":0}]
["80309015","0309015","Fósforo cuantitativo en orina",0,{"$f":"IFERROR(VLOOKUP($A385,FILTRO.12!A20:K349,3,FALSE),0)","v":0},{"$f":"IFERROR(VLOOKUP($A385,FILTRO.12!A20:K349,4,FALSE),0)","v":0},{"$f":"IFERROR(VLOOKUP($A385,FILTRO.12!A20:K349,5,FALSE),0)","v":57}]
["80309016","0309016","Glucosa (cuantitativo) en orina",{"v":1140,"d":"1,140"},{"$f":"IFERROR(VLOOKUP($A386,FILTRO.12!A21:K350,3,FALSE),0)","v":0},{"$f":"IFERROR(VLOOKUP($A386,FILTRO.12!A21:K350,4,FALSE),0)","v":{"v":1140,"d":"1,140"}},{"$f":"IFERROR(VLOOKUP($A386,FILTRO.12!A21:K350,5,FALSE),0)","v":0}]
["80309035","0309035","Hemosiderina",0,{"$f":"IFERROR(VLOOKUP($A387,FILTRO.12!A22:K351,3,FALSE),0)","v":0},{"$f":"IFERROR(VLOOKUP($A387,FILTRO.12!A22:K351,4,FALSE),0)","v":0},{"$f":"IFERROR(VLOOKUP($A387,FILTRO.12!A22:K351,5,FALSE),0)","v":0}]
["80309017","0309017","Hidroxiprolina en orina",0,{"$f":"IFERROR(VLOOKUP($A388,FILTRO.12!A23:K352,3,FALSE),0)","v":0},{"$f":"IFERROR(VLOOKUP($A388,FILTRO.12!A23:K352,4,FALSE),0)","v":0},{"$f":"IFERROR(VLOOKUP($A388,FILTRO.12!A23:K352,5,FALSE),0)","v":0}]
["80309018","0309018","Melanogenuria (test de cloruro férrico)",0,{"$f":"IFERROR(VLOOKUP($A389,FILTRO.12!A24:K353,3,FALSE),0)","v":0},{"$f":"IFERROR(VLOOKUP($A389,FILTRO.12!A24:K353,4,FALSE),0)","v":0},{"$f":"IFERROR(VLOOKUP($A389,FILTRO.12!A24:K353,5,FALSE),0)","v":0}]
["80309019","0309019","Mucopolisacáridos",0,{"$f":"IFERROR(VLOOKUP($A390,FILTRO.12!A25:K354,3,FALSE),0)","v":0},{"$f":"IFERROR(VLOOKUP($A390,FILTRO.12!A25:K354,4,FALSE),0)","v":0},{"$f":"IFERROR(VLOOKUP($A390,FILTRO.12!A25:K354,5,FALSE),0)","v":0}]
["80309020","0309020","Nitrógeno ureico o urea en orina (cuantitativo)",0,{"$f":"IFERROR(VLOOKUP($A391,FILTRO.12!A26:K355,3,FALSE),0)","v":0},{"$f":"IFERROR(VLOOKUP($A391,FILTRO.12!A26:K355,4,FALSE),0)","v":0},{"$f":"IFERROR(VLOOKUP($A391,FILTRO.12!A26:K355,5,FALSE),0)","v":41}]
["80309021","0309021","Nucleótidos cíclicos (CAMP, CGM, u otros) c/u",0,{"$f":"IFERROR(VLOOKUP($A392,FILTRO.12!A27:K356,3,FALSE),0)","v":0},{"$f":"IFERROR(VLOOKUP($A392,FILTRO.12!A27:K356,4,FALSE),0)","v":0},{"$f":"IFERROR(VLOOKUP($A392,FILTRO.12!A27:K356,5,FALSE),0)","v":0}]
["80309022","0309022","Orina completa, (incluye cód. 03-09-023 y 03-09-024)",{"v":46038,"d":"46,038"},{"$f":"IFERROR(VLOOKUP($A393,FILTRO.12!A28:K357,3,FALSE),0)","v":60},{"$f":"IFERROR(VLOOKUP($A393,FILTRO.12!A28:K357,4,FALSE),0)","v":{"v":45978,"d":"45,978"}},{"$f":"IFERROR(VLOOKUP($A393,FILTRO.12!A28:K357,5,FALSE),0)","v":{"v":90871,"d":"90,871"}}]
["80309023","0309023","Orina, físico-químico (aspecto, color, densidad, pH, proteínas, glucosa, cuerpos cetónicos, urobilinógeno, bilirrubina, hemoglobina y nitritos) todos o cada uno de los parámetros (proc. aut.)",{"v":2364,"d":"2,364"},{"$f":"IFERROR(VLOOKUP($A394,FILTRO.12!A29:K358,3,FALSE),0)","v":{"v":2287,"d":"2,287"}},{"$f":"IFERROR(VLOOKUP($A394,FILTRO.12!A29:K358,4,FALSE),0)","v":77},{"$f":"IFERROR(VLOOKUP($A394,FILTRO.12!A29:K358,5,FALSE),0)","v":{"v":3769,"d":"3,769"}}]
["80309024","0309024","Orina, sedimento (proc. aut.)",501,{"$f":"IFERROR(VLOOKUP($A395,FILTRO.12!A30:K359,3,FALSE),0)","v":175},{"$f":"IFERROR(VLOOKUP($A395,FILTRO.12!A30:K359,4,FALSE),0)","v":326},{"$f":"IFERROR(VLOOKUP($A395,FILTRO.12!A30:K359,5,FALSE),0)","v":{"v":9053,"d":"9,053"}}]
["80309025","0309025","Osmolalidad",0,{"$f":"IFERROR(VLOOKUP($A396,FILTRO.12!A31:K360,3,FALSE),0)","v":0},{"$f":"IFERROR(VLOOKUP($A396,FILTRO.12!A31:K360,4,FALSE),0)","v":0},{"$f":"IFERROR(VLOOKUP($A396,FILTRO.12!A31:K360,5,FALSE),0)","v":0}]
["80309027","0309027","Porfirinas, c/u",0,{"$f":"IFERROR(VLOOKUP($A397,FILTRO.12!A32:K361,3,FALSE),0)","v":0},{"$f":"IFERROR(VLOOKUP($A397,FILTRO.12!A32:K361,4,FALSE),0)","v":0},{"$f":"IFERROR(VLOOKUP($A397,FILTRO.12!A32:K361,5,FALSE),0)","v":0}]
["80309028","0309028","Proteína (cuantitativa) en orina",645,{"$f":"IFERROR(VLOOKUP($A398,FILTRO.12!A33:K362,3,FALSE),0)","v":0},{"$f":"IFERROR(VLOOKUP($A398,FILTRO.12!A33:K362,4,FALSE),0)","v":645},{"$f":"IFERROR(VLOOKUP($A398,FILTRO.12!A33:K362,5,FALSE),0)","v":{"v":7784,"d":"7,784"}}]
["80309029","0309029","Proteínas de Bence-Jones prueba térmica",0,{"$f":"IFERROR(VLOOKUP($A399,FILTRO.12!A34:K363,3,FALSE),0)","v":0},{"$f":"IFERROR(VLOOKUP($A399,FILTRO.12!A34:K363,4,FALSE),0)","v":0},{"$f":"IFERROR(VLOOKUP($A399,FILTRO.12!A34:K363,5,FALSE),0)","v":0}]
[null,"TOTAL",null,{"$f":"SUM(D370:D399)","v":{"v":110846,"d":"110,846"}},{"$f":"SUM(E370:E399)","v":{"v":2625,"d":"2,625"}},{"$f":"SUM(F370:F399)","v":{"v":108221,"d":"108,221"}},{"$f":"SUM(G370:G399)","v":{"v":188884,"d":"188,884"}}]
[null,"TOTAL EXÁMENES",null,{"$f":"+D98+D170+D179+D239+D320+D367+D400","v":{"v":620933,"d":"620,933"}},{"$f":"+E98+E170+E179+E239+E320+E367+E400","v":{"v":3129,"d":"3,129"}},{"$f":"+F98+F170+F179+F239+F320+F367+F400","v":{"v":617804,"d":"617,804"}},{"$f":"+G98+G170+G179+G239+G320+G367+G400","v":{"v":1323409,"d":"1,323,409"}}]
[]
[null,"EXÁMENES RADIOLÓGICOS"]
["80401001","0401001","Radiografía de las glándulas salivales \"sialografía\"",{"$f":"SUM(E404:F404)","v":11},{"$f":"IFERROR(VLOOKUP($A404,FILTRO.12!A5:K334,3,FALSE),0)","v":11},{"$f":"IFERROR(VLOOKUP($A404,FILTRO.12!A5:K334,4,FALSE),0)","v":0},{"$f":"IFERROR(VLOOKUP($A404,FILTRO.12!A5:K334,5,FALSE),0)","v":0}]
["80401002","0401002","Radiografía de partes blandas, laringe lateral, cavum rinofaríngeo (rinofarinx). ",{"$f":"SUM(E405:F405)","v":324},{"$f":"IFERROR(VLOOKUP($A405,FILTRO.12!A6:K335,3,FALSE),0)","v":324},{"$f":"IFERROR(VLOOKUP($A405,FILTRO.12!A6:K335,4,FALSE),0)","v":0},{"$f":"IFERROR(VLOOKUP($A405,FILTRO.12!A6:K335,5,FALSE),0)","v":319}]
["80401003","0401003","Planigrafías laringe  (4 EXP.)                     ",0,{"$f":"IFERROR(VLOOKUP($A406,FILTRO.12!A7:K336,3,FALSE),0)","v":0},{"$f":"IFERROR(VLOOKUP($A406,FILTRO.12!A7:K336,4,FALSE),0)","v":0},{"$f":"IFERROR(VLOOKUP($A406,FILTRO.12!A7:K336,5,FALSE),0)","v":0}]
["80401004","0401004","Radiografía de tórax, proyección complementaria (oblicuas, selectivas u otras)",0,{"$f":"IFERROR(VLOOKUP($A407,FILTRO.12!A8:K337,3,FALSE),0)","v":0},{"$f":"IFERROR(VLOOKUP($A407,FILTRO.12!A8:K337,4,FALSE),0)","v":0},{"$f":"IFERROR(VLOOKUP($A407,FILTRO.12!A8:K337,5,FALSE),0)","v":0}]
["80401005","0401005","Tórax, proyección complementaria de corazón (oblicuas u otras) (1 exp.) c/u       ",0,{"$f":"IFERROR(VLOOKUP($A408,FILTRO.12!A9:K338,3,FALSE),0)","v":0},{"$f":"IFERROR(VLOOKUP($A408,FILTRO.12!A9:K338,4,FALSE),0)","v":0},{"$f":"IFERROR(VLOOKUP($A408,FILTRO.12!A9:K338,5,FALSE),0)","v":0}]
["80401006","0401006","Estudio radiológico de corazón (incluye fluoroscopía, telerradiografías frontal y lateral con esofagograma) ",0,{"$f":"IFERROR(VLOOKUP($A409,FILTRO.12!A10:K339,3,FALSE),0)","v":0},{"$f":"IFERROR(VLOOKUP($A409,FILTRO.12!A10:K339,4,FALSE),0)","v":0},{"$f":"IFERROR(VLOOKUP($A409,FILTRO.12!A10:K339,5,FALSE),0)","v":0}]
["80401007","0401007","Planigrafia localizada (incluye mínimo 6 cortes) (6 exp.)     ",0,{"$f":"IFERROR(VLOOKUP($A410,FILTRO.12!A11:K340,3,FALSE),0)","v":0},{"$f":"IFERROR(VLOOKUP($A410,FILTRO.12!A11:K340,4,FALSE),0)","v":0},{"$f":"IFERROR(VLOOKUP($A410,FILTRO.12!A11:K340,5,FALSE),0)","v":0}]
["80401008","0401008","Radiografía de tórax  frontal o lateral con equipo móvil fuera del departamento de rayos.",0,{"$f":"IFERROR(VLOOKUP($A411,FILTRO.12!A12:K341,3,FALSE),0)","v":0},{"$f":"IFERROR(VLOOKUP($A411,FILTRO.12!A12:K341,4,FALSE),0)","v":0},{"$f":"IFERROR(VLOOKUP($A411,FILTRO.12!A12:K341,5,FALSE),0)","v":0}]
["80401009","0401009","Radiografía de tórax simple frontal o lateral ",{"v":1345,"d":"1,345"},{"$f":"IFERROR(VLOOKUP($A412,FILTRO.12!A13:K342,3,FALSE),0)","v":979},{"$f":"IFERROR(VLOOKUP($A412,FILTRO.12!A13:K342,4,FALSE),0)","v":366},{"$f":"IFERROR(VLOOKUP($A412,FILTRO.12!A13:K342,5,FALSE),0)","v":920}]
["80401070","0401070","Radiografía de tórax frontal y lateral",{"v":12293,"d":"12,293"},{"$f":"IFERROR(VLOOKUP($A413,FILTRO.12!A14:K343,3,FALSE),0)","v":{"v":9414,"d":"9,414"}},{"$f":"IFERROR(VLOOKUP($A413,FILTRO.12!A14:K343,4,FALSE),0)","v":{"v":2879,"d":"2,879"}},{"$f":"IFERROR(VLOOKUP($A413,FILTRO.12!A14:K343,5,FALSE),0)","v":{"v":7178,"d":"7,178"}}]
["80401010","0401010","Mamografía bilateral",{"v":2207,"d":"2,207"},{"$f":"IFERROR(VLOOKUP($A414,FILTRO.12!A15:K344,3,FALSE),0)","v":0},{"$f":"IFERROR(VLOOKUP($A414,FILTRO.12!A15:K344,4,FALSE),0)","v":{"v":2207,"d":"2,207"}},{"$f":"IFERROR(VLOOKUP($A414,FILTRO.12!A15:K344,5,FALSE),0)","v":{"v":3617,"d":"3,617"}}]
["80401110","0401110","Mamografía unilateral",275,{"$f":"IFERROR(VLOOKUP($A415,FILTRO.12!A16:K345,3,FALSE),0)","v":0},{"$f":"IFERROR(VLOOKUP($A415,FILTRO.12!A16:K345,4,FALSE),0)","v":275},{"$f":"IFERROR(VLOOKUP($A415,FILTRO.12!A16:K345,5,FALSE),0)","v":282}]
["80401130","0401130","Mamografía proyección complementaria  (axilar u otras)",0,{"$f":"IFERROR(VLOOKUP($A416,FILTRO.12!A17:K346,3,FALSE),0)","v":0},{"$f":"IFERROR(VLOOKUP($A416,FILTRO.12!A17:K346,4,FALSE),0)","v":0},{"$f":"IFERROR(VLOOKUP($A416,FILTRO.12!A17:K346,5,FALSE),0)","v":0}]
["80401011","0401011","Marcación preoperatoria de lesiones de la mama",0,{"$f":"IFERROR(VLOOKUP($A417,FILTRO.12!A18:K347,3,FALSE),0)","v":0},{"$f":"IFERROR(VLOOKUP($A417,FILTRO.12!A18:K347,4,FALSE),0)","v":0},{"$f":"IFERROR(VLOOKUP($A417,FILTRO.12!A18:K347,5,FALSE),0)","v":0}]
["80401012","0401012","Radiografía de mama, pieza operatoria",0,{"$f":"IFERROR(VLOOKUP($A418,FILTRO.12!A19:K348,3,FALSE),0)","v":0},{"$f":"IFERROR(VLOOKUP($A418,FILTRO.12!A19:K348,4,FALSE),0)","v":0},{"$f":"IFERROR(VLOOKUP($A418,FILTRO.12!A19:K348,5,FALSE),0)","v":0}]
["80401013","0401013","Radiografía de Abdomen Simple",{"v":1101,"d":"1,101"},{"$f":"IFERROR(VLOOKUP($A419,FILTRO.12!A20:K349,3,FALSE),0)","v":{"v":1101,"d":"1,101"}},{"$f":"IFERROR(VLOOKUP($A419,FILTRO.12!A20:K349,4,FALSE),0)","v":0},{"$f":"IFERROR(VLOOKUP($A419,FILTRO.12!A20:K349,5,FALSE),0)","v":318}]
["80401014","0401014","Radiografía de abdomen simple, proyección complementaria (lateral y/o oblicua)",88,{"$f":"IFERROR(VLOOKUP($A420,FILTRO.12!A21:K350,3,FALSE),0)","v":88},{"$f":"IFERROR(VLOOKUP($A420,FILTRO.12!A21:K350,4,FALSE),0)","v":0},{"$f":"IFERROR(VLOOKUP($A420,FILTRO.12!A21:K350,5,FALSE),0)","v":8}]
["80401015","0401015","Colangiografía intra o postoperatoria (por sonda T, o similar)",0,{"$f":"IFERROR(VLOOKUP($A421,FILTRO.12!A22:K351,3,FALSE),0)","v":0},{"$f":"IFERROR(VLOOKUP($A421,FILTRO.12!A22:K351,4,FALSE),0)","v":0},{"$f":"IFERROR(VLOOKUP($A421,FILTRO.12!A22:K351,5,FALSE),0)","v":0}]
["80401016","0401016","Colangiografía medica con planigrafía (6 exp.)        ",0,{"$f":"IFERROR(VLOOKUP($A422,FILTRO.12!A23:K352,3,FALSE),0)","v":0},{"$f":"IFERROR(VLOOKUP($A422,FILTRO.12!A23:K352,4,FALSE),0)","v":0},{"$f":"IFERROR(VLOOKUP($A422,FILTRO.12!A23:K352,5,FALSE),0)","v":0}]
["80401017","0401017","Colecistografía c/s seriografía (34 exp.)                ",0,{"$f":"IFERROR(VLOOKUP($A423,FILTRO.12!A24:K353,3,FALSE),0)","v":0},{"$f":"IFERROR(VLOOKUP($A423,FILTRO.12!A24:K353,4,FALSE),0)","v":0},{"$f":"IFERROR(VLOOKUP($A423,FILTRO.12!A24:K353,5,FALSE),0)","v":0}]
["80401018","0401018","Enema baritado del colon (incluye llene y control post-vaciamiento)",0,{"$f":"IFERROR(VLOOKUP($A424,FILTRO.12!A25:K354,3,FALSE),0)","v":0},{"$f":"IFERROR(VLOOKUP($A424,FILTRO.12!A25:K354,4,FALSE),0)","v":0},{"$f":"IFERROR(VLOOKUP($A424,FILTRO.12!A25:K354,5,FALSE),0)","v":0}]
["80401019","0401019","Enema baritado del colon o intestino delgado, doble contraste",0,{"$f":"IFERROR(VLOOKUP($A425,FILTRO.12!A26:K355,3,FALSE),0)","v":0},{"$f":"IFERROR(VLOOKUP($A425,FILTRO.12!A26:K355,4,FALSE),0)","v":0},{"$f":"IFERROR(VLOOKUP($A425,FILTRO.12!A26:K355,5,FALSE),0)","v":0}]
["80401020","0401020","Esofagograma  (incluye pesquisa de cuerpo extraño) (proc.aut.)",0,{"$f":"IFERROR(VLOOKUP($A426,FILTRO.12!A27:K356,3,FALSE),0)","v":0},{"$f":"IFERROR(VLOOKUP($A426,FILTRO.12!A27:K356,4,FALSE),0)","v":0},{"$f":"IFERROR(VLOOKUP($A426,FILTRO.12!A27:K356,5,FALSE),0)","v":0}]
["80401021","0401021","Radiografía de esófago, estómago y duodeno, relleno y/o doble contraste ",0,{"$f":"IFERROR(VLOOKUP($A427,FILTRO.12!A28:K357,3,FALSE),0)","v":0},{"$f":"IFERROR(VLOOKUP($A427,FILTRO.12!A28:K357,4,FALSE),0)","v":0},{"$f":"IFERROR(VLOOKUP($A427,FILTRO.12!A28:K357,5,FALSE),0)","v":0}]
["80401022","0401022","Estudio radiológico de deglución faríngea",0,{"$f":"IFERROR(VLOOKUP($A428,FILTRO.12!A29:K358,3,FALSE),0)","v":0},{"$f":"IFERROR(VLOOKUP($A428,FILTRO.12!A29:K358,4,FALSE),0)","v":0},{"$f":"IFERROR(VLOOKUP($A428,FILTRO.12!A29:K358,5,FALSE),0)","v":0}]
["80401023","0401023","Estudio radiológico del intestino delgado",0,{"$f":"IFERROR(VLOOKUP($A429,FILTRO.12!A30:K359,3,FALSE),0)","v":0},{"$f":"IFERROR(VLOOKUP($A429,FILTRO.12!A30:K359,4,FALSE),0)","v":0},{"$f":"IFERROR(VLOOKUP($A429,FILTRO.12!A30:K359,5,FALSE),0)","v":0}]
["80401024","0401024","Radiografía de esófago, estómago y duodeno, simple en niños ",0,{"$f":"IFERROR(VLOOKUP($A430,FILTRO.12!A31:K360,3,FALSE),0)","v":0},{"$f":"IFERROR(VLOOKUP($A430,FILTRO.12!A31:K360,4,FALSE),0)","v":0},{"$f":"IFERROR(VLOOKUP($A430,FILTRO.12!A31:K360,5,FALSE),0)","v":0}]
["80401026","0401026","Pielografía de eliminación con control minutado (10 exp.)",0,{"$f":"IFERROR(VLOOKUP($A431,FILTRO.12!A32:K361,3,FALSE),0)","v":0},{"$f":"IFERROR(VLOOKUP($A431,FILTRO.12!A32:K361,4,FALSE),0)","v":0},{"$f":"IFERROR(VLOOKUP($A431,FILTRO.12!A32:K361,5,FALSE),0)","v":0}]
["80401027","0401027","Pielografía de eliminación o descendente: incluye renal y vesical simples previas, 3 placas post inyección de medio de contraste, controles de pie y cistografía pre y post miccional. ",0,{"$f":"IFERROR(VLOOKUP($A432,FILTRO.12!A33:K362,3,FALSE),0)","v":0},{"$f":"IFERROR(VLOOKUP($A432,FILTRO.12!A33:K362,4,FALSE),0)","v":0},{"$f":"IFERROR(VLOOKUP($A432,FILTRO.12!A33:K362,5,FALSE),0)","v":0}]
["80401028","0401028","Radiografía renal simple (proc. aut.)",38,{"$f":"IFERROR(VLOOKUP($A433,FILTRO.12!A34:K363,3,FALSE),0)","v":38},{"$f":"IFERROR(VLOOKUP($A433,FILTRO.12!A34:K363,4,FALSE),0)","v":0},{"$f":"IFERROR(VLOOKUP($A433,FILTRO.12!A34:K363,5,FALSE),0)","v":1}]
["80401029","0401029","Radiografía vesical simple o perivesical (proc. aut.)",19,{"$f":"IFERROR(VLOOKUP($A434,FILTRO.12!A35:K364,3,FALSE),0)","v":19},{"$f":"IFERROR(VLOOKUP($A434,FILTRO.12!A35:K364,4,FALSE),0)","v":0},{"$f":"IFERROR(VLOOKUP($A434,FILTRO.12!A35:K364,5,FALSE),0)","v":1}]
["80401030","0401030","Radiografía agujeros ópticos, ambos lados",0,{"$f":"IFERROR(VLOOKUP($A435,FILTRO.12!A36:K365,3,FALSE),0)","v":0},{"$f":"IFERROR(VLOOKUP($A435,FILTRO.12!A36:K365,4,FALSE),0)","v":0},{"$f":"IFERROR(VLOOKUP($A435,FILTRO.12!A36:K365,5,FALSE),0)","v":0}]
["80401031","0401031","Radiografía de cavidades perinasales, órbitas, articulaciones temporomandibulares, huesos propios de la nariz, malar, maxilar, arco cigomático y cara",{"v":1741,"d":"1,741"},{"$f":"IFERROR(VLOOKUP($A436,FILTRO.12!A37:K366,3,FALSE),0)","v":{"v":1741,"d":"1,741"}},{"$f":"IFERROR(VLOOKUP($A436,FILTRO.12!A37:K366,4,FALSE),0)","v":0},{"$f":"IFERROR(VLOOKUP($A436,FILTRO.12!A37:K366,5,FALSE),0)","v":615}]
["80401032","0401032","Radiografía de cráneo frontal y lateral",{"v":2236,"d":"2,236"},{"$f":"IFERROR(VLOOKUP($A437,FILTRO.12!A38:K367,3,FALSE),0)","v":{"v":2236,"d":"2,236"}},{"$f":"IFERROR(VLOOKUP($A437,FILTRO.12!A38:K367,4,FALSE),0)","v":0},{"$f":"IFERROR(VLOOKUP($A437,FILTRO.12!A38:K367,5,FALSE),0)","v":493}]
["80401033","0401033","Radiografía de Cráneo  proyección especial de  base de cráneo (Towne)",169,{"$f":"IFERROR(VLOOKUP($A438,FILTRO.12!A39:K368,3,FALSE),0)","v":169},{"$f":"IFERROR(VLOOKUP($A438,FILTRO.12!A39:K368,4,FALSE),0)","v":0},{"$f":"IFERROR(VLOOKUP($A438,FILTRO.12!A39:K368,5,FALSE),0)","v":11}]
["80401034","0401034","Radiografía de globo ocular, estudio de cuerpo extraño",0,{"$f":"IFERROR(VLOOKUP($A439,FILTRO.12!A40:K369,3,FALSE),0)","v":0},{"$f":"IFERROR(VLOOKUP($A439,FILTRO.12!A40:K369,4,FALSE),0)","v":0},{"$f":"IFERROR(VLOOKUP($A439,FILTRO.12!A40:K369,5,FALSE),0)","v":0}]
["80401035","0401035","Radiografía de oído, uno o ambos ",0,{"$f":"IFERROR(VLOOKUP($A440,FILTRO.12!A41:K370,3,FALSE),0)","v":0},{"$f":"IFERROR(VLOOKUP($A440,FILTRO.12!A41:K370,4,FALSE),0)","v":0},{"$f":"IFERROR(VLOOKUP($A440,FILTRO.12!A41:K370,5,FALSE),0)","v":0}]
["80401036","0401036","Radiografía de oído, uno o ambos (2 proy.) (2 exp.)                     ",0,{"$f":"IFERROR(VLOOKUP($A441,FILTRO.12!A42:K371,3,FALSE),0)","v":0},{"$f":"IFERROR(VLOOKUP($A441,FILTRO.12!A42:K371,4,FALSE),0)","v":0},{"$f":"IFERROR(VLOOKUP($A441,FILTRO.12!A42:K371,5,FALSE),0)","v":0}]
["80401037","0401037","Radiografía de oído, uno o ambos (3 proy.) (3 exp.)                    ",0,{"$f":"IFERROR(VLOOKUP($A442,FILTRO.12!A43:K372,3,FALSE),0)","v":0},{"$f":"IFERROR(VLOOKUP($A442,FILTRO.12!A43:K372,4,FALSE),0)","v":0},{"$f":"IFERROR(VLOOKUP($A442,FILTRO.12!A43:K372,5,FALSE),0)","v":0}]
["80401038","0401038","Planigrafía de oidos (68 exp.)                     ",0,{"$f":"IFERROR(VLOOKUP($A443,FILTRO.12!A44:K373,3,FALSE),0)","v":0},{"$f":"IFERROR(VLOOKUP($A443,FILTRO.12!A44:K373,4,FALSE),0)","v":0},{"$f":"IFERROR(VLOOKUP($A443,FILTRO.12!A44:K373,5,FALSE),0)","v":0}]
["80401039","0401039","Planigrafía silla turca, canal optico, cavidades perinasales, c/u (68 exp.)  ",0,{"$f":"IFERROR(VLOOKUP($A444,FILTRO.12!A45:K374,3,FALSE),0)","v":0},{"$f":"IFERROR(VLOOKUP($A444,FILTRO.12!A45:K374,4,FALSE),0)","v":0},{"$f":"IFERROR(VLOOKUP($A444,FILTRO.12!A45:K374,5,FALSE),0)","v":0}]
["80401040","0401040","Radiografía de silla turca frontal y lateral ",0,{"$f":"IFERROR(VLOOKUP($A445,FILTRO.12!A46:K375,3,FALSE),0)","v":0},{"$f":"IFERROR(VLOOKUP($A445,FILTRO.12!A46:K375,4,FALSE),0)","v":0},{"$f":"IFERROR(VLOOKUP($A445,FILTRO.12!A46:K375,5,FALSE),0)","v":0}]
["80401041","0401041","Planigrafía localizada (cervical, dorsal o lumbosacra) (68 exp.)              ",0,{"$f":"IFERROR(VLOOKUP($A446,FILTRO.12!A47:K376,3,FALSE),0)","v":0},{"$f":"IFERROR(VLOOKUP($A446,FILTRO.12!A47:K376,4,FALSE),0)","v":0},{"$f":"IFERROR(VLOOKUP($A446,FILTRO.12!A47:K376,5,FALSE),0)","v":0}]
["80401042","0401042","Radiografía de columna cervical o atlas-axis (frontal y lateral)",{"v":1177,"d":"1,177"},{"$f":"IFERROR(VLOOKUP($A447,FILTRO.12!A48:K377,3,FALSE),0)","v":{"v":1177,"d":"1,177"}},{"$f":"IFERROR(VLOOKUP($A447,FILTRO.12!A48:K377,4,FALSE),0)","v":0},{"$f":"IFERROR(VLOOKUP($A447,FILTRO.12!A48:K377,5,FALSE),0)","v":399}]
["80401043","0401043","Radiografía de columna cervical (frontal, lateral y oblicuas)",16,{"$f":"IFERROR(VLOOKUP($A448,FILTRO.12!A49:K378,3,FALSE),0)","v":16},{"$f":"IFERROR(VLOOKUP($A448,FILTRO.12!A49:K378,4,FALSE),0)","v":0},{"$f":"IFERROR(VLOOKUP($A448,FILTRO.12!A49:K378,5,FALSE),0)","v":12}]
["80401044","0401044","Radiografía de columna cervical  flexión y  extensión (Dinámicas)",3,{"$f":"IFERROR(VLOOKUP($A449,FILTRO.12!A50:K379,3,FALSE),0)","v":3},{"$f":"IFERROR(VLOOKUP($A449,FILTRO.12!A50:K379,4,FALSE),0)","v":0},{"$f":"IFERROR(VLOOKUP($A449,FILTRO.12!A50:K379,5,FALSE),0)","v":3}]
["80401045","0401045","Radiografía de columna dorsal o dorsolumbar localizada, parrilla costal adultos (frontal y lateral).",{"v":2292,"d":"2,292"},{"$f":"IFERROR(VLOOKUP($A450,FILTRO.12!A51:K380,3,FALSE),0)","v":{"v":2292,"d":"2,292"}},{"$f":"IFERROR(VLOOKUP($A450,FILTRO.12!A51:K380,4,FALSE),0)","v":0},{"$f":"IFERROR(VLOOKUP($A450,FILTRO.12!A51:K380,5,FALSE),0)","v":742}]
["80401046","0401046","Radiografía columna lumbar o lumbosacra   ",{"v":1542,"d":"1,542"},{"$f":"IFERROR(VLOOKUP($A451,FILTRO.12!A52:K381,3,FALSE),0)","v":{"v":1542,"d":"1,542"}},{"$f":"IFERROR(VLOOKUP($A451,FILTRO.12!A52:K381,4,FALSE),0)","v":0},{"$f":"IFERROR(VLOOKUP($A451,FILTRO.12!A52:K381,5,FALSE),0)","v":729}]
["80401047","0401047","Radiografía columna lumbar o lumbosacra  flexión y  extensión (Dinámicas)",1,{"$f":"IFERROR(VLOOKUP($A452,FILTRO.12!A53:K382,3,FALSE),0)","v":1},{"$f":"IFERROR(VLOOKUP($A452,FILTRO.12!A53:K382,4,FALSE),0)","v":0},{"$f":"IFERROR(VLOOKUP($A452,FILTRO.12!A53:K382,5,FALSE),0)","v":1}]
["80401048","0401048","Radiografía columna lumbar o lumbosacra, oblicuas adicionales ",9,{"$f":"IFERROR(VLOOKUP($A453,FILTRO.12!A54:K383,3,FALSE),0)","v":9},{"$f":"IFERROR(VLOOKUP($A453,FILTRO.12!A54:K383,4,FALSE),0)","v":0},{"$f":"IFERROR(VLOOKUP($A453,FILTRO.12!A54:K383,5,FALSE),0)","v":2}]
["80401049","0401049","Radiografía de columna total, panorámica con folio graduado  frontal o lateral",0,{"$f":"IFERROR(VLOOKUP($A454,FILTRO.12!A55:K384,3,FALSE),0)","v":0},{"$f":"IFERROR(VLOOKUP($A454,FILTRO.12!A55:K384,4,FALSE),0)","v":0},{"$f":"IFERROR(VLOOKUP($A454,FILTRO.12!A55:K384,5,FALSE),0)","v":2}]
["80401051","0401051","Radiografía de pelvis, cadera o coxofemoral",{"v":2357,"d":"2,357"},{"$f":"IFERROR(VLOOKUP($A455,FILTRO.12!A56:K385,3,FALSE),0)","v":{"v":2342,"d":"2,342"}},{"$f":"IFERROR(VLOOKUP($A455,FILTRO.12!A56:K385,4,FALSE),0)","v":15},{"$f":"IFERROR(VLOOKUP($A455,FILTRO.12!A56:K385,5,FALSE),0)","v":{"v":3740,"d":"3,740"}}]
["80401151","0401151","Radiografía de pelvis, cadera o coxofemoral de RN, lactante o niño menor de 6 años.",{"v":2208,"d":"2,208"},{"$f":"IFERROR(VLOOKUP($A456,FILTRO.12!A57:K386,3,FALSE),0)","v":658},{"$f":"IFERROR(VLOOKUP($A456,FILTRO.12!A57:K386,4,FALSE),0)","v":{"v":1550,"d":"1,550"}},{"$f":"IFERROR(VLOOKUP($A456,FILTRO.12!A57:K386,5,FALSE),0)","v":{"v":2696,"d":"2,696"}}]
["80401052","0401052","Radiografía de pelvis, cadera o coxofemoral, proyecciones especiales; (rotación interna, abducción, lateral, Lawenstein u otras)",671,{"$f":"IFERROR(VLOOKUP($A457,FILTRO.12!A58:K387,3,FALSE),0)","v":651},{"$f":"IFERROR(VLOOKUP($A457,FILTRO.12!A58:K387,4,FALSE),0)","v":20},{"$f":"IFERROR(VLOOKUP($A457,FILTRO.12!A58:K387,5,FALSE),0)","v":519}]
["80401053","0401053","Radiografía de Sacrocoxis o articulaciones sacroilíacas.",299,{"$f":"IFERROR(VLOOKUP($A458,FILTRO.12!A59:K388,3,FALSE),0)","v":299},{"$f":"IFERROR(VLOOKUP($A458,FILTRO.12!A59:K388,4,FALSE),0)","v":0},{"$f":"IFERROR(VLOOKUP($A458,FILTRO.12!A59:K388,5,FALSE),0)","v":75}]
["80401054","0401054","Radiografía de brazo, antebrazo, codo, muñeca, mano, dedos, pie  (frontal y lateral)",{"v":13735,"d":"13,735"},{"$f":"IFERROR(VLOOKUP($A459,FILTRO.12!A60:K389,3,FALSE),0)","v":{"v":13735,"d":"13,735"}},{"$f":"IFERROR(VLOOKUP($A459,FILTRO.12!A60:K389,4,FALSE),0)","v":0},{"$f":"IFERROR(VLOOKUP($A459,FILTRO.12!A60:K389,5,FALSE),0)","v":{"v":4134,"d":"4,134"}}]
["80401055","0401055","Radiografía de clavícula.",229,{"$f":"IFERROR(VLOOKUP($A460,FILTRO.12!A61:K390,3,FALSE),0)","v":229},{"$f":"IFERROR(VLOOKUP($A460,FILTRO.12!A61:K390,4,FALSE),0)","v":0},{"$f":"IFERROR(VLOOKUP($A460,FILTRO.12!A61:K390,5,FALSE),0)","v":53}]
["80401056","0401056","Radiografía Edad Ósea: carpo y mano ",26,{"$f":"IFERROR(VLOOKUP($A461,FILTRO.12!A62:K391,3,FALSE),0)","v":26},{"$f":"IFERROR(VLOOKUP($A461,FILTRO.12!A62:K391,4,FALSE),0)","v":0},{"$f":"IFERROR(VLOOKUP($A461,FILTRO.12!A62:K391,5,FALSE),0)","v":26}]
["80401057","0401057","Radiografía Edad ósea : rodilla frontal",0,{"$f":"IFERROR(VLOOKUP($A462,FILTRO.12!A63:K392,3,FALSE),0)","v":0},{"$f":"IFERROR(VLOOKUP($A462,FILTRO.12!A63:K392,4,FALSE),0)","v":0},{"$f":"IFERROR(VLOOKUP($A462,FILTRO.12!A63:K392,5,FALSE),0)","v":0}]
["80401058","0401058","Estudio radiológico de escafoides",19,{"$f":"IFERROR(VLOOKUP($A463,FILTRO.12!A64:K393,3,FALSE),0)","v":19},{"$f":"IFERROR(VLOOKUP($A463,FILTRO.12!A64:K393,4,FALSE),0)","v":0},{"$f":"IFERROR(VLOOKUP($A463,FILTRO.12!A64:K393,5,FALSE),0)","v":1}]
["80401059","0401059","Estudio radiológico de muñeca o tobillo frontal lateral y oblicuas",{"v":1853,"d":"1,853"},{"$f":"IFERROR(VLOOKUP($A464,FILTRO.12!A65:K394,3,FALSE),0)","v":{"v":1853,"d":"1,853"}},{"$f":"IFERROR(VLOOKUP($A464,FILTRO.12!A65:K394,4,FALSE),0)","v":0},{"$f":"IFERROR(VLOOKUP($A464,FILTRO.12!A65:K394,5,FALSE),0)","v":404}]
["80401060","0401060","Radiografía de hombro, fémur, rodilla, pierna, costilla o esternón Frontal y Lateral",{"v":7813,"d":"7,813"},{"$f":"IFERROR(VLOOKUP($A465,FILTRO.12!A66:K395,3,FALSE),0)","v":{"v":7813,"d":"7,813"}},{"$f":"IFERROR(VLOOKUP($A465,FILTRO.12!A66:K395,4,FALSE),0)","v":0},{"$f":"IFERROR(VLOOKUP($A465,FILTRO.12!A66:K395,5,FALSE),0)","v":{"v":5774,"d":"5,774"}}]
["80401061","0401061","Planigrafía ósea frontal y/o lateral (6 exp.) ",1,{"$f":"IFERROR(VLOOKUP($A466,FILTRO.12!A67:K396,3,FALSE),0)","v":1},{"$f":"IFERROR(VLOOKUP($A466,FILTRO.12!A67:K396,4,FALSE),0)","v":0},{"$f":"IFERROR(VLOOKUP($A466,FILTRO.12!A67:K396,5,FALSE),0)","v":0}]
["80401062","0401062","Radiografía de Proyecciones especiales oblicuas u otras en hombro, brazo, codo, rodilla, rótulas, sesamoideos, axial de ambas rótulas o similares",468,{"$f":"IFERROR(VLOOKUP($A467,FILTRO.12!A68:K397,3,FALSE),0)","v":468},{"$f":"IFERROR(VLOOKUP($A467,FILTRO.12!A68:K397,4,FALSE),0)","v":0},{"$f":"IFERROR(VLOOKUP($A467,FILTRO.12!A68:K397,5,FALSE),0)","v":365}]
["80401063","0401063","Radiografía de túnel intercondíleo o radio-carpiano",2,{"$f":"IFERROR(VLOOKUP($A468,FILTRO.12!A69:K398,3,FALSE),0)","v":2},{"$f":"IFERROR(VLOOKUP($A468,FILTRO.12!A69:K398,4,FALSE),0)","v":0},{"$f":"IFERROR(VLOOKUP($A468,FILTRO.12!A69:K398,5,FALSE),0)","v":0}]
["80401064","0401064","Apoyo fluoroscópico a procedimientos intraoperatorios y/o biopsia (no incluye el proc.)",{"$f":"SUM(E469:F469)","v":0},{"$f":"IFERROR(VLOOKUP($A469,FILTRO.12!A70:K399,3,FALSE),0)","v":0},{"$f":"IFERROR(VLOOKUP($A469,FILTRO.12!A70:K399,4,FALSE),0)","v":0},{"$f":"IFERROR(VLOOKUP($A469,FILTRO.12!A70:K399,5,FALSE),0)","v":0}]
["80404002","0404002","Ecografía obstétrica",{"v":2233,"d":"2,233"},{"$f":"IFERROR(VLOOKUP($A470,FILTRO.12!A71:K400,3,FALSE),0)","v":18},{"$f":"IFERROR(VLOOKUP($A470,FILTRO.12!A71:K400,4,FALSE),0)","v":{"v":2215,"d":"2,215"}},{"$f":"IFERROR(VLOOKUP($A470,FILTRO.12!A71:K400,5,FALSE),0)","v":0}]
["80404003","0404003","Ecografía abdominal (incluye hígado, vía biliar, vesícula, páncreas, riñones, bazo, retroperitoneo y grandes vasos)",{"v":1049,"d":"1,049"},{"$f":"IFERROR(VLOOKUP($A471,FILTRO.12!A72:K401,3,FALSE),0)","v":0},{"$f":"IFERROR(VLOOKUP($A471,FILTRO.12!A72:K401,4,FALSE),0)","v":{"v":1049,"d":"1,049"}},{"$f":"IFERROR(VLOOKUP($A471,FILTRO.12!A72:K401,5,FALSE),0)","v":{"v":1844,"d":"1,844"}}]
["80404004","0404004","Ecografía como apoyo a cirugía, o a procedimiento (de tórax, muscular, partes blandas, etc.)",1,{"$f":"IFERROR(VLOOKUP($A472,FILTRO.12!A73:K402,3,FALSE),0)","v":0},{"$f":"IFERROR(VLOOKUP($A472,FILTRO.12!A73:K402,4,FALSE),0)","v":1},{"$f":"IFERROR(VLOOKUP($A472,FILTRO.12!A73:K402,5,FALSE),0)","v":1}]
["80404005","0404005","Ecografía transvaginal o transrectal",166,{"$f":"IFERROR(VLOOKUP($A473,FILTRO.12!A74:K403,3,FALSE),0)","v":0},{"$f":"IFERROR(VLOOKUP($A473,FILTRO.12!A74:K403,4,FALSE),0)","v":166},{"$f":"IFERROR(VLOOKUP($A473,FILTRO.12!A74:K403,5,FALSE),0)","v":0}]
["80404006","0404006","Ecografía ginecológica, pelviana femenina u obstétrica con estudio fetal",533,{"$f":"IFERROR(VLOOKUP($A474,FILTRO.12!A75:K404,3,FALSE),0)","v":0},{"$f":"IFERROR(VLOOKUP($A474,FILTRO.12!A75:K404,4,FALSE),0)","v":533},{"$f":"IFERROR(VLOOKUP($A474,FILTRO.12!A75:K404,5,FALSE),0)","v":5}]
["80404007","0404007","Ecografía transvaginal para seguimiento de ovulación, procedimiento completo (6-8 sesiones )",28,{"$f":"IFERROR(VLOOKUP($A475,FILTRO.12!A76:K405,3,FALSE),0)","v":0},{"$f":"IFERROR(VLOOKUP($A475,FILTRO.12!A76:K405,4,FALSE),0)","v":28},{"$f":"IFERROR(VLOOKUP($A475,FILTRO.12!A76:K405,5,FALSE),0)","v":0}]
["80404008","0404008","Ecografía para seguimiento de ovulación, procedimiento completo (6 a 8 sesiones)",0,{"$f":"IFERROR(VLOOKUP($A476,FILTRO.12!A77:K406,3,FALSE),0)","v":0},{"$f":"IFERROR(VLOOKUP($A476,FILTRO.12!A77:K406,4,FALSE),0)","v":0},{"$f":"IFERROR(VLOOKUP($A476,FILTRO.12!A77:K406,5,FALSE),0)","v":0}]
["80404009","0404009","Ecografía pélvica masculina (incluye vejiga y próstata)",0,{"$f":"IFERROR(VLOOKUP($A477,FILTRO.12!A78:K407,3,FALSE),0)","v":0},{"$f":"IFERROR(VLOOKUP($A477,FILTRO.12!A78:K407,4,FALSE),0)","v":0},{"$f":"IFERROR(VLOOKUP($A477,FILTRO.12!A78:K407,5,FALSE),0)","v":0}]
["80404010","0404010","Ecografía renal (bilateral), o de bazo",0,{"$f":"IFERROR(VLOOKUP($A478,FILTRO.12!A79:K408,3,FALSE),0)","v":0},{"$f":"IFERROR(VLOOKUP($A478,FILTRO.12!A79:K408,4,FALSE),0)","v":0},{"$f":"IFERROR(VLOOKUP($A478,FILTRO.12!A79:K408,5,FALSE),0)","v":0}]
["80404011","0404011","Ecografía encefálica (RN o lactante)",0,{"$f":"IFERROR(VLOOKUP($A479,FILTRO.12!A80:K409,3,FALSE),0)","v":0},{"$f":"IFERROR(VLOOKUP($A479,FILTRO.12!A80:K409,4,FALSE),0)","v":0},{"$f":"IFERROR(VLOOKUP($A479,FILTRO.12!A80:K409,5,FALSE),0)","v":0}]
["80404012","0404012","Ecografía mamaria bilateral (incluye Doppler)",{"v":1081,"d":"1,081"},{"$f":"IFERROR(VLOOKUP($A480,FILTRO.12!A81:K410,3,FALSE),0)","v":0},{"$f":"IFERROR(VLOOKUP($A480,FILTRO.12!A81:K410,4,FALSE),0)","v":{"v":1081,"d":"1,081"}},{"$f":"IFERROR(VLOOKUP($A480,FILTRO.12!A81:K410,5,FALSE),0)","v":{"v":1597,"d":"1,597"}}]
["80404013","0404013","Ecografía ocular, uno o ambos ojos.",0,{"$f":"IFERROR(VLOOKUP($A481,FILTRO.12!A82:K411,3,FALSE),0)","v":0},{"$f":"IFERROR(VLOOKUP($A481,FILTRO.12!A82:K411,4,FALSE),0)","v":0},{"$f":"IFERROR(VLOOKUP($A481,FILTRO.12!A82:K411,5,FALSE),0)","v":0}]
["80404014","0404014","Ecografía testicular (uno o ambos) (Incluye Doppler)",0,{"$f":"IFERROR(VLOOKUP($A482,FILTRO.12!A83:K412,3,FALSE),0)","v":0},{"$f":"IFERROR(VLOOKUP($A482,FILTRO.12!A83:K412,4,FALSE),0)","v":0},{"$f":"IFERROR(VLOOKUP($A482,FILTRO.12!A83:K412,5,FALSE),0)","v":0}]
["80404015","0404015","Ecografía tiroidea (Incluye Doppler)",0,{"$f":"IFERROR(VLOOKUP($A483,FILTRO.12!A84:K413,3,FALSE),0)","v":0},{"$f":"IFERROR(VLOOKUP($A483,FILTRO.12!A84:K413,4,FALSE),0)","v":0},{"$f":"IFERROR(VLOOKUP($A483,FILTRO.12!A84:K413,5,FALSE),0)","v":0}]
["80404016","0404016","Ecografía vascular periférica, articular o de partes blandas",0,{"$f":"IFERROR(VLOOKUP($A484,FILTRO.12!A85:K414,3,FALSE),0)","v":0},{"$f":"IFERROR(VLOOKUP($A484,FILTRO.12!A85:K414,4,FALSE),0)","v":0},{"$f":"IFERROR(VLOOKUP($A484,FILTRO.12!A85:K414,5,FALSE),0)","v":0}]
["80404018","0404018","Ecotomografía vascular periférica (bilateral), cervical (bilateral), abdominal o de otros órganos con doppler duplex                 ",9,{"$f":"IFERROR(VLOOKUP($A485,FILTRO.12!A86:K415,3,FALSE),0)","v":0},{"$f":"IFERROR(VLOOKUP($A485,FILTRO.12!A86:K415,4,FALSE),0)","v":9},{"$f":"IFERROR(VLOOKUP($A485,FILTRO.12!A86:K415,5,FALSE),0)","v":9}]
["80404019","0404019","Ecotomografía vascular periférica (bilateral), cervical (bilateral), abdominal o de otros órganos con doppler color                ",0,{"$f":"IFERROR(VLOOKUP($A486,FILTRO.12!A87:K416,3,FALSE),0)","v":0},{"$f":"IFERROR(VLOOKUP($A486,FILTRO.12!A87:K416,4,FALSE),0)","v":0},{"$f":"IFERROR(VLOOKUP($A486,FILTRO.12!A87:K416,5,FALSE),0)","v":0}]
[]
[null,"SECCIÓN B: PROCEDIMIENTOS APOYO CLÍNICO Y TERAPÉUTICO"]
[null,"CÓDIGOS","PROCEDIMIENTOS","Total","SAPU/SAR/SUR","Resto Establecimientos APS","Funcionario",null,"Compras de Servicios"]
[{"$nulls":6},"Médico","Otro"]
[null,"NEUROLOGÍA"]
["81101003",1101003,"Lumbar c/s manometria c/s queckensted   ",{"$f":"SUM(E492:F492)","v":0},{"$f":"IFERROR(VLOOKUP($A492,FILTRO.12!A5:K334,3,FALSE),0)","v":0},{"$f":"IFERROR(VLOOKUP($A492,FILTRO.12!A5:K334,4,FALSE),0)","v":0},{"$f":"IFERROR(VLOOKUP($A492,FILTRO.12!A5:K334,5,FALSE),0)","v":0},{"$f":"IFERROR(VLOOKUP($A492,FILTRO.12!A5:K334,6,FALSE),0)","v":0},{"$f":"IFERROR(VLOOKUP($A492,FILTRO.12!A5:K334,7,FALSE),0)","v":0}]
[]
[null,"OFTALMOLOGÍA"]
["81201003",1201003,"cuantificacion de lagrimacion (test de   schirmer),  uno o                  ",{"$f":"SUM(E495:F495)","v":0},{"$f":"IFERROR(VLOOKUP($A495,FILTRO.12!A8:K337,3,FALSE),0)","v":0},{"$f":"IFERROR(VLOOKUP($A495,FILTRO.12!A8:K337,4,FALSE),0)","v":0},{"$f":"IFERROR(VLOOKUP($A495,FILTRO.12!A5:K334,5,FALSE),0)","v":0},{"$f":"IFERROR(VLOOKUP($A495,FILTRO.12!A5:K334,6,FALSE),0)","v":0},{"$f":"IFERROR(VLOOKUP($A495,FILTRO.12!A8:K337,7,FALSE),0)","v":0}]
["81201004",1201004,"curva de tension aplanatica (por cada dia), c/ojo                                ",{"$f":"SUM(E496:F496)","v":0},{"$f":"IFERROR(VLOOKUP($A496,FILTRO.12!A9:K338,3,FALSE),0)","v":0},{"$f":"IFERROR(VLOOKUP($A496,FILTRO.12!A9:K338,4,FALSE),0)","v":0},{"$f":"IFERROR(VLOOKUP($A496,FILTRO.12!A6:K335,5,FALSE),0)","v":0},{"$f":"IFERROR(VLOOKUP($A496,FILTRO.12!A6:K335,6,FALSE),0)","v":0},{"$f":"IFERROR(VLOOKUP($A496,FILTRO.12!A9:K338,7,FALSE),0)","v":0}]
["81201005",1201005,"diploscopia cuantitativa, ambos ojos                                                      ",0,{"$f":"IFERROR(VLOOKUP($A497,FILTRO.12!A10:K339,3,FALSE),0)","v":0},{"$f":"IFERROR(VLOOKUP($A497,FILTRO.12!A10:K339,4,FALSE),0)","v":0},{"$f":"IFERROR(VLOOKUP($A497,FILTRO.12!A7:K336,5,FALSE),0)","v":0},{"$f":"IFERROR(VLOOKUP($A497,FILTRO.12!A7:K336,6,FALSE),0)","v":0},{"$f":"IFERROR(VLOOKUP($A497,FILTRO.12!A10:K339,7,FALSE),0)","v":0}]
["81201009",1201009,"exploracion sensoriomotora: estrabismo, estudio completo ,               ",0,{"$f":"IFERROR(VLOOKUP($A498,FILTRO.12!A11:K340,3,FALSE),0)","v":0},{"$f":"IFERROR(VLOOKUP($A498,FILTRO.12!A11:K340,4,FALSE),0)","v":0},{"$f":"IFERROR(VLOOKUP($A498,FILTRO.12!A8:K337,5,FALSE),0)","v":0},{"$f":"IFERROR(VLOOKUP($A498,FILTRO.12!A8:K337,6,FALSE),0)","v":0},{"$f":"IFERROR(VLOOKUP($A498,FILTRO.12!A11:K340,7,FALSE),0)","v":0}]
["81201012",1201012,"retinografia, ambos ojos                                                                           ",0,{"$f":"IFERROR(VLOOKUP($A499,FILTRO.12!A12:K341,3,FALSE),0)","v":0},{"$f":"IFERROR(VLOOKUP($A499,FILTRO.12!A12:K341,4,FALSE),0)","v":0},{"$f":"IFERROR(VLOOKUP($A499,FILTRO.12!A9:K338,5,FALSE),0)","v":0},{"$f":"IFERROR(VLOOKUP($A499,FILTRO.12!A9:K338,6,FALSE),0)","v":0},{"$f":"IFERROR(VLOOKUP($A499,FILTRO.12!A12:K341,7,FALSE),0)","v":0}]
["81201014",1201014,"tonometria ocular, cualquier tecnica, c/ojo                                            ",0,{"$f":"IFERROR(VLOOKUP($A500,FILTRO.12!A13:K342,3,FALSE),0)","v":0},{"$f":"IFERROR(VLOOKUP($A500,FILTRO.12!A13:K342,4,FALSE),0)","v":0},{"$f":"IFERROR(VLOOKUP($A500,FILTRO.12!A10:K339,5,FALSE),0)","v":0},{"$f":"IFERROR(VLOOKUP($A500,FILTRO.12!A10:K339,6,FALSE),0)","v":0},{"$f":"IFERROR(VLOOKUP($A500,FILTRO.12!A13:K342,7,FALSE),0)","v":0}]
["81201015",1201015,"tratamiento ortoptico y/ o pleoptico (por sesion) ,                               ",4,{"$f":"IFERROR(VLOOKUP($A501,FILTRO.12!A14:K343,3,FALSE),0)","v":0},{"$f":"IFERROR(VLOOKUP($A501,FILTRO.12!A14:K343,4,FALSE),0)","v":4},{"$f":"IFERROR(VLOOKUP($A501,FILTRO.12!A11:K340,5,FALSE),0)","v":0},{"$f":"IFERROR(VLOOKUP($A501,FILTRO.12!A11:K340,6,FALSE),0)","v":0},{"$f":"IFERROR(VLOOKUP($A501,FILTRO.12!A14:K343,7,FALSE),0)","v":4}]
["81201019",1201019,"Exploracion vitreorretinal, ambos ojos                                                       ",2,{"$f":"IFERROR(VLOOKUP($A502,FILTRO.12!A15:K344,3,FALSE),0)","v":2},{"$f":"IFERROR(VLOOKUP($A502,FILTRO.12!A15:K344,4,FALSE),0)","v":0},{"$f":"IFERROR(VLOOKUP($A502,FILTRO.12!A12:K341,5,FALSE),0)","v":0},{"$f":"IFERROR(VLOOKUP($A502,FILTRO.12!A12:K341,6,FALSE),0)","v":0},{"$f":"IFERROR(VLOOKUP($A502,FILTRO.12!A15:K344,7,FALSE),0)","v":2}]
["81201029",1201029,"Cuerpo extrano conjuntival y/o corneal en adultos                                 ",200,{"$f":"IFERROR(VLOOKUP($A503,FILTRO.12!A16:K345,3,FALSE),0)","v":167},{"$f":"IFERROR(VLOOKUP($A503,FILTRO.12!A16:K345,4,FALSE),0)","v":33},{"$f":"IFERROR(VLOOKUP($A503,FILTRO.12!A13:K342,5,FALSE),0)","v":29},{"$f":"IFERROR(VLOOKUP($A503,FILTRO.12!A13:K342,6,FALSE),0)","v":0},{"$f":"IFERROR(VLOOKUP($A503,FILTRO.12!A16:K345,7,FALSE),0)","v":171}]
["81201042",1201042,"Campimetría computarizada, c/ojo (excluye UAPO)                            ",0,{"$f":"IFERROR(VLOOKUP($A504,FILTRO.12!A17:K346,3,FALSE),0)","v":0},{"$f":"IFERROR(VLOOKUP($A504,FILTRO.12!A17:K346,4,FALSE),0)","v":0},{"$f":"IFERROR(VLOOKUP($A504,FILTRO.12!A14:K343,5,FALSE),0)","v":0},{"$f":"IFERROR(VLOOKUP($A504,FILTRO.12!A14:K343,6,FALSE),0)","v":0},{"$f":"IFERROR(VLOOKUP($A504,FILTRO.12!A17:K346,7,FALSE),0)","v":0}]
["81201042A",1201042,"Campimetría computarizada, c/ojo (en UAPO)                                  ",0,{"$f":"IFERROR(VLOOKUP($A505,FILTRO.12!A18:K347,3,FALSE),0)","v":0},{"$f":"IFERROR(VLOOKUP($A505,FILTRO.12!A18:K347,4,FALSE),0)","v":0},{"$f":"IFERROR(VLOOKUP($A505,FILTRO.12!A15:K344,5,FALSE),0)","v":0},{"$f":"IFERROR(VLOOKUP($A505,FILTRO.12!A15:K344,6,FALSE),0)","v":0},{"$f":"IFERROR(VLOOKUP($A505,FILTRO.12!A18:K347,7,FALSE),0)","v":0}]
[null,"TOTAL",null,{"$f":"SUM(D495:D505)","v":206},{"$f":"SUM(E495:E505)","v":169},{"$f":"SUM(F495:F505)","v":37},29,0,177]
[]
[null,"OTORRINOLARINGOLOGÍA"]
["81301025",1301025,"Taponamiento nasal anterior (proc. aut.)",{"$f":"SUM(E509:F509)","v":145},{"$f":"IFERROR(VLOOKUP($A509,FILTRO.12!A22:K351,3,FALSE),0)","v":130},{"$f":"IFERROR(VLOOKUP($A509,FILTRO.12!A22:K351,4,FALSE),0)","v":15},{"$f":"IFERROR(VLOOKUP($A509,FILTRO.12!A5:K334,5,FALSE),0)","v":47},{"$f":"IFERROR(VLOOKUP($A509,FILTRO.12!A5:K334,6,FALSE),0)","v":0},{"$f":"IFERROR(VLOOKUP($A509,FILTRO.12!A5:K334,7,FALSE),0)","v":93}]
["81301026",1301026,"Taponamiento nasal posterior",{"$f":"SUM(E510:F510)","v":21},{"$f":"IFERROR(VLOOKUP($A510,FILTRO.12!A23:K352,3,FALSE),0)","v":14},{"$f":"IFERROR(VLOOKUP($A510,FILTRO.12!A23:K352,4,FALSE),0)","v":7},{"$f":"IFERROR(VLOOKUP($A510,FILTRO.12!A6:K335,5,FALSE),0)","v":2},{"$f":"IFERROR(VLOOKUP($A510,FILTRO.12!A6:K335,6,FALSE),0)","v":0},{"$f":"IFERROR(VLOOKUP($A510,FILTRO.12!A6:K335,7,FALSE),0)","v":19}]
["81301029",1301029,"Cuerpo extraño en fosas nasales, extraccion en adultos        ",8,{"$f":"IFERROR(VLOOKUP($A511,FILTRO.12!A24:K353,3,FALSE),0)","v":6},{"$f":"IFERROR(VLOOKUP($A511,FILTRO.12!A24:K353,4,FALSE),0)","v":2},{"$f":"IFERROR(VLOOKUP($A511,FILTRO.12!A7:K336,5,FALSE),0)","v":4},{"$f":"IFERROR(VLOOKUP($A511,FILTRO.12!A7:K336,6,FALSE),0)","v":0},{"$f":"IFERROR(VLOOKUP($A511,FILTRO.12!A7:K336,7,FALSE),0)","v":4}]
["81301030",1301030,"Cuerpo extraño en fosas nasales, extraccion en niños        ",16,{"$f":"IFERROR(VLOOKUP($A512,FILTRO.12!A25:K354,3,FALSE),0)","v":12},{"$f":"IFERROR(VLOOKUP($A512,FILTRO.12!A25:K354,4,FALSE),0)","v":4},{"$f":"IFERROR(VLOOKUP($A512,FILTRO.12!A8:K337,5,FALSE),0)","v":10},{"$f":"IFERROR(VLOOKUP($A512,FILTRO.12!A8:K337,6,FALSE),0)","v":0},{"$f":"IFERROR(VLOOKUP($A512,FILTRO.12!A8:K337,7,FALSE),0)","v":5}]
["81301042",1301042,"Trompa de eustaquio, insuflacion instrumental (proc. Aut.) en adultos                                                                             ",0,{"$f":"IFERROR(VLOOKUP($A513,FILTRO.12!A26:K355,3,FALSE),0)","v":0},{"$f":"IFERROR(VLOOKUP($A513,FILTRO.12!A26:K355,4,FALSE),0)","v":0},{"$f":"IFERROR(VLOOKUP($A513,FILTRO.12!A9:K338,5,FALSE),0)","v":0},{"$f":"IFERROR(VLOOKUP($A513,FILTRO.12!A9:K338,6,FALSE),0)","v":0},{"$f":"IFERROR(VLOOKUP($A513,FILTRO.12!A9:K338,7,FALSE),0)","v":0}]
["81301043",1301043,"Trompa de eustaquio, insuflacion instrumental (proc. Aut.) en ninos                                                                                     ",0,{"$f":"IFERROR(VLOOKUP($A514,FILTRO.12!A27:K356,3,FALSE),0)","v":0},{"$f":"IFERROR(VLOOKUP($A514,FILTRO.12!A27:K356,4,FALSE),0)","v":0},{"$f":"IFERROR(VLOOKUP($A514,FILTRO.12!A10:K339,5,FALSE),0)","v":0},{"$f":"IFERROR(VLOOKUP($A514,FILTRO.12!A10:K339,6,FALSE),0)","v":0},{"$f":"IFERROR(VLOOKUP($A514,FILTRO.12!A10:K339,7,FALSE),0)","v":0}]
[null,"TOTAL",null,{"$f":"SUM(D509:D514)","v":190},{"$f":"SUM(E509:E514)","v":162},28,63,0,121]
[]
[null,"DERMATOLOGÍA Y TEGUMENTOS"]
["81601110",1601110,"Curetaje de lesiones virales o similares hasta 10 lesiones                          ",{"$f":"SUM(E518:F518)","v":5},{"$f":"IFERROR(VLOOKUP($A518,FILTRO.12!A5:K334,3,FALSE),0)","v":0},{"$f":"IFERROR(VLOOKUP($A518,FILTRO.12!A5:K334,4,FALSE),0)","v":5},{"$f":"IFERROR(VLOOKUP($A518,FILTRO.12!A5:K334,5,FALSE),0)","v":0},{"$f":"IFERROR(VLOOKUP($A518,FILTRO.12!A5:K334,6,FALSE),0)","v":0},{"$f":"IFERROR(VLOOKUP($A518,FILTRO.12!A5:K334,7,FALSE),0)","v":5}]
["81601115",1601115,"Implantes Subcutáneos, instalación o retiro",{"$f":"SUM(E519:F519)","v":990},{"$f":"IFERROR(VLOOKUP($A519,FILTRO.12!A6:K335,3,FALSE),0)","v":2},{"$f":"IFERROR(VLOOKUP($A519,FILTRO.12!A6:K335,4,FALSE),0)","v":988},{"$f":"IFERROR(VLOOKUP($A519,FILTRO.12!A6:K335,5,FALSE),0)","v":0},{"$f":"IFERROR(VLOOKUP($A519,FILTRO.12!A6:K335,6,FALSE),0)","v":0},{"$f":"IFERROR(VLOOKUP($A519,FILTRO.12!A6:K335,7,FALSE),0)","v":993}]
[null,"TOTAL",null,{"$f":"SUM(D518:D519)","v":995},{"$f":"SUM(E518:E519)","v":2},{"$f":"SUM(F518:F519)","v":993},0,0,998]
[]
[null,"CARDIOLOGÍA"]
["81701001","1701001","Electrocardiograma",{"$f":"SUM(E523:F523)","v":{"v":79128,"d":"79,128"}},{"$f":"IFERROR(VLOOKUP($A523,FILTRO.12!A5:K334,3,FALSE),0)","v":{"v":21422,"d":"21,422"}},{"$f":"IFERROR(VLOOKUP($A523,FILTRO.12!A5:K334,4,FALSE),0)","v":{"v":57706,"d":"57,706"}},{"$f":"IFERROR(VLOOKUP($A523,FILTRO.12!A5:K334,5,FALSE),0)","v":363},{"$f":"IFERROR(VLOOKUP($A523,FILTRO.12!A5:K334,6,FALSE),0)","v":{"v":21095,"d":"21,095"}},{"$f":"IFERROR(VLOOKUP($A523,FILTRO.12!A5:K334,7,FALSE),0)","v":{"v":75186,"d":"75,186"}}]
["81701006","1701006","E.C.G. Continuo (test holter o similares, por ej. variabilidad de la frecuencia cardiaca y/o alta resolución  del st y/o despolarización tardía);20 a 24 horas de registro                                                                         ",{"$f":"SUM(E524:F524)","v":46},{"$f":"IFERROR(VLOOKUP($A524,FILTRO.12!A6:K335,3,FALSE),0)","v":3},{"$f":"IFERROR(VLOOKUP($A524,FILTRO.12!A6:K335,4,FALSE),0)","v":43},{"$f":"IFERROR(VLOOKUP($A524,FILTRO.12!A6:K335,5,FALSE),0)","v":0},{"$f":"IFERROR(VLOOKUP($A524,FILTRO.12!A6:K335,6,FALSE),0)","v":8},{"$f":"IFERROR(VLOOKUP($A524,FILTRO.12!A6:K335,7,FALSE),0)","v":46}]
["81701009","1701009","Monitoreo continuo de presión arterial",{"$f":"SUM(E525:F525)","v":{"v":36464,"d":"36,464"}},{"$f":"IFERROR(VLOOKUP($A525,FILTRO.12!A7:K336,3,FALSE),0)","v":{"v":6609,"d":"6,609"}},{"$f":"IFERROR(VLOOKUP($A525,FILTRO.12!A7:K336,4,FALSE),0)","v":{"v":29855,"d":"29,855"}},{"$f":"IFERROR(VLOOKUP($A525,FILTRO.12!A7:K336,5,FALSE),0)","v":735},{"$f":"IFERROR(VLOOKUP($A525,FILTRO.12!A7:K336,6,FALSE),0)","v":105},{"$f":"IFERROR(VLOOKUP($A525,FILTRO.12!A7:K336,7,FALSE),0)","v":{"v":35449,"d":"35,449"}}]
["81707038",null,"Monitoreo Ambulatorio de Presión Arterial (procedimiento finalizado)",{"$f":"SUM(E526:F526)","v":{"v":35670,"d":"35,670"}},{"$f":"IFERROR(VLOOKUP($A526,FILTRO.12!A8:K337,3,FALSE),0)","v":{"v":4850,"d":"4,850"}},{"$f":"IFERROR(VLOOKUP($A526,FILTRO.12!A8:K337,4,FALSE),0)","v":{"v":30820,"d":"30,820"}},{"$f":"IFERROR(VLOOKUP($A526,FILTRO.12!A8:K337,5,FALSE),0)","v":14},{"$f":"IFERROR(VLOOKUP($A526,FILTRO.12!A8:K337,6,FALSE),0)","v":95},{"$f":"IFERROR(VLOOKUP($A526,FILTRO.12!A8:K337,7,FALSE),0)","v":{"v":33755,"d":"33,755"}}]
[null,"TOTAL",null,{"$f":"SUM(D523:D526)","v":{"v":151308,"d":"151,308"}},{"$f":"SUM(E523:E526)","v":{"v":32884,"d":"32,884"}},{"v":118424,"d":"118,424"},{"v":1112,"d":"1,112"},{"$f":"SUM(H523:H526)","v":{"v":21303,"d":"21,303"}},{"v":144436,"d":"144,436"}]
[]
[null,"NEUMOLOGÍA"]
["81707001",1707001,"Espirometría Basal                                                                                       ",{"$f":"SUM(E530:F530)","v":{"v":2433,"d":"2,433"}},{"$f":"IFERROR(VLOOKUP($A530,FILTRO.12!A5:K334,3,FALSE),0)","v":11},{"$f":"IFERROR(VLOOKUP($A530,FILTRO.12!A5:K334,4,FALSE),0)","v":{"v":2422,"d":"2,422"}},{"$f":"IFERROR(VLOOKUP($A530,FILTRO.12!A5:K334,5,FALSE),0)","v":0},{"$f":"IFERROR(VLOOKUP($A530,FILTRO.12!A5:K334,6,FALSE),0)","v":0},{"$f":"IFERROR(VLOOKUP($A530,FILTRO.12!A5:K334,7,FALSE),0)","v":{"v":2433,"d":"2,433"}}]
["81707002",1707002,"Espirometria basal y con broncodilatador                                                         ",{"$f":"SUM(E531:F531)","v":{"v":1584,"d":"1,584"}},{"$f":"IFERROR(VLOOKUP($A531,FILTRO.12!A6:K335,3,FALSE),0)","v":0},{"$f":"IFERROR(VLOOKUP($A531,FILTRO.12!A6:K335,4,FALSE),0)","v":{"v":1584,"d":"1,584"}},{"$f":"IFERROR(VLOOKUP($A531,FILTRO.12!A6:K335,5,FALSE),0)","v":0},{"$f":"IFERROR(VLOOKUP($A531,FILTRO.12!A6:K335,6,FALSE),0)","v":0},{"$f":"IFERROR(VLOOKUP($A531,FILTRO.12!A6:K335,7,FALSE),0)","v":{"v":1576,"d":"1,576"}}]
["81707004",1707004,"Test de provocacion con ejercicio                                                                      ",71,{"$f":"IFERROR(VLOOKUP($A532,FILTRO.12!A7:K336,3,FALSE),0)","v":34},{"$f":"IFERROR(VLOOKUP($A532,FILTRO.12!A7:K336,4,FALSE),0)","v":37},{"$f":"IFERROR(VLOOKUP($A532,FILTRO.12!A7:K336,5,FALSE),0)","v":0},{"$f":"IFERROR(VLOOKUP($A532,FILTRO.12!A7:K336,6,FALSE),0)","v":0},{"$f":"IFERROR(VLOOKUP($A532,FILTRO.12!A7:K336,7,FALSE),0)","v":71}]
["81707030",1707030,"Aerosolterapia (Nebulización)    ",{"v":18332,"d":"18,332"},{"$f":"IFERROR(VLOOKUP($A533,FILTRO.12!A8:K337,3,FALSE),0)","v":{"v":15938,"d":"15,938"}},{"$f":"IFERROR(VLOOKUP($A533,FILTRO.12!A8:K337,4,FALSE),0)","v":{"v":2394,"d":"2,394"}},{"$f":"IFERROR(VLOOKUP($A533,FILTRO.12!A8:K337,5,FALSE),0)","v":244},{"$f":"IFERROR(VLOOKUP($A533,FILTRO.12!A8:K337,6,FALSE),0)","v":44},{"$f":"IFERROR(VLOOKUP($A533,FILTRO.12!A8:K337,7,FALSE),0)","v":{"v":16801,"d":"16,801"}}]
[null,"TOTAL",null,{"$f":"SUM(D530:D533)","v":{"v":22420,"d":"22,420"}},{"$f":"SUM(E530:E533)","v":{"v":15983,"d":"15,983"}},{"v":6437,"d":"6,437"},244,44,{"v":20881,"d":"20,881"}]
[]
[null,"GASTROENTEROLOGÍA"]
["81801023",1801023,"Intubacion con sonda gastrica                                                                ",{"$f":"SUM(E537:F537)","v":158},{"$f":"IFERROR(VLOOKUP($A537,FILTRO.12!A5:K334,3,FALSE),0)","v":141},{"$f":"IFERROR(VLOOKUP($A537,FILTRO.12!A5:K334,4,FALSE),0)","v":17},{"$f":"IFERROR(VLOOKUP($A537,FILTRO.12!A5:K334,5,FALSE),0)","v":4},{"$f":"IFERROR(VLOOKUP($A537,FILTRO.12!A12:K341,6,FALSE),0)","v":0},{"$f":"IFERROR(VLOOKUP($A537,FILTRO.12!A12:K341,7,FALSE),0)","v":149}]
["81801042",1801042,"Vaciamiento manual de fecaloma                                                                   ",{"$f":"SUM(E538:F538)","v":4},{"$f":"IFERROR(VLOOKUP($A538,FILTRO.12!A6:K335,3,FALSE),0)","v":3},{"$f":"IFERROR(VLOOKUP($A538,FILTRO.12!A6:K335,4,FALSE),0)","v":1},{"$f":"IFERROR(VLOOKUP($A538,FILTRO.12!A6:K335,5,FALSE),0)","v":2},{"$f":"IFERROR(VLOOKUP($A538,FILTRO.12!A13:K342,6,FALSE),0)","v":0},{"$f":"IFERROR(VLOOKUP($A538,FILTRO.12!A13:K342,7,FALSE),0)","v":2}]
["81801001",1801001,"Gastroduodenoscopía (incluye esofagoscopía)                                                      ",0,{"$f":"IFERROR(VLOOKUP($A539,FILTRO.12!A7:K336,3,FALSE),0)","v":0},{"$f":"IFERROR(VLOOKUP($A539,FILTRO.12!A7:K336,4,FALSE),0)","v":0},{"$f":"IFERROR(VLOOKUP($A539,FILTRO.12!A7:K336,5,FALSE),0)","v":0},{"$f":"IFERROR(VLOOKUP($A539,FILTRO.12!A14:K343,6,FALSE),0)","v":0},{"$f":"IFERROR(VLOOKUP($A539,FILTRO.12!A14:K343,7,FALSE),0)","v":0}]
[null,"TOTAL",null,{"$f":"SUM(D537:D539)","v":162},{"$f":"SUM(E537:E539)","v":144},{"$f":"SUM(F537:F539)","v":18},{"$f":"SUM(G537:G539)","v":6},{"$f":"SUM(H537:H539)","v":0},{"$f":"SUM(I537:I539)","v":151}]
[]
[null,"UROLOGÍA"]
["81901019",1901019,"Instilacion vesical (incluye colocacion de sonda) proc. Aut.                                      ",{"$f":"SUM(E543:F543)","v":936},{"$f":"IFERROR(VLOOKUP($A543,FILTRO.12!A11:K340,3,FALSE),0)","v":764},{"$f":"IFERROR(VLOOKUP($A543,FILTRO.12!A11:K340,4,FALSE),0)","v":172},{"$f":"IFERROR(VLOOKUP($A543,FILTRO.12!A11:K340,5,FALSE),0)","v":50},{"$f":"IFERROR(VLOOKUP($A543,FILTRO.12!A18:K347,6,FALSE),0)","v":0},{"$f":"IFERROR(VLOOKUP($A543,FILTRO.12!A18:K347,7,FALSE),0)","v":894}]
["81901022",1901022,"Vac. Vesical por sonda uretral, (proc. Aut.)                                                    ",{"$f":"SUM(E544:F544)","v":532},{"$f":"IFERROR(VLOOKUP($A544,FILTRO.12!A12:K341,3,FALSE),0)","v":337},{"$f":"IFERROR(VLOOKUP($A544,FILTRO.12!A12:K341,4,FALSE),0)","v":195},{"$f":"IFERROR(VLOOKUP($A544,FILTRO.12!A12:K341,5,FALSE),0)","v":12},{"$f":"IFERROR(VLOOKUP($A544,FILTRO.12!A19:K348,6,FALSE),0)","v":0},{"$f":"IFERROR(VLOOKUP($A544,FILTRO.12!A19:K348,7,FALSE),0)","v":520}]
[null,"TOTAL",null,{"$f":"SUM(D543:D544)","v":{"v":1468,"d":"1,468"}},{"$f":"SUM(E543:E544)","v":{"v":1101,"d":"1,101"}},{"$f":"SUM(F543:F544)","v":367},{"$f":"SUM(G543:G544)","v":62},0,{"v":1414,"d":"1,414"}]
[]
[null,"GINECOLOGÍA"]
["82001015",2001015,"Colocación o extracción de dispositivo intrauterino (no incluye el valor del dispositivo)                    ",{"$f":"SUM(E548:F548)","v":{"v":1004,"d":"1,004"}},{"$f":"IFERROR(VLOOKUP($A548,FILTRO.12!A16:K345,3,FALSE),0)","v":0},{"$f":"IFERROR(VLOOKUP($A548,FILTRO.12!A16:K345,4,FALSE),0)","v":{"v":1004,"d":"1,004"}},{"$f":"IFERROR(VLOOKUP($A548,FILTRO.12!A16:K345,5,FALSE),0)","v":0},{"$f":"IFERROR(VLOOKUP($A548,FILTRO.12!A23:K352,6,FALSE),0)","v":0},{"$f":"IFERROR(VLOOKUP($A548,FILTRO.12!A23:K352,7,FALSE),0)","v":985}]
[]
[null,"ORTOPEDIA Y TRAUMATOLOGÍA"]
["82101001",2101001,"Infiltracion local medicamentos (bursas, tendones, yuxtaarticulares y/o intraarticulares",{"$f":"SUM(E551:F551)","v":15},{"$f":"IFERROR(VLOOKUP($A551,FILTRO.12!A19:K348,3,FALSE),0)","v":15},{"$f":"IFERROR(VLOOKUP($A551,FILTRO.12!A19:K348,4,FALSE),0)","v":0},{"$f":"IFERROR(VLOOKUP($A551,FILTRO.12!A19:K348,5,FALSE),0)","v":15},{"$f":"IFERROR(VLOOKUP($A551,FILTRO.12!A26:K355,6,FALSE),0)","v":0},{"$f":"IFERROR(VLOOKUP($A551,FILTRO.12!A26:K355,7,FALSE),0)","v":0}]
["82101002",2101002,"Procedimiento para exploraciones radiologicas (incluye maniobra e inyeccion del medio de contraste)  BM18A  Revisar en BM Colocación valva",{"$f":"SUM(E552:F552)","v":0},{"$f":"IFERROR(VLOOKUP($A552,FILTRO.12!A20:K349,3,FALSE),0)","v":0},{"$f":"IFERROR(VLOOKUP($A552,FILTRO.12!A20:K349,4,FALSE),0)","v":0},{"$f":"IFERROR(VLOOKUP($A552,FILTRO.12!A20:K349,5,FALSE),0)","v":0},{"$f":"IFERROR(VLOOKUP($A552,FILTRO.12!A27:K356,6,FALSE),0)","v":0},{"$f":"IFERROR(VLOOKUP($A552,FILTRO.12!A27:K356,7,FALSE),0)","v":0}]
["82106005",2106005,"Rodillera, bota larga o corta de yeso",416,{"$f":"IFERROR(VLOOKUP($A553,FILTRO.12!A21:K350,3,FALSE),0)","v":415},{"$f":"IFERROR(VLOOKUP($A553,FILTRO.12!A21:K350,4,FALSE),0)","v":1},{"$f":"IFERROR(VLOOKUP($A553,FILTRO.12!A21:K350,5,FALSE),0)","v":1},{"$f":"IFERROR(VLOOKUP($A553,FILTRO.12!A28:K357,6,FALSE),0)","v":0},{"$f":"IFERROR(VLOOKUP($A553,FILTRO.12!A28:K357,7,FALSE),0)","v":406}]
["82106007",2106007,"Velpeau",6,{"$f":"IFERROR(VLOOKUP($A554,FILTRO.12!A22:K351,3,FALSE),0)","v":2},{"$f":"IFERROR(VLOOKUP($A554,FILTRO.12!A22:K351,4,FALSE),0)","v":4},{"$f":"IFERROR(VLOOKUP($A554,FILTRO.12!A22:K351,5,FALSE),0)","v":0},{"$f":"IFERROR(VLOOKUP($A554,FILTRO.12!A29:K358,6,FALSE),0)","v":0},{"$f":"IFERROR(VLOOKUP($A554,FILTRO.12!A29:K358,7,FALSE),0)","v":6}]
["82106006",2106006,"Yeso antebraquial c/s ferula digital",205,{"$f":"IFERROR(VLOOKUP($A555,FILTRO.12!A23:K352,3,FALSE),0)","v":202},{"$f":"IFERROR(VLOOKUP($A555,FILTRO.12!A23:K352,4,FALSE),0)","v":3},{"$f":"IFERROR(VLOOKUP($A555,FILTRO.12!A23:K352,5,FALSE),0)","v":1},{"$f":"IFERROR(VLOOKUP($A555,FILTRO.12!A30:K359,6,FALSE),0)","v":0},{"$f":"IFERROR(VLOOKUP($A555,FILTRO.12!A30:K359,7,FALSE),0)","v":209}]
["82106004",2106004,"Yeso braquicarpiano",156,{"$f":"IFERROR(VLOOKUP($A556,FILTRO.12!A24:K353,3,FALSE),0)","v":156},{"$f":"IFERROR(VLOOKUP($A556,FILTRO.12!A24:K353,4,FALSE),0)","v":0},{"$f":"IFERROR(VLOOKUP($A556,FILTRO.12!A24:K353,5,FALSE),0)","v":2},{"$f":"IFERROR(VLOOKUP($A556,FILTRO.12!A31:K360,6,FALSE),0)","v":0},{"$f":"IFERROR(VLOOKUP($A556,FILTRO.12!A31:K360,7,FALSE),0)","v":152}]
["82107003",2107003,"Luxaciones de articulaciones menores (el resto)      ",176,{"$f":"IFERROR(VLOOKUP($A557,FILTRO.12!A25:K354,3,FALSE),0)","v":170},{"$f":"IFERROR(VLOOKUP($A557,FILTRO.12!A25:K354,4,FALSE),0)","v":6},{"$f":"IFERROR(VLOOKUP($A557,FILTRO.12!A25:K354,5,FALSE),0)","v":4},{"$f":"IFERROR(VLOOKUP($A557,FILTRO.12!A32:K361,6,FALSE),0)","v":0},{"$f":"IFERROR(VLOOKUP($A557,FILTRO.12!A32:K361,7,FALSE),0)","v":180}]
[null,"TOTAL",null,{"$f":"SUM(D551:D557)","v":974},{"$f":"SUM(E551:E557)","v":960},{"$f":"SUM(F551:F557)","v":14},{"$f":"SUM(G551:G557)","v":23},0,953]
[]
[null," SECCIÓN C: INTERVENCIONES QUIRÚRGICAS MENORES"]
["81602201",1602201,"Biopsia de piel y/o mucosa por curetaje o sección tangencial c/s electro x 1 sesion        ",{"$f":"SUM(E561:F561)","v":46},{"$f":"IFERROR(VLOOKUP($A561,FILTRO.12!A29:K358,3,FALSE),0)","v":2},{"$f":"IFERROR(VLOOKUP($A561,FILTRO.12!A29:K358,4,FALSE),0)","v":44},{"$f":"IFERROR(VLOOKUP($A561,FILTRO.12!A29:K358,5,FALSE),0)","v":39},{"$f":"IFERROR(VLOOKUP($A561,FILTRO.12!A36:K365,6,FALSE),0)","v":40},{"$f":"IFERROR(VLOOKUP($A561,FILTRO.12!A36:K365,7,FALSE),0)","v":7}]
["81602202",1602202,"Extirpacion de, reparacion o biopsia total o parcial, de lesiones benignas cutáneas por excision cabeza, cuello, genitales, hasta 3 lesiones                                                                  ",{"$f":"SUM(E562:F562)","v":94},{"$f":"IFERROR(VLOOKUP($A562,FILTRO.12!A30:K359,3,FALSE),0)","v":0},{"$f":"IFERROR(VLOOKUP($A562,FILTRO.12!A30:K359,4,FALSE),0)","v":94},{"$f":"IFERROR(VLOOKUP($A562,FILTRO.12!A30:K359,5,FALSE),0)","v":91},{"$f":"IFERROR(VLOOKUP($A562,FILTRO.12!A37:K366,6,FALSE),0)","v":88},{"$f":"IFERROR(VLOOKUP($A562,FILTRO.12!A37:K366,7,FALSE),0)","v":0}]
["81602203",1602203,"Extirpacion de, reparacion o biopsia total o parcial, de lesiones benignas cutáneas por excision resto de cuerpo hasta 3 lesiones                                                                              ",85,{"$f":"IFERROR(VLOOKUP($A563,FILTRO.12!A31:K360,3,FALSE),0)","v":0},{"$f":"IFERROR(VLOOKUP($A563,FILTRO.12!A31:K360,4,FALSE),0)","v":85},{"$f":"IFERROR(VLOOKUP($A563,FILTRO.12!A31:K360,5,FALSE),0)","v":84},{"$f":"IFERROR(VLOOKUP($A563,FILTRO.12!A38:K367,6,FALSE),0)","v":80},{"$f":"IFERROR(VLOOKUP($A563,FILTRO.12!A38:K367,7,FALSE),0)","v":1}]
["81602204",1602204,"Extirpacion de, reparacion o biopsia total o parcial, de lesiones benignas cutáneas por excision cabeza, cuello, genitales, desde 4 hasta 6 lesiones                                              ",71,{"$f":"IFERROR(VLOOKUP($A564,FILTRO.12!A32:K361,3,FALSE),0)","v":0},{"$f":"IFERROR(VLOOKUP($A564,FILTRO.12!A32:K361,4,FALSE),0)","v":71},{"$f":"IFERROR(VLOOKUP($A564,FILTRO.12!A32:K361,5,FALSE),0)","v":69},{"$f":"IFERROR(VLOOKUP($A564,FILTRO.12!A39:K368,6,FALSE),0)","v":65},{"$f":"IFERROR(VLOOKUP($A564,FILTRO.12!A39:K368,7,FALSE),0)","v":8}]
["81602205",1602205,"Extirpacion de, reparacion o biopsia total o parcial, de lesiones benignas cutáneas por excision resto de cuerpo desde 4 hasta 6 lesiones                                                             ",70,{"$f":"IFERROR(VLOOKUP($A565,FILTRO.12!A33:K362,3,FALSE),0)","v":0},{"$f":"IFERROR(VLOOKUP($A565,FILTRO.12!A33:K362,4,FALSE),0)","v":70},{"$f":"IFERROR(VLOOKUP($A565,FILTRO.12!A33:K362,5,FALSE),0)","v":55},{"$f":"IFERROR(VLOOKUP($A565,FILTRO.12!A40:K369,6,FALSE),0)","v":60},{"$f":"IFERROR(VLOOKUP($A565,FILTRO.12!A40:K369,7,FALSE),0)","v":27}]
["81602206",1602206,"Extirpacion de lesiones benignas por sec tangencial ,curetaje,y/o fulguracion hasta 15 lesiones   ",60,{"$f":"IFERROR(VLOOKUP($A566,FILTRO.12!A34:K363,3,FALSE),0)","v":0},{"$f":"IFERROR(VLOOKUP($A566,FILTRO.12!A34:K363,4,FALSE),0)","v":60},{"$f":"IFERROR(VLOOKUP($A566,FILTRO.12!A34:K363,5,FALSE),0)","v":56},{"$f":"IFERROR(VLOOKUP($A566,FILTRO.12!A41:K370,6,FALSE),0)","v":56},{"$f":"IFERROR(VLOOKUP($A566,FILTRO.12!A41:K370,7,FALSE),0)","v":11}]
["81602207",1602207,"Tratamiento por electro de hemangiomas o telangectasias hasta 15 lesiones",2,{"$f":"IFERROR(VLOOKUP($A567,FILTRO.12!A35:K364,3,FALSE),0)","v":0},{"$f":"IFERROR(VLOOKUP($A567,FILTRO.12!A35:K364,4,FALSE),0)","v":2},{"$f":"IFERROR(VLOOKUP($A567,FILTRO.12!A35:K364,5,FALSE),0)","v":2},{"$f":"IFERROR(VLOOKUP($A567,FILTRO.12!A42:K371,6,FALSE),0)","v":2},{"$f":"IFERROR(VLOOKUP($A567,FILTRO.12!A42:K371,7,FALSE),0)","v":0}]
["81602211",1602211,"Cabeza, cuello, genitales: tratamiento quirúrgico de tumor maligno por escisión total o parcial, con o sin sutura, por cada lesión o melanoma cualquier localización",0,{"$f":"IFERROR(VLOOKUP($A568,FILTRO.12!A36:K365,3,FALSE),0)","v":0},{"$f":"IFERROR(VLOOKUP($A568,FILTRO.12!A36:K365,4,FALSE),0)","v":0},{"$f":"IFERROR(VLOOKUP($A568,FILTRO.12!A36:K365,5,FALSE),0)","v":0},{"$f":"IFERROR(VLOOKUP($A568,FILTRO.12!A43:K372,6,FALSE),0)","v":0},{"$f":"IFERROR(VLOOKUP($A568,FILTRO.12!A43:K372,7,FALSE),0)","v":0}]
["81602212",1602212,"Resto del cuerpo: tratamiento quirúrgico de tumor maligno por escisión total o parcial, con o sin sutura, por cada lesión",0,{"$f":"IFERROR(VLOOKUP($A569,FILTRO.12!A37:K366,3,FALSE),0)","v":0},{"$f":"IFERROR(VLOOKUP($A569,FILTRO.12!A37:K366,4,FALSE),0)","v":0},{"$f":"IFERROR(VLOOKUP($A569,FILTRO.12!A37:K366,5,FALSE),0)","v":0},{"$f":"IFERROR(VLOOKUP($A569,FILTRO.12!A44:K373,6,FALSE),0)","v":0},{"$f":"IFERROR(VLOOKUP($A569,FILTRO.12!A44:K373,7,FALSE),0)","v":0}]
["81602213",1602213,"Cabeza, cuello, genitales o melanoma cualquier ubicación: ampliación de márgenes quirúrgicos de tumor maligno extirpado previamente ",0,{"$f":"IFERROR(VLOOKUP($A570,FILTRO.12!A38:K367,3,FALSE),0)","v":0},{"$f":"IFERROR(VLOOKUP($A570,FILTRO.12!A38:K367,4,FALSE),0)","v":0},{"$f":"IFERROR(VLOOKUP($A570,FILTRO.12!A38:K367,5,FALSE),0)","v":0},{"$f":"IFERROR(VLOOKUP($A570,FILTRO.12!A45:K374,6,FALSE),0)","v":0},{"$f":"IFERROR(VLOOKUP($A570,FILTRO.12!A45:K374,7,FALSE),0)","v":0}]
["81602214",1602214,"Resto del cuerpo: ampliación de márgenes quirúrgicos de tumor maligno extirpado prevíamente",0,{"$f":"IFERROR(VLOOKUP($A571,FILTRO.12!A39:K368,3,FALSE),0)","v":0},{"$f":"IFERROR(VLOOKUP($A571,FILTRO.12!A39:K368,4,FALSE),0)","v":0},{"$f":"IFERROR(VLOOKUP($A571,FILTRO.12!A39:K368,5,FALSE),0)","v":0},{"$f":"IFERROR(VLOOKUP($A571,FILTRO.12!A46:K375,6,FALSE),0)","v":0},{"$f":"IFERROR(VLOOKUP($A571,FILTRO.12!A46:K375,7,FALSE),0)","v":0}]
["81602215",1602215,"Tumores vasculares profundos cara, cuero cabelludo, cuello, genitales",0,{"$f":"IFERROR(VLOOKUP($A572,FILTRO.12!A40:K369,3,FALSE),0)","v":0},{"$f":"IFERROR(VLOOKUP($A572,FILTRO.12!A40:K369,4,FALSE),0)","v":0},{"$f":"IFERROR(VLOOKUP($A572,FILTRO.12!A40:K369,5,FALSE),0)","v":0},{"$f":"IFERROR(VLOOKUP($A572,FILTRO.12!A47:K376,6,FALSE),0)","v":0},{"$f":"IFERROR(VLOOKUP($A572,FILTRO.12!A47:K376,7,FALSE),0)","v":0}]
["81602216",1602216,"Tumores vasculares profundos resto del cuerpo",0,{"$f":"IFERROR(VLOOKUP($A573,FILTRO.12!A41:K370,3,FALSE),0)","v":0},{"$f":"IFERROR(VLOOKUP($A573,FILTRO.12!A41:K370,4,FALSE),0)","v":0},{"$f":"IFERROR(VLOOKUP($A573,FILTRO.12!A41:K370,5,FALSE),0)","v":0},{"$f":"IFERROR(VLOOKUP($A573,FILTRO.12!A48:K377,6,FALSE),0)","v":0},{"$f":"IFERROR(VLOOKUP($A573,FILTRO.12!A48:K377,7,FALSE),0)","v":0}]
["81602221",1602221,"Herida cortante o contusa complicada, reparación y sutura (más de 5 cm)",{"v":1870,"d":"1,870"},{"$f":"IFERROR(VLOOKUP($A574,FILTRO.12!A42:K371,3,FALSE),0)","v":{"v":1778,"d":"1,778"}},{"$f":"IFERROR(VLOOKUP($A574,FILTRO.12!A42:K371,4,FALSE),0)","v":92},{"$f":"IFERROR(VLOOKUP($A574,FILTRO.12!A42:K371,5,FALSE),0)","v":{"v":1429,"d":"1,429"}},{"$f":"IFERROR(VLOOKUP($A574,FILTRO.12!A49:K378,6,FALSE),0)","v":0},{"$f":"IFERROR(VLOOKUP($A574,FILTRO.12!A49:K378,7,FALSE),0)","v":293}]
["81602222",1602222,"Herida cortante o contusa NO complicada, reparacion y sutura (una o multiples de mas de 5 cms de largo total y/o que comprometa solo piel)                                                                             ",{"v":2355,"d":"2,355"},{"$f":"IFERROR(VLOOKUP($A575,FILTRO.12!A43:K372,3,FALSE),0)","v":{"v":2030,"d":"2,030"}},{"$f":"IFERROR(VLOOKUP($A575,FILTRO.12!A43:K372,4,FALSE),0)","v":325},{"$f":"IFERROR(VLOOKUP($A575,FILTRO.12!A43:K372,5,FALSE),0)","v":986},{"$f":"IFERROR(VLOOKUP($A575,FILTRO.12!A50:K379,6,FALSE),0)","v":0},{"$f":"IFERROR(VLOOKUP($A575,FILTRO.12!A50:K379,7,FALSE),0)","v":751}]
["81602217",1602223,"Cabeza, cuello, genitales: extirpación de lesión benigna subepidérmica, incluye tumor sólido, quiste epidérmico y lipoma por lesión ",289,{"$f":"IFERROR(VLOOKUP($A576,FILTRO.12!A44:K373,3,FALSE),0)","v":103},{"$f":"IFERROR(VLOOKUP($A576,FILTRO.12!A44:K373,4,FALSE),0)","v":186},{"$f":"IFERROR(VLOOKUP($A576,FILTRO.12!A44:K373,5,FALSE),0)","v":197},{"$f":"IFERROR(VLOOKUP($A576,FILTRO.12!A51:K380,6,FALSE),0)","v":57},{"$f":"IFERROR(VLOOKUP($A576,FILTRO.12!A51:K380,7,FALSE),0)","v":25}]
["81602224",1602224,"Resto del cuerpo: extirpación de lesión benigna subepidérmica, incluye tumor sólido, quiste epidérmico y lipoma por lesión ",191,{"$f":"IFERROR(VLOOKUP($A577,FILTRO.12!A45:K374,3,FALSE),0)","v":0},{"$f":"IFERROR(VLOOKUP($A577,FILTRO.12!A45:K374,4,FALSE),0)","v":191},{"$f":"IFERROR(VLOOKUP($A577,FILTRO.12!A45:K374,5,FALSE),0)","v":178},{"$f":"IFERROR(VLOOKUP($A577,FILTRO.12!A52:K381,6,FALSE),0)","v":112},{"$f":"IFERROR(VLOOKUP($A577,FILTRO.12!A52:K381,7,FALSE),0)","v":18}]
["81602225",1602225,"Vaciamiento y curetaje quirurgico de lesiones quistica o abscesos                              ",164,{"$f":"IFERROR(VLOOKUP($A578,FILTRO.12!A46:K375,3,FALSE),0)","v":83},{"$f":"IFERROR(VLOOKUP($A578,FILTRO.12!A46:K375,4,FALSE),0)","v":81},{"$f":"IFERROR(VLOOKUP($A578,FILTRO.12!A46:K375,5,FALSE),0)","v":137},{"$f":"IFERROR(VLOOKUP($A578,FILTRO.12!A53:K382,6,FALSE),0)","v":26},{"$f":"IFERROR(VLOOKUP($A578,FILTRO.12!A53:K382,7,FALSE),0)","v":26}]
["81602231",1602231,"Onisectomia total o parcial simple                                                                                      ",192,{"$f":"IFERROR(VLOOKUP($A579,FILTRO.12!A47:K376,3,FALSE),0)","v":0},{"$f":"IFERROR(VLOOKUP($A579,FILTRO.12!A47:K376,4,FALSE),0)","v":192},{"$f":"IFERROR(VLOOKUP($A579,FILTRO.12!A47:K376,5,FALSE),0)","v":140},{"$f":"IFERROR(VLOOKUP($A579,FILTRO.12!A54:K383,6,FALSE),0)","v":96},{"$f":"IFERROR(VLOOKUP($A579,FILTRO.12!A54:K383,7,FALSE),0)","v":32}]
["81602232",1602232,"Cirugia reparadora ungueal por proceso inflamatorio                                                                 ",6,{"$f":"IFERROR(VLOOKUP($A580,FILTRO.12!A48:K377,3,FALSE),0)","v":0},{"$f":"IFERROR(VLOOKUP($A580,FILTRO.12!A48:K377,4,FALSE),0)","v":6},{"$f":"IFERROR(VLOOKUP($A580,FILTRO.12!A48:K377,5,FALSE),0)","v":6},{"$f":"IFERROR(VLOOKUP($A580,FILTRO.12!A55:K384,6,FALSE),0)","v":3},{"$f":"IFERROR(VLOOKUP($A580,FILTRO.12!A55:K384,7,FALSE),0)","v":3}]
["81602223",1602233,"Correccion quirurgica de defecto congenito o por tumor ungueal",0,{"$f":"IFERROR(VLOOKUP($A581,FILTRO.12!A49:K378,3,FALSE),0)","v":0},{"$f":"IFERROR(VLOOKUP($A581,FILTRO.12!A49:K378,4,FALSE),0)","v":0},{"$f":"IFERROR(VLOOKUP($A581,FILTRO.12!A49:K378,5,FALSE),0)","v":0},{"$f":"IFERROR(VLOOKUP($A581,FILTRO.12!A56:K385,6,FALSE),0)","v":0},{"$f":"IFERROR(VLOOKUP($A581,FILTRO.12!A56:K385,7,FALSE),0)","v":7}]
["81602240",1602240,"Curacion por medico, quemadura o similar menor al 5% superficie corporal en pabellon       ",82,{"$f":"IFERROR(VLOOKUP($A582,FILTRO.12!A50:K379,3,FALSE),0)","v":62},{"$f":"IFERROR(VLOOKUP($A582,FILTRO.12!A50:K379,4,FALSE),0)","v":20},{"$f":"IFERROR(VLOOKUP($A582,FILTRO.12!A50:K379,5,FALSE),0)","v":19},{"$f":"IFERROR(VLOOKUP($A582,FILTRO.12!A57:K386,6,FALSE),0)","v":0},{"$f":"IFERROR(VLOOKUP($A582,FILTRO.12!A57:K386,7,FALSE),0)","v":54}]
["81602241",1602241,"Curacion por medico, quemadura o similar  5 a 10% superficie corporal en pabellon        ",15,{"$f":"IFERROR(VLOOKUP($A583,FILTRO.12!A51:K380,3,FALSE),0)","v":15},{"$f":"IFERROR(VLOOKUP($A583,FILTRO.12!A51:K380,4,FALSE),0)","v":0},{"$f":"IFERROR(VLOOKUP($A583,FILTRO.12!A51:K380,5,FALSE),0)","v":5},{"$f":"IFERROR(VLOOKUP($A583,FILTRO.12!A58:K387,6,FALSE),0)","v":0},{"$f":"IFERROR(VLOOKUP($A583,FILTRO.12!A58:K387,7,FALSE),0)","v":10}]
["81602242",1602242,"Curacion por medico, quemadura o similar  mayor  al 10% superficie corporal en pabellon",13,{"$f":"IFERROR(VLOOKUP($A584,FILTRO.12!A52:K381,3,FALSE),0)","v":4},{"$f":"IFERROR(VLOOKUP($A584,FILTRO.12!A52:K381,4,FALSE),0)","v":9},{"$f":"IFERROR(VLOOKUP($A584,FILTRO.12!A52:K381,5,FALSE),0)","v":3},{"$f":"IFERROR(VLOOKUP($A584,FILTRO.12!A59:K388,6,FALSE),0)","v":0},{"$f":"IFERROR(VLOOKUP($A584,FILTRO.12!A59:K388,7,FALSE),0)","v":12}]
[null,"TOTAL",null,{"$f":"SUM(D561:D584)","v":{"v":5605,"d":"5,605"}},{"$f":"SUM(E561:E584)","v":{"v":4077,"d":"4,077"}},{"$f":"SUM(F561:F584)","v":{"v":1528,"d":"1,528"}},{"$f":"SUM(G561:G584)","v":{"v":3496,"d":"3,496"}},685,{"v":1285,"d":"1,285"}]
[]
[null,"SECCIÓN D: MISCELÁNEOS"]
["80106002","0106002","Curación simple ambulatoria",{"$f":"SUM(E588:F588)","v":0},{"$f":"IFERROR(VLOOKUP($A588,FILTRO.12!A56:K385,3,FALSE),0)","v":0},{"$f":"IFERROR(VLOOKUP($A588,FILTRO.12!A56:K385,4,FALSE),0)","v":0},{"$f":"IFERROR(VLOOKUP($A588,FILTRO.12!A56:K385,5,FALSE),0)","v":0},{"$f":"IFERROR(VLOOKUP($A588,FILTRO.12!A63:K392,6,FALSE),0)","v":0},{"$f":"IFERROR(VLOOKUP($A588,FILTRO.12!A63:K392,7,FALSE),0)","v":0}]
["80106005","0106005","Autocontrol pacientes Diabetico insulino dependiente (D.I.D. mensual)",{"$f":"SUM(E589:F589)","v":0},{"$f":"IFERROR(VLOOKUP($A589,FILTRO.12!A57:K386,3,FALSE),0)","v":0},{"$f":"IFERROR(VLOOKUP($A589,FILTRO.12!A57:K386,4,FALSE),0)","v":0},{"$f":"IFERROR(VLOOKUP($A589,FILTRO.12!A57:K386,5,FALSE),0)","v":0},{"$f":"IFERROR(VLOOKUP($A589,FILTRO.12!A64:K393,6,FALSE),0)","v":0},{"$f":"IFERROR(VLOOKUP($A589,FILTRO.12!A64:K393,7,FALSE),0)","v":0}]
["80106024",null,"Curación avanzada por UV",{"v":14412,"d":"14,412"},{"$f":"IFERROR(VLOOKUP($A590,FILTRO.12!A58:K387,3,FALSE),0)","v":308},{"$f":"IFERROR(VLOOKUP($A590,FILTRO.12!A58:K387,4,FALSE),0)","v":{"v":14104,"d":"14,104"}},{"$f":"IFERROR(VLOOKUP($A590,FILTRO.12!A58:K387,5,FALSE),0)","v":4},{"$f":"IFERROR(VLOOKUP($A590,FILTRO.12!A65:K394,6,FALSE),0)","v":0},{"$f":"IFERROR(VLOOKUP($A590,FILTRO.12!A65:K394,7,FALSE),0)","v":{"v":13950,"d":"13,950"}}]
["80106006","0106006","Oxigenoterapia domiciliaria (pacientes oxígeno dependientes)",0,{"$f":"IFERROR(VLOOKUP($A591,FILTRO.12!A59:K388,3,FALSE),0)","v":0},{"$f":"IFERROR(VLOOKUP($A591,FILTRO.12!A59:K388,4,FALSE),0)","v":0},{"$f":"IFERROR(VLOOKUP($A591,FILTRO.12!A59:K388,5,FALSE),0)","v":0},{"$f":"IFERROR(VLOOKUP($A591,FILTRO.12!A66:K395,6,FALSE),0)","v":0},{"$f":"IFERROR(VLOOKUP($A591,FILTRO.12!A66:K395,7,FALSE),0)","v":0}]
["80106017","0106017","Curación compleja",{"v":62668,"d":"62,668"},{"$f":"IFERROR(VLOOKUP($A592,FILTRO.12!A60:K389,3,FALSE),0)","v":{"v":2608,"d":"2,608"}},{"$f":"IFERROR(VLOOKUP($A592,FILTRO.12!A60:K389,4,FALSE),0)","v":{"v":60060,"d":"60,060"}},{"$f":"IFERROR(VLOOKUP($A592,FILTRO.12!A60:K389,5,FALSE),0)","v":914},{"$f":"IFERROR(VLOOKUP($A592,FILTRO.12!A67:K396,6,FALSE),0)","v":0},{"$f":"IFERROR(VLOOKUP($A592,FILTRO.12!A67:K396,7,FALSE),0)","v":0}]
["80106007","0106007","Extracción cuerpo extraño ojo",0,{"$f":"IFERROR(VLOOKUP($A593,FILTRO.12!A61:K390,3,FALSE),0)","v":0},{"$f":"IFERROR(VLOOKUP($A593,FILTRO.12!A61:K390,4,FALSE),0)","v":0},{"$f":"IFERROR(VLOOKUP($A593,FILTRO.12!A61:K390,5,FALSE),0)","v":0},{"$f":"IFERROR(VLOOKUP($A593,FILTRO.12!A68:K397,6,FALSE),0)","v":0},{"$f":"IFERROR(VLOOKUP($A593,FILTRO.12!A68:K397,7,FALSE),0)","v":0}]
["80106008","0106008","Extracción cuerpo extraño otro lugar",0,{"$f":"IFERROR(VLOOKUP($A594,FILTRO.12!A62:K391,3,FALSE),0)","v":0},{"$f":"IFERROR(VLOOKUP($A594,FILTRO.12!A62:K391,4,FALSE),0)","v":0},{"$f":"IFERROR(VLOOKUP($A594,FILTRO.12!A62:K391,5,FALSE),0)","v":0},{"$f":"IFERROR(VLOOKUP($A594,FILTRO.12!A69:K398,6,FALSE),0)","v":0},{"$f":"IFERROR(VLOOKUP($A594,FILTRO.12!A69:K398,7,FALSE),0)","v":0}]
["80106009","0106009","Lavado gástrico",0,{"$f":"IFERROR(VLOOKUP($A595,FILTRO.12!A63:K392,3,FALSE),0)","v":0},{"$f":"IFERROR(VLOOKUP($A595,FILTRO.12!A63:K392,4,FALSE),0)","v":0},{"$f":"IFERROR(VLOOKUP($A595,FILTRO.12!A63:K392,5,FALSE),0)","v":0},{"$f":"IFERROR(VLOOKUP($A595,FILTRO.12!A70:K399,6,FALSE),0)","v":0},{"$f":"IFERROR(VLOOKUP($A595,FILTRO.12!A70:K399,7,FALSE),0)","v":0}]
["80106010","0106010","Lavado oído",0,{"$f":"IFERROR(VLOOKUP($A596,FILTRO.12!A64:K393,3,FALSE),0)","v":0},{"$f":"IFERROR(VLOOKUP($A596,FILTRO.12!A64:K393,4,FALSE),0)","v":0},{"$f":"IFERROR(VLOOKUP($A596,FILTRO.12!A64:K393,5,FALSE),0)","v":0},{"$f":"IFERROR(VLOOKUP($A596,FILTRO.12!A71:K400,6,FALSE),0)","v":0},{"$f":"IFERROR(VLOOKUP($A596,FILTRO.12!A71:K400,7,FALSE),0)","v":0}]
["80106011","0106011","Técnicas reanimación cardiopulmonar básico",0,{"$f":"IFERROR(VLOOKUP($A597,FILTRO.12!A65:K394,3,FALSE),0)","v":0},{"$f":"IFERROR(VLOOKUP($A597,FILTRO.12!A65:K394,4,FALSE),0)","v":0},{"$f":"IFERROR(VLOOKUP($A597,FILTRO.12!A65:K394,5,FALSE),0)","v":0},{"$f":"IFERROR(VLOOKUP($A597,FILTRO.12!A72:K401,6,FALSE),0)","v":0},{"$f":"IFERROR(VLOOKUP($A597,FILTRO.12!A72:K401,7,FALSE),0)","v":0}]
["80106012","0106012","Técnicas reanimación cardiopulmonar avanzado",0,{"$f":"IFERROR(VLOOKUP($A598,FILTRO.12!A66:K395,3,FALSE),0)","v":0},{"$f":"IFERROR(VLOOKUP($A598,FILTRO.12!A66:K395,4,FALSE),0)","v":0},{"$f":"IFERROR(VLOOKUP($A598,FILTRO.12!A66:K395,5,FALSE),0)","v":0},{"$f":"IFERROR(VLOOKUP($A598,FILTRO.12!A73:K402,6,FALSE),0)","v":0},{"$f":"IFERROR(VLOOKUP($A598,FILTRO.12!A73:K402,7,FALSE),0)","v":0}]
["80106013","0106013","Aseo ocular",0,{"$f":"IFERROR(VLOOKUP($A599,FILTRO.12!A67:K396,3,FALSE),0)","v":0},{"$f":"IFERROR(VLOOKUP($A599,FILTRO.12!A67:K396,4,FALSE),0)","v":0},{"$f":"IFERROR(VLOOKUP($A599,FILTRO.12!A67:K396,5,FALSE),0)","v":0},{"$f":"IFERROR(VLOOKUP($A599,FILTRO.12!A74:K403,6,FALSE),0)","v":0},{"$f":"IFERROR(VLOOKUP($A599,FILTRO.12!A74:K403,7,FALSE),0)","v":0}]
["80106014","0106014","Administración inyecciones",0,{"$f":"IFERROR(VLOOKUP($A600,FILTRO.12!A68:K397,3,FALSE),0)","v":0},{"$f":"IFERROR(VLOOKUP($A600,FILTRO.12!A68:K397,4,FALSE),0)","v":0},{"$f":"IFERROR(VLOOKUP($A600,FILTRO.12!A68:K397,5,FALSE),0)","v":0},{"$f":"IFERROR(VLOOKUP($A600,FILTRO.12!A75:K404,6,FALSE),0)","v":0},{"$f":"IFERROR(VLOOKUP($A600,FILTRO.12!A75:K404,7,FALSE),0)","v":0}]
["80106015","0106015","Administración fleboclisis",0,{"$f":"IFERROR(VLOOKUP($A601,FILTRO.12!A69:K398,3,FALSE),0)","v":0},{"$f":"IFERROR(VLOOKUP($A601,FILTRO.12!A69:K398,4,FALSE),0)","v":0},{"$f":"IFERROR(VLOOKUP($A601,FILTRO.12!A69:K398,5,FALSE),0)","v":0},{"$f":"IFERROR(VLOOKUP($A601,FILTRO.12!A76:K405,6,FALSE),0)","v":0},{"$f":"IFERROR(VLOOKUP($A601,FILTRO.12!A76:K405,7,FALSE),0)","v":0}]
["80106020","0106020","Administración oxigeno",0,{"$f":"IFERROR(VLOOKUP($A602,FILTRO.12!A70:K399,3,FALSE),0)","v":0},{"$f":"IFERROR(VLOOKUP($A602,FILTRO.12!A70:K399,4,FALSE),0)","v":0},{"$f":"IFERROR(VLOOKUP($A602,FILTRO.12!A70:K399,5,FALSE),0)","v":0},{"$f":"IFERROR(VLOOKUP($A602,FILTRO.12!A77:K406,6,FALSE),0)","v":0},{"$f":"IFERROR(VLOOKUP($A602,FILTRO.12!A77:K406,7,FALSE),0)","v":0}]
["80106021","0106021","Aspiración secreciones",0,{"$f":"IFERROR(VLOOKUP($A603,FILTRO.12!A71:K400,3,FALSE),0)","v":0},{"$f":"IFERROR(VLOOKUP($A603,FILTRO.12!A71:K400,4,FALSE),0)","v":0},{"$f":"IFERROR(VLOOKUP($A603,FILTRO.12!A71:K400,5,FALSE),0)","v":0},{"$f":"IFERROR(VLOOKUP($A603,FILTRO.12!A78:K407,6,FALSE),0)","v":0},{"$f":"IFERROR(VLOOKUP($A603,FILTRO.12!A78:K407,7,FALSE),0)","v":0}]
["80106022","0106022","Instalación sonda",0,{"$f":"IFERROR(VLOOKUP($A604,FILTRO.12!A72:K401,3,FALSE),0)","v":0},{"$f":"IFERROR(VLOOKUP($A604,FILTRO.12!A72:K401,4,FALSE),0)","v":0},{"$f":"IFERROR(VLOOKUP($A604,FILTRO.12!A72:K401,5,FALSE),0)","v":0},{"$f":"IFERROR(VLOOKUP($A604,FILTRO.12!A79:K408,6,FALSE),0)","v":0},{"$f":"IFERROR(VLOOKUP($A604,FILTRO.12!A79:K408,7,FALSE),0)","v":0}]
["80106023",null,"Procedimientos de podología",0,{"$f":"IFERROR(VLOOKUP($A605,FILTRO.12!A73:K402,3,FALSE),0)","v":0},{"$f":"IFERROR(VLOOKUP($A605,FILTRO.12!A73:K402,4,FALSE),0)","v":0},{"$f":"IFERROR(VLOOKUP($A605,FILTRO.12!A73:K402,5,FALSE),0)","v":0},{"$f":"IFERROR(VLOOKUP($A605,FILTRO.12!A80:K409,6,FALSE),0)","v":0},{"$f":"IFERROR(VLOOKUP($A605,FILTRO.12!A80:K409,7,FALSE),0)","v":0}]
[null,"TOTAL",null,{"$f":"SUM(D588:D605)","v":{"v":77080,"d":"77,080"}},{"$f":"SUM(E588:E605)","v":{"v":2916,"d":"2,916"}},{"$f":"SUM(F588:F605)","v":{"v":74164,"d":"74,164"}},918,0,{"v":13950,"d":"13,950"}]
[]
[null,"CÓDIGOS","OTROS PROCEDIMIENTOS","Total","SAPU/SAR/SUR","Resto Establecimientos APS","Compras de Servicios"]
[]
["80307011","0307011","Toma de muestra de sangre venosa en adultos",{"$f":"SUM(E610:F610)","v":{"v":294421,"d":"294,421"}},{"$f":"IFERROR(VLOOKUP($A610,FILTRO.12!A78:K407,3,FALSE),0)","v":{"v":4906,"d":"4,906"}},{"$f":"IFERROR(VLOOKUP($A610,FILTRO.12!A78:K407,4,FALSE),0)","v":{"v":289515,"d":"289,515"}},{"$f":"IFERROR(VLOOKUP($A610,FILTRO.12!A78:K407,5,FALSE),0)","v":{"v":98691,"d":"98,691"}}]
["80307012","0307012","Toma de muestra de sangre venosa en niños y lactantes",{"$f":"SUM(E611:F611)","v":{"v":9881,"d":"9,881"}},{"$f":"IFERROR(VLOOKUP($A611,FILTRO.12!A79:K408,3,FALSE),0)","v":56},{"$f":"IFERROR(VLOOKUP($A611,FILTRO.12!A79:K408,4,FALSE),0)","v":{"v":9825,"d":"9,825"}},{"$f":"IFERROR(VLOOKUP($A611,FILTRO.12!A79:K408,5,FALSE),0)","v":{"v":3557,"d":"3,557"}}]
[null,"TOTAL",null,{"$f":"SUM(D610:D611)","v":{"v":304302,"d":"304,302"}},{"$f":"SUM(E610:E611)","v":{"v":4962,"d":"4,962"}},{"$f":"SUM(F610:F611)","v":{"v":299340,"d":"299,340"}},{"$f":"SUM(G610:G611)","v":{"v":102248,"d":"102,248"}}]
[]
[null,"SECCIÓN E: OTROS EXÁMENES Y PROCEDIMIENTOS  DE APOYO CLÍNICO Y TERAPEUTICO (SIN CÓDIGO EN ARANCEL)"]
[null,"EXÁMENES Y/O PROCEDIMIENTO",null,"Total","SAPU/SAR/SUR","Resto Establecimientos APS","Funcionario",null,"Compras de Servicios"]
[{"$nulls":6},"Médico","Otro"]
["80500001","Toma agudeza visual (ambos ojos)",null,{"$f":"SUM(E617:F617)","v":{"v":1456,"d":"1,456"}},{"$f":"IFERROR(VLOOKUP($A617,FILTRO.12!A85:K414,3,FALSE),0)","v":0},{"$f":"IFERROR(VLOOKUP($A617,FILTRO.12!A85:K414,4,FALSE),0)","v":{"v":1456,"d":"1,456"}},{"$f":"IFERROR(VLOOKUP($A617,FILTRO.12!A85:K414,5,FALSE),0)","v":3},{"$f":"IFERROR(VLOOKUP($A617,FILTRO.12!A5:K334,6,FALSE),0)","v":0},{"$f":"IFERROR(VLOOKUP($A617,FILTRO.12!A5:K334,7,FALSE),0)","v":{"v":1397,"d":"1,397"}}]
["80500002","Autorrefractomia",null,{"$f":"SUM(E618:F618)","v":138},{"$f":"IFERROR(VLOOKUP($A618,FILTRO.12!A86:K415,3,FALSE),0)","v":0},{"$f":"IFERROR(VLOOKUP($A618,FILTRO.12!A86:K415,4,FALSE),0)","v":138},{"$f":"IFERROR(VLOOKUP($A618,FILTRO.12!A86:K415,5,FALSE),0)","v":0},{"$f":"IFERROR(VLOOKUP($A618,FILTRO.12!A6:K335,6,FALSE),0)","v":0},{"$f":"IFERROR(VLOOKUP($A618,FILTRO.12!A6:K335,7,FALSE),0)","v":138}]
["80500003","Lensometria",null,0,{"$f":"IFERROR(VLOOKUP($A619,FILTRO.12!A87:K416,3,FALSE),0)","v":0},{"$f":"IFERROR(VLOOKUP($A619,FILTRO.12!A87:K416,4,FALSE),0)","v":0},{"$f":"IFERROR(VLOOKUP($A619,FILTRO.12!A87:K416,5,FALSE),0)","v":0},{"$f":"IFERROR(VLOOKUP($A619,FILTRO.12!A7:K336,6,FALSE),0)","v":0},{"$f":"IFERROR(VLOOKUP($A619,FILTRO.12!A7:K336,7,FALSE),0)","v":0}]
["80500004","Paquimetria Ultrasónica",null,16,{"$f":"IFERROR(VLOOKUP($A620,FILTRO.12!A88:K417,3,FALSE),0)","v":0},{"$f":"IFERROR(VLOOKUP($A620,FILTRO.12!A88:K417,4,FALSE),0)","v":16},{"$f":"IFERROR(VLOOKUP($A620,FILTRO.12!A88:K417,5,FALSE),0)","v":0},{"$f":"IFERROR(VLOOKUP($A620,FILTRO.12!A8:K337,6,FALSE),0)","v":0},{"$f":"IFERROR(VLOOKUP($A620,FILTRO.12!A8:K337,7,FALSE),0)","v":16}]
["80500005","Paquimetria óptica",null,0,{"$f":"IFERROR(VLOOKUP($A621,FILTRO.12!A89:K418,3,FALSE),0)","v":0},{"$f":"IFERROR(VLOOKUP($A621,FILTRO.12!A89:K418,4,FALSE),0)","v":0},{"$f":"IFERROR(VLOOKUP($A621,FILTRO.12!A89:K418,5,FALSE),0)","v":0},{"$f":"IFERROR(VLOOKUP($A621,FILTRO.12!A9:K338,6,FALSE),0)","v":0},{"$f":"IFERROR(VLOOKUP($A621,FILTRO.12!A9:K338,7,FALSE),0)","v":0}]
["80500006","Tomografía coherencia óptica",null,38,{"$f":"IFERROR(VLOOKUP($A622,FILTRO.12!A90:K419,3,FALSE),0)","v":0},{"$f":"IFERROR(VLOOKUP($A622,FILTRO.12!A90:K419,4,FALSE),0)","v":38},{"$f":"IFERROR(VLOOKUP($A622,FILTRO.12!A90:K419,5,FALSE),0)","v":0},{"$f":"IFERROR(VLOOKUP($A622,FILTRO.12!A10:K339,6,FALSE),0)","v":0},{"$f":"IFERROR(VLOOKUP($A622,FILTRO.12!A10:K339,7,FALSE),0)","v":38}]
["80500007","Inyeccion intravitrea avastin",null,140,{"$f":"IFERROR(VLOOKUP($A623,FILTRO.12!A91:K420,3,FALSE),0)","v":132},{"$f":"IFERROR(VLOOKUP($A623,FILTRO.12!A91:K420,4,FALSE),0)","v":8},{"$f":"IFERROR(VLOOKUP($A623,FILTRO.12!A91:K420,5,FALSE),0)","v":1},{"$f":"IFERROR(VLOOKUP($A623,FILTRO.12!A11:K340,6,FALSE),0)","v":0},{"$f":"IFERROR(VLOOKUP($A623,FILTRO.12!A11:K340,7,FALSE),0)","v":7}]
["80500008","Insercion Implante Anticonceptivo",null,{"v":2486,"d":"2,486"},{"$f":"IFERROR(VLOOKUP($A624,FILTRO.12!A92:K421,3,FALSE),0)","v":23},{"$f":"IFERROR(VLOOKUP($A624,FILTRO.12!A92:K421,4,FALSE),0)","v":{"v":2463,"d":"2,463"}},{"$f":"IFERROR(VLOOKUP($A624,FILTRO.12!A92:K421,5,FALSE),0)","v":15},{"$f":"IFERROR(VLOOKUP($A624,FILTRO.12!A12:K341,6,FALSE),0)","v":0},{"$f":"IFERROR(VLOOKUP($A624,FILTRO.12!A12:K341,7,FALSE),0)","v":{"v":2461,"d":"2,461"}}]
["80500009","Remocion Implante Anticonceptivo",null,{"v":1715,"d":"1,715"},{"$f":"IFERROR(VLOOKUP($A625,FILTRO.12!A93:K422,3,FALSE),0)","v":12},{"$f":"IFERROR(VLOOKUP($A625,FILTRO.12!A93:K422,4,FALSE),0)","v":{"v":1703,"d":"1,703"}},{"$f":"IFERROR(VLOOKUP($A625,FILTRO.12!A93:K422,5,FALSE),0)","v":12},{"$f":"IFERROR(VLOOKUP($A625,FILTRO.12!A13:K342,6,FALSE),0)","v":0},{"$f":"IFERROR(VLOOKUP($A625,FILTRO.12!A13:K342,7,FALSE),0)","v":{"v":1693,"d":"1,693"}}]
["80500010","Insercion Pellets subcutáneo",null,518,{"$f":"IFERROR(VLOOKUP($A626,FILTRO.12!A94:K423,3,FALSE),0)","v":0},{"$f":"IFERROR(VLOOKUP($A626,FILTRO.12!A94:K423,4,FALSE),0)","v":518},{"$f":"IFERROR(VLOOKUP($A626,FILTRO.12!A94:K423,5,FALSE),0)","v":0},{"$f":"IFERROR(VLOOKUP($A626,FILTRO.12!A14:K343,6,FALSE),0)","v":0},{"$f":"IFERROR(VLOOKUP($A626,FILTRO.12!A14:K343,7,FALSE),0)","v":430}]
["80500011","Hemoglocotest instantaneo ",null,{"v":84192,"d":"84,192"},{"$f":"IFERROR(VLOOKUP($A627,FILTRO.12!A95:K424,3,FALSE),0)","v":{"v":52765,"d":"52,765"}},{"$f":"IFERROR(VLOOKUP($A627,FILTRO.12!A95:K424,4,FALSE),0)","v":{"v":31427,"d":"31,427"}},{"$f":"IFERROR(VLOOKUP($A627,FILTRO.12!A95:K424,5,FALSE),0)","v":624},{"$f":"IFERROR(VLOOKUP($A627,FILTRO.12!A15:K344,6,FALSE),0)","v":108},{"$f":"IFERROR(VLOOKUP($A627,FILTRO.12!A15:K344,7,FALSE),0)","v":{"v":78566,"d":"78,566"}}]
["80500014","Radiografía de pelvis, cadera o coxofemoral de 1er screening  (entre 3 -6 meses)",null,{"v":1041,"d":"1,041"},{"$f":"IFERROR(VLOOKUP($A628,FILTRO.12!A96:K425,3,FALSE),0)","v":326},{"$f":"IFERROR(VLOOKUP($A628,FILTRO.12!A96:K425,4,FALSE),0)","v":715},{"$f":"IFERROR(VLOOKUP($A628,FILTRO.12!A96:K425,5,FALSE),0)","v":290},{"$f":"IFERROR(VLOOKUP($A628,FILTRO.12!A16:K345,6,FALSE),0)","v":834},{"$f":"IFERROR(VLOOKUP($A628,FILTRO.12!A16:K345,7,FALSE),0)","v":263}]
["80500016","Cartridge para Troponina",null,{"v":1174,"d":"1,174"},{"$f":"IFERROR(VLOOKUP($A629,FILTRO.12!A97:K426,3,FALSE),0)","v":{"v":1174,"d":"1,174"}},{"$f":"IFERROR(VLOOKUP($A629,FILTRO.12!A97:K426,4,FALSE),0)","v":0},{"$f":"IFERROR(VLOOKUP($A629,FILTRO.12!A97:K426,5,FALSE),0)","v":6},{"$f":"IFERROR(VLOOKUP($A629,FILTRO.12!A17:K346,6,FALSE),0)","v":5},{"$f":"IFERROR(VLOOKUP($A629,FILTRO.12!A17:K346,7,FALSE),0)","v":{"v":1171,"d":"1,171"}}]
["80500017","Cartridge Multiple",null,{"v":3734,"d":"3,734"},{"$f":"IFERROR(VLOOKUP($A630,FILTRO.12!A98:K427,3,FALSE),0)","v":{"v":3734,"d":"3,734"}},{"$f":"IFERROR(VLOOKUP($A630,FILTRO.12!A98:K427,4,FALSE),0)","v":0},{"$f":"IFERROR(VLOOKUP($A630,FILTRO.12!A98:K427,5,FALSE),0)","v":26},{"$f":"IFERROR(VLOOKUP($A630,FILTRO.12!A18:K347,6,FALSE),0)","v":6},{"$f":"IFERROR(VLOOKUP($A630,FILTRO.12!A18:K347,7,FALSE),0)","v":{"v":3677,"d":"3,677"}}]
[null,"TOTAL",null,{"$f":"SUM(D617:D630)","v":{"v":96648,"d":"96,648"}},{"$f":"SUM(E617:E630)","v":{"v":58166,"d":"58,166"}},{"$f":"SUM(F617:F630)","v":{"v":38482,"d":"38,482"}},{"$f":"SUM(G617:G630)","v":977},953,{"v":89857,"d":"89,857"}]

{"sheet":"FILTRO.12","index":3,"n_rows":334,"n_cols":11,"rows_kept":334}
["Mes","(Todas)"]
["establecimiento","(Todas)"]
["comuna","(Todas)"]
[]
["Etiquetas de fila","Suma de Col01","Suma de Col02","Suma de Col03","Suma de Col04","Suma de Col06","Suma de Col05","Suma de Col07","Suma de Col08","Suma de Col09","Suma de Col10"]
["18010100",93537,0,93537]
["18010200",323002,477,322525]
["18010500",3469,0,3469]
["18010601",22828,27,22801]
["18010800",3548,0,3548]
["18010900",110846,2625,108221]
["18011001",56568,49256,7312]
["18011002",2867,0,2867]
["18020200",188,160,28]
["18020300",22323,15893,6437]
["18020400",984,2,982]
["18020500",149172,32653,116510]
["18020600",160,142,18]
["18020700",1458,1091,367]
["18020800",974,960,14]
["18020900",999,0,999]
["18030000",5605,4077,1528]
["18040100",4061,434,3627]
["18040200",1520,69,1451]
["18050100",96939,16643,80253]
["18050200",1954,208,1746]
["18050300",691,327,364]
["18050400",14515,310,14781]
["18050500",62613,2601,60018]
["18070100",331,39,231,40,8,4,9]
["18070300",852,296,355,27,70,22,82]
["18090000",33981,603,33130]
["18090100",63572,0,63572]
["18090200",7837,1666]
["18400400",206,169,37]
["18400500",1049,0,1049]
["18400700",1139477]
["18400900",5374,952,4422]
["18700100",118,22,86,10,null,2]
["18700240",18,null,18]
["18700250",812,null,812]
["18700260",9,null,9]
["18700270",1003,null,1003]
["18700280",8,null,8]
["18700290",606,null,606]
["18700300",32,null,32]
["18700310",500,null,500]
["18700330",261,null,261]
["18700340",8,null,8]
["18700350",489,null,489]
["80106002",97022,16675,80347,515,387,89647]
["80106005",1953,208,1745,134,0,1701]
["80106006",771,327,444,17,0,596]
["80106007",822,400,422,89,0,632]
["80106008",612,218,394,52,0,369]
["80106009",49,34,15,9,0,44]
["80106010",903,86,817,293,0,476]
["80106011",30,17,13,1,0,22]
["80106012",70,45,25,18,0,49]
["80106013",2967,1662,1305,126,0,2649]
["80106014",415084,253947,161137,3831,1137,389752]
["80106015",67422,57059,10363,296,169,63761]
["80106017",62671,2608,60060,914,5,60132]
["80106020",5479,4547,932,559,1,5217]
["80106021",400,112,288,11,0,234]
["80106022",3270,1472,1799,61,0,2960]
["80106023",33942,603,33233,149,1703,31485]
["80106024",14419,308,14104,4,0,13950]
["80301002",0,null,null,4]
["80301011",7,null,7,539]
["80301014",5,0,5,83]
["80301015",31,null,31,1639]
["80301017",0,null,null,4]
["80301026",0,null,null,3]
["80301030",0,null,null,3]
["80301033",0,null,null,5]
["80301034",1236,0,1236,2619]
["80301035",0,null,null,489]
["80301036",3755,0,3755,37440]
["80301038",1719,0,1719,33010]
["80301040",6,null,6,6]
["80301041",30268,0,30268,58722]
["80301042",0,null,null,1]
["80301045",51290,0,51290,73405]
["80301046",0,null,null,3707]
["80301059",3350,0,3350,3183]
["80301065",24,null,24,36]
["80301067",159,null,159,67]
["80301069",0,null,null,1]
["80301075",32,null,32,363]
["80301078",0,null,null,4]
["80301083",3,null,3,140]
["80301085",1010,null,1010,1799]
["80301086",175,0,175,1440]
["80301087",467,0,467,4060]
["80301088",0,null,null,2]
["80301091",0,null,null,1]
["80302004",0,null,null,4]
["80302005",28331,0,28331,38916]
["80302006",30,30,null,119]
["80302008",0,null,null,17]
["80302012",203,0,203,811]
["80302013",457,0,457,8207]
["80302015",140,null,140,1935]
["80302020",0,0,0,32]
["80302021",0,null,null,68]
["80302022",0,null,null,5225]
["80302023",45733,0,45733,97295]
["80302024",92,null,92,316]
["80302025",0,null,null,10]
["80302026",6,null,6,311]
["80302028",21,null,21]
["80302030",78,0,78,1454]
["80302032",68255,0,68255,82122]
["80302033",0,null,null,12]
["80302034",49828,0,49828,68680]
["80302035",2,0,2,167]
["80302038",0,null,null,92]
["80302040",440,0,440,8060]
["80302042",73,null,73,1157]
["80302044",0,null,null,50]
["80302045",50,null,50,2596]
["80302047",60280,447,59833,127506]
["80302048",4385,0,4385,11573]
["80302050",0,null,null,103]
["80302051",0,null,null,38]
["80302053",0,null,null,7]
["80302054",0,null,null,58]
["80302057",26894,0,26894,43452]
["80302058",1,null,1,1]
["80302059",1394,null,1394]
["80302060",1274,0,1274,4237]
["80302063",749,0,749,20518]
["80302064",2745,0,2745,54344]
["80302065",0,null,null,124]
["80302067",4612,0,4612,61386]
["80302068",1509,0,1509,50980]
["80302069",0,null,null,5414]
["80302075",65,0,65,1701]
["80302076",25355,0,25355,24635]
["80303015",2,null,2,1230]
["80303024",35829,0,35829,84098]
["80303025",0,null,null,17]
["80303026",26930,0,26930,29718]
["80303027",451,null,451,81]
["80303028",360,null,360,37]
["80305003",0,null,null,1]
["80305004",0,null,null,5]
["80305005",0,null,null,2046]
["80305007",0,null,null,2]
["80305009",0,null,null,2]
["80305012",0,null,null,14]
["80305018",0,null,null,1]
["80305019",1564,null,1564,3359]
["80305020",9,null,9,418]
["80305027",0,null,null,12]
["80305028",0,null,null,2]
["80305029",0,null,null,4]
["80305030",4,null,4,196]
["80305031",0,null,null,1]
["80305060",0,null,null,1]
["80305070",1892,null,1892,8103]
["80305170",0,null,null,12]
["80306001",27,2,25,230]
["80306002",128,25,103,867]
["80306004",478,null,478,8]
["80306005",288,null,288,8]
["80306007",230,null,230,472]
["80306008",273,null,273,77]
["80306011",10024,0,10024,20508]
["80306016",0,null,null,5]
["80306018",7,null,7,67]
["80306022",0,null,null,1]
["80306023",0,null,null,54]
["80306026",1763,null,1763,10]
["80306037",0,null,null,28]
["80306038",6469,0,6469,11208]
["80306041",0,null,null,4]
["80306042",298,null,298,10204]
["80306045",0,null,null,100]
["80306047",0,null,null,25]
["80306048",311,0,311,1086]
["80306049",0,null,null,20]
["80306050",0,null,null,63]
["80306051",164,0,164,345]
["80306052",2,null,2,49]
["80306059",245,null,245,68]
["80306061",1952,0,1952,4539]
["80306062",0,null,null,1]
["80306063",0,null,null,1]
["80306064",0,null,null,33]
["80306066",4,null,4,117]
["80306067",0,null,null,84]
["80306069",0,null,null,25]
["80306073",0,null,null,65]
["80306075",0,null,null,387]
["80306076",0,null,null,18]
["80306077",2,null,2,54]
["80306078",32,null,32,1192]
["80306079",20,0,20,978]
["80306080",11,null,11,74]
["80306081",0,0,0,23]
["80306117",24,null,24]
["80306169",64,0,64,2622]
["80306170",12,null,12]
["80307011",294421,4906,289515,98691]
["80307012",9881,56,9825,3557]
["80308001",3,null,3,54]
["80308003",0,null,null,5]
["80308004",169,0,169,1363]
["80308005",242,null,242,188]
["80308010",2874,0,2874,0]
["80308012",0,null,null,481]
["80308013",0,null,null,1]
["80308018",0,null,null,25]
["80308022",0,null,null,6]
["80308035",0,null,null,6]
["80308037",0,null,null,462]
["80308044",391,null,391,346]
["80309004",0,null,null,1237]
["80309008",0,null,null,147]
["80309010",26436,null,26436,31991]
["80309011",0,null,null,235]
["80309012",0,null,null,264]
["80309013",33456,null,33456,43215]
["80309014",266,103,163,220]
["80309015",0,null,null,57]
["80309016",1140,null,1140]
["80309020",0,null,null,41]
["80309022",46038,60,45978,90871]
["80309023",2364,2287,77,3769]
["80309024",501,175,326,9053]
["80309028",645,null,645,7784]
["80401001",11,11]
["80401002",324,324,null,319]
["80401009",1345,979,366,920]
["80401010",2207,null,2207,3617]
["80401013",1101,1101,null,318]
["80401014",88,88,null,8]
["80401028",38,38,null,1]
["80401029",19,19,null,1]
["80401031",1741,1741,null,615]
["80401032",2236,2236,null,493]
["80401033",169,169,null,11]
["80401042",1177,1177,null,399]
["80401043",16,16,null,12]
["80401044",3,3,null,3]
["80401045",2292,2292,null,742]
["80401046",1542,1542,null,729]
["80401047",1,1,null,1]
["80401048",9,9,null,2]
["80401049",0,null,null,2]
["80401051",2357,2342,15,3740]
["80401052",671,651,20,519]
["80401053",299,299,null,75]
["80401054",13735,13735,null,4134]
["80401055",229,229,null,53]
["80401056",26,26,null,26]
["80401058",19,19,null,1]
["80401059",1853,1853,null,404]
["80401060",7813,7813,null,5774]
["80401061",1,1]
["80401062",468,468,null,365]
["80401063",2,2]
["80401070",12293,9414,2879,7178]
["80401110",275,null,275,282]
["80401151",2208,658,1550,2696]
["80404002",2233,18,2215,0]
["80404003",1049,null,1049,1844]
["80404004",1,null,1,1]
["80404005",166,null,166,0]
["80404006",533,null,533,5]
["80404007",28,null,28]
["80404012",1081,null,1081,1597]
["80404018",9,null,9,9]
["80500001",1456,0,1456,3,0,1397]
["80500002",138,null,138,0,null,138]
["80500004",16,null,16,0,null,16]
["80500006",38,null,38,0,null,38]
["80500007",140,132,8,1,null,7]
["80500008",2486,23,2463,15,0,2461]
["80500009",1715,12,1703,12,0,1693]
["80500010",518,null,518,null,0,430]
["80500011",84179,52765,31427,624,108,78566]
["80500014",1041,326,715,290,834,263]
["80500016",1174,1174,0,6,5,1171]
["80500017",3734,3734,0,26,6,3677]
["81201015",4,0,4,0,0,4]
["81201019",2,2,{"$nulls":3},2]
["81201029",200,167,33,29,0,171]
["81301025",145,130,15,47,0,93]
["81301026",21,14,7,2,0,19]
["81301029",8,6,2,4,0,4]
["81301030",16,12,4,10,null,5]
["81601110",5,null,5,null,null,5]
["81601115",990,2,988,0,0,993]
["81602201",46,2,44,39,40,7]
["81602202",94,null,94,91,88,0]
["81602203",85,0,85,84,80,1]
["81602204",71,0,71,69,65,8]
["81602205",70,0,70,55,60,27]
["81602206",60,null,60,56,56,11]
["81602207",2,null,2,2,2]
["81602217",289,103,186,197,57,25]
["81602221",1870,1778,92,1429,0,293]
["81602222",2355,2030,325,986,0,751]
["81602223",0,{"$nulls":4},7]
["81602224",191,0,191,178,112,18]
["81602225",164,83,81,137,26,26]
["81602231",192,0,192,140,96,32]
["81602232",6,null,6,6,3,3]
["81602240",82,62,20,19,null,54]
["81602241",15,15,null,5,null,10]
["81602242",13,4,9,3,null,12]
["81701001",79128,21422,57706,363,21095,75186]
["81701006",46,3,43,0,8,46]
["81701009",36464,6609,29855,735,105,35449]
["81707001",2433,11,2422,0,0,2433]
["81707002",1584,0,1584,0,0,1576]
["81707004",71,34,37,0,0,71]
["81707030",18332,15938,2394,244,44,16801]
["81707038",35670,4850,30820,14,95,33755]
["81801023",158,141,17,4,null,149]
["81801042",4,3,1,2,null,2]
["81901019",936,764,172,50,0,894]
["81901022",532,337,195,12,0,520]
["82001015",1004,0,1004,0,0,985]
["82101001",15,15,0,15,0,0]
["82106004",156,156,null,2,null,152]
["82106005",416,415,1,1,null,406]
["82106006",205,202,3,1,0,209]
["82106007",6,2,4,null,null,6]
["82107003",176,170,6,4,null,180]
["Total general",4213120,643043,2424344,1475721,26465,924962,91]

{"sheet":"Filtro_","index":4,"n_rows":324,"n_cols":8,"rows_kept":324,"hidden":true}
["Mes","(Todas)"]
["Comuna","(Todas)"]
["Establecimiento","(Todas)"]
[]
["Etiquetas de fila","Suma de Col01","Suma de Col02","Suma de Col03","Suma de Col04","Suma de Col05","Suma de Col06","Suma de Col07"]
["18010100",70428,0,70428]
["18010200",237224,466,236758]
["18010500",2444,0,2444]
["18010601",16728,25,16703]
["18010800",2612,0,2612]
["18010900",79611,1375,78236]
["18011001",40680,36007,4673]
["18011002",1642,0,1642]
["18020200",138,115,23]
["18020300",16420,11656,4771]
["18020400",831,2,829]
["18020500",112299,22812,89478]
["18020600",120,109,11]
["18020700",1127,823,304]
["18020800",668,654,14]
["18020900",831,0,831]
["18030000",4126,3003,1123]
["18040100",2989,283,2706]
["18040200",1115,53,1062]
["18050100",73834,12283,61513]
["18050200",1767,208,1559]
["18050300",540,304,236]
["18050400",10997,190,10827]
["18050500",46234,1923,44311]
["18070100",331,39,231,40,4,8,9]
["18070300",625,219,278,18,14,50,46]
["18090000",27158,603,26412]
["18090100",46593,0,46593]
["18090200",5965,1260]
["18400400",169,136,33]
["18400500",622,0,622]
["18400700",817457]
["18400900",4421,801,3620]
["18700100",115,22,84,9,0]
["18700240",18,null,18]
["18700250",606,null,606]
["18700260",9,null,9]
["18700270",785,null,785]
["18700280",8,null,8]
["18700290",524,null,524]
["18700300",32,null,32]
["18700310",331,null,331]
["18700330",184,null,184]
["18700340",8,null,8]
["18700350",316,null,316]
["80106002",73927,12296,61631,363,68447,192]
["80106005",1766,208,1558,120,1529,0]
["80106006",540,304,236,17,463,0]
["80106007",591,288,303,58,485,0]
["80106008",472,177,295,44,301,0]
["80106009",24,22,2,1,22,0]
["80106010",689,64,625,236,375]
["80106011",27,14,13,1,20]
["80106012",45,40,5,16,29,0]
["80106013",1954,1215,739,88,1793,0]
["80106014",307417,183071,124346,2423,286816,380]
["80106015",48037,40647,7390,207,45228,0]
["80106017",46247,1928,44320,788,44474,0]
["80106020",3896,3135,761,26,3690,0]
["80106021",190,95,95,1,175,0]
["80106022",2393,1078,1315,36,2195,0]
["80106023",27124,603,26521,149,25408,1251]
["80106024",10926,190,10729,4,10536,0]
["80301002",0,null,null,2]
["80301011",7,null,7,358]
["80301014",5,0,5,65]
["80301015",22,null,22,1243]
["80301017",0,null,null,4]
["80301026",0,null,null,3]
["80301030",0,null,null,3]
["80301034",882,0,882,2008]
["80301035",0,null,null,478]
["80301036",2848,0,2848,30035]
["80301038",1526,0,1526,26328]
["80301040",6,null,6,6]
["80301041",22295,0,22295,45019]
["80301042",0,null,null,1]
["80301045",39157,0,39157,56655]
["80301046",0,null,null,2696]
["80301059",2449,0,2449,2444]
["80301065",22,null,22,24]
["80301067",118,null,118,50]
["80301069",0,null,null,1]
["80301075",32,null,32,294]
["80301083",0,null,null,124]
["80301085",680,null,680,1304]
["80301086",127,0,127,1179]
["80301087",252,0,252,2760]
["80301088",0,null,null,2]
["80302004",0,null,null,4]
["80302005",20869,0,20869,30070]
["80302006",19,19,null,119]
["80302008",0,null,null,14]
["80302012",140,0,140,703]
["80302013",372,0,372,6638]
["80302015",73,null,73,1354]
["80302020",0,0,0,32]
["80302021",0,null,null,68]
["80302022",0,null,null,4121]
["80302023",33740,0,33740,76242]
["80302024",83,null,83,251]
["80302025",0,null,null,8]
["80302026",3,null,3,196]
["80302028",10,null,10]
["80302030",57,0,57,1258]
["80302032",47870,0,47870,64754]
["80302033",0,null,null,12]
["80302034",36836,0,36836,51625]
["80302035",2,null,2,124]
["80302038",0,null,null,92]
["80302040",303,0,303,6533]
["80302042",12,null,12,839]
["80302044",0,null,null,50]
["80302045",12,null,12,1826]
["80302047",45328,447,44881,99975]
["80302048",3285,0,3285,8450]
["80302050",0,null,null,4]
["80302051",0,null,null,32]
["80302053",0,null,null,6]
["80302054",0,null,null,58]
["80302057",19922,0,19922,32501]
["80302058",1,null,1,1]
["80302059",969,null,969]
["80302060",861,null,861,2918]
["80302063",504,0,504,16166]
["80302064",2196,0,2196,45117]
["80302065",0,null,null,101]
["80302067",3745,0,3745,49769]
["80302068",1288,0,1288,41711]
["80302069",0,null,null,4092]
["80302075",16,0,16,1435]
["80302076",18708,0,18708,18250]
["80303015",2,null,2,1180]
["80303024",26353,0,26353,65022]
["80303025",0,null,null,16]
["80303026",19598,0,19598,22702]
["80303027",361,null,361,73]
["80303028",279,null,279,26]
["80305003",0,null,null,1]
["80305004",0,null,null,3]
["80305005",0,null,null,1478]
["80305009",0,null,null,2]
["80305012",0,null,null,6]
["80305018",0,null,null,1]
["80305019",1102,null,1102,2627]
["80305020",9,null,9,324]
["80305027",0,null,null,11]
["80305028",0,null,null,2]
["80305029",0,null,null,3]
["80305030",4,null,4,128]
["80305031",0,null,null,1]
["80305070",1329,null,1329,5981]
["80305170",0,null,null,11]
["80306001",25,null,25,194]
["80306002",113,25,88,673]
["80306004",184,null,184,7]
["80306005",221,null,221,7]
["80306007",167,null,167,215]
["80306008",212,null,212,55]
["80306011",7357,0,7357,15586]
["80306016",0,null,null,4]
["80306018",3,null,3,53]
["80306022",0,null,null,1]
["80306023",0,null,null,54]
["80306026",1293,null,1293,4]
["80306038",4840,0,4840,7015]
["80306041",0,null,null,4]
["80306042",213,null,213,9073]
["80306045",0,null,null,80]
["80306047",0,null,null,25]
["80306048",235,0,235,854]
["80306049",0,null,null,20]
["80306050",0,null,null,63]
["80306051",125,0,125,269]
["80306052",1,null,1,38]
["80306059",172,null,172,51]
["80306061",1436,0,1436,3362]
["80306062",0,null,null,1]
["80306064",0,null,null,28]
["80306066",0,null,null,114]
["80306067",0,null,null,84]
["80306069",0,null,null,25]
["80306073",0,null,null,65]
["80306075",0,null,null,286]
["80306076",0,null,null,18]
["80306077",2,null,2,47]
["80306078",22,null,22,892]
["80306079",19,null,19,591]
["80306080",0,null,null,58]
["80306081",0,null,null,18]
["80306117",18,null,18]
["80306169",58,0,58,1755]
["80306170",12,null,12]
["80307011",238802,3735,235067,83955]
["80307012",8011,48,7963,2904]
["80308001",1,null,1,40]
["80308003",0,null,null,5]
["80308004",116,null,116,1050]
["80308005",206,null,206,142]
["80308010",2099,0,2099,0]
["80308012",0,null,null,473]
["80308018",0,null,null,8]
["80308022",0,null,null,6]
["80308035",0,null,null,6]
["80308037",0,null,null,462]
["80308044",321,null,321,275]
["80309004",0,null,null,899]
["80309008",0,null,null,142]
["80309010",17900,null,17900,26300]
["80309012",0,null,null,264]
["80309013",24610,null,24610,32982]
["80309014",221,103,118,154]
["80309015",0,null,null,41]
["80309016",796,null,796]
["80309020",0,null,null,41]
["80309022",34293,48,34245,71800]
["80309023",1122,1049,73,3092]
["80309024",178,175,3,5738]
["80309028",491,null,491,6483]
["80401001",7,7]
["80401002",218,218,null,213]
["80401009",1053,767,286,661]
["80401010",868,null,868,1389]
["80401013",862,862,null,246]
["80401014",70,70,null,6]
["80401028",30,30]
["80401029",14,14]
["80401031",1280,1280,null,445]
["80401032",1652,1652,null,342]
["80401033",126,126,null,8]
["80401042",830,830,null,271]
["80401043",9,9,null,6]
["80401044",2,2,null,2]
["80401045",1646,1646,null,539]
["80401046",1129,1129,null,558]
["80401047",1,1,null,1]
["80401048",9,9,null,2]
["80401049",0,null,null,2]
["80401051",1676,1661,15,3232]
["80401052",511,491,20,400]
["80401053",214,214,null,48]
["80401054",9933,9933,null,2995]
["80401055",172,172,null,38]
["80401056",23,23,null,23]
["80401058",18,18,null,1]
["80401059",1367,1367,null,293]
["80401060",5582,5582,null,4662]
["80401061",1,1]
["80401062",342,342,null,263]
["80401063",2,2]
["80401070",9086,7046,2040,5080]
["80401110",275,null,275,275]
["80401151",1672,503,1169,1856]
["80404002",1613,18,1595,0]
["80404003",622,null,622,1131]
["80404004",1,null,1,1]
["80404005",122,null,122,0]
["80404006",326,null,326,5]
["80404007",28,null,28]
["80404012",534,null,534,822]
["80404018",9,null,9,9]
["80500001",1314,0,1314,2,1271,0]
["80500002",138,null,138,0,138]
["80500004",16,null,16,0,16]
["80500006",38,null,38,0,38]
["80500007",140,132,8,1,7]
["80500008",1963,23,1940,15,1940,0]
["80500009",1393,12,1381,12,1372,0]
["80500010",315,null,315,null,315,0]
["80500011",60955,37232,23736,103,57046,39]
["80500014",801,266,535,203,225,639]
["80500016",899,899,0,0,900,5]
["80500017",2735,2735,0,0,2687,6]
["81201019",2,2,null,null,2]
["81201029",167,134,33,16,151,0]
["81301025",110,99,11,33,72,0]
["81301026",11,5,6,1,10,0]
["81301029",6,4,2,3,3,0]
["81301030",13,9,4,7,5]
["81601110",5,null,5,null,5]
["81601115",837,2,835,0,839,0]
["81602201",32,2,30,25,7,27]
["81602202",80,null,80,77,0,74]
["81602203",56,null,56,55,1,52]
["81602204",37,null,37,35,8,32]
["81602205",65,null,65,50,27,56]
["81602206",40,null,40,36,2,36]
["81602207",2,null,2,2,null,2]
["81602217",227,103,124,135,10,38]
["81602221",1244,1163,81,866,249,0]
["81602222",1837,1594,243,702,644,0]
["81602223",0,{"$nulls":3},7]
["81602224",142,0,142,129,13,84]
["81602225",114,70,44,93,20,11]
["81602231",144,0,144,96,27,72]
["81602232",6,null,6,6,3,3]
["81602240",77,57,20,17,52]
["81602241",12,12,null,4,7]
["81602242",11,2,9,1,10]
["81701001",60843,15169,45674,325,58048,15673]
["81701006",32,3,29,null,32]
["81701009",26655,4203,22452,1,26200,58]
["81707001",1825,11,1814,0,1825,0]
["81707002",1203,0,1203,0,1195,0]
["81707004",69,34,35,0,69]
["81707030",13413,11694,1719,145,12029,0]
["81707038",26391,3524,22867,10,25242,85]
["81801023",116,106,10,2,114]
["81801042",4,3,1,2,2]
["81901019",728,578,150,26,688,0]
["81901022",399,245,154,0,395,0]
["82001015",836,0,836,0,818,0]
["82101001",7,7,0,7,0,0]
["82106004",121,121,null,2,121]
["82106005",259,258,1,1,249]
["82106006",105,102,3,1,109,0]
["82106007",6,2,4,null,6]
["82107003",170,164,6,4,174]
["Total general",3113632,463201,1827915,1152875,687449,18873,55]