{"text_format":"3","workbook":"xlsx","n_sheets":5,"sheets":["NOMBRE","BM18","BM18A","FILTRO.12","Filtro_"],"not_rendered":{"macros":1,"defined_names":1,"pivot_tables":2},"read":"whole","date_system":"1900"}

{"sheet":"NOMBRE","index":0,"n_rows":42,"n_cols":33,"rows_kept":42,"hidden":true,"merged":[[0,0,0,1],[0,2,0,6],[1,8,1,13],[2,8,2,13],[8,0,8,1],[13,0,13,1],[16,1,18,1]]}
["DATOS DEL ESTABLECIMIENTO",null,"CÓDIGOS"]
["NOMBRE DE COMUNA",{"$nulls":7},{"$f":"IF(OR(NOMBRE!C2=\"\",NOMBRE!D2=\"\",NOMBRE!E2=\"\",NOMBRE!F2=\"\",NOMBRE!G2=\"\"),\"Falta Cód. Com.\",\"\")","v":"Falta Cód. Com."},{"$nulls":23},{"$f":"IF(I2>\"\",1,0)","v":1}]
["NOMBRE ESTABLECIMIENTO/ESTRATEGIA",{"$nulls":7},{"$f":"IF(OR(NOMBRE!C3=\"\",NOMBRE!D3=\"\",NOMBRE!E3=\"\",NOMBRE!F3=\"\",NOMBRE!G3=\"\",NOMBRE!H3=\"\"),\"Falta Cód. Est.\",\"\")","v":"Falta Cód. Est."},{"$nulls":23},{"$f":"IF(I3>\"\",1,0)","v":1}]
[]
[]
["MES:",{"$nulls":7},{"$f":"IF(OR(NOMBRE!C6=\"\",NOMBRE!D6=\"\"),\"Falta Cód. Mes.\",\"\")","v":"Falta Cód. Mes."},{"$nulls":23},{"$f":"IF(I6>\"\",1,0)","v":1}]
["AÑO:",2024,{"$nulls":30},{"$f":"SUM(AG2:AG6)","v":3}]
[{"$nulls":6}," "]
["Versión 1.0 FEBRERO 2024"]
[]
["Director/a Servicio de Salud o Director/a Establecimiento",{"$nulls":25},"ENERO","Establecimiento de Mayor Complejidad (EMAYC)","SERVICIO DE SALUD"]
["Jefe/a de Estadísticas",{"$nulls":25},"FEBRERO","Establecimiento de Mediana Complejidad (EMEDC)","MUNICIPAL"]
[{"$nulls":26},"MARZO","Establecimiento de Menor Complejidad (EMENC)","OTRA INSTITUCION (Delegado)"]
["MINSAL - DEIS",{"$nulls":25},"ABRIL","Centros de Diagnóstico Terapeutico (CDT)"]
[{"$nulls":26},"MAYO","Centro de Referencia de Salud (CRS)"]
[{"$nulls":26},"JUNIO","Centro de Salud Familiar"]
[null,"SERIE BM ESTABLECIMIENTOS AREA MUNICIPAL",{"$nulls":24},"JULIO","Consultorio General Urbano (CGU)"]
[{"$nulls":26},"AGOSTO","Consultorio General Urbano (CGU) - CESFAM"]
[{"$nulls":26},"SEPTIEMBRE","Consultorio General Urbano(CGU) con SAPU/SUR/SAR"]
[{"$nulls":26},"OCTUBRE","Consultorio General Urbano (CGU) - CESFAM con SAPU/SAR"]
[{"$nulls":26},"NOVIEMBRE","Consultorio General Rural (CGR)"]
[{"$nulls":26},"DICIEMBRE","Consultorio General Rural (CGR) - CESFAM"]
[{"$nulls":27},"Consultorio General Rural (CGR) con SAPU/SAR/SUR"]
[{"$nulls":27},"Consultorio General Rural (CGR) - CESFAM con SAPU/SAR/SUR"]
[{"$nulls":27},"Posta de Salud Rural (PSR)"]
[{"$nulls":27},"Centro Comunitario de Salud Familiar (CECOF)"]
[{"$nulls":27},"Consultorio de Salud Mental (COSAM)"]
[{"$nulls":27},"Programa de Reparación y Atención Integral de Salud (PRAIS)"]
[{"$nulls":27},"Centro de Atención Funcionarios (CAF)"]
[{"$nulls":27},"Unidad de Salud de Funcionarios (USF)"]
[{"$nulls":27},"ClÍnica Dental Móvil (CDM)"]
[{"$nulls":27},"Dirección Servicio de Salud (DSS)"]
[{"$nulls":27},"Servicio de Atención Primaria de Urgencia (SAPU)"]
[{"$nulls":27},"Servicio de Urgencia Rural (SUR)"]
[{"$nulls":27},"Servicio de Alta Resolución SAR"]
[{"$nulls":27},"Laboratorio Clínico o Dental"]
[{"$nulls":27},"Servicio de Atención Primaria de Urgencia Dental (SAPUDENT)"]
[{"$nulls":27},"Centro de Rehabilitación (CR)"]
[{"$nulls":27},"Hospital de Campaña"]
[{"$nulls":27},"Centro Oncologico"]
{"$rows_left_out":3}
{"sheet":"BM18","index":1,"n_rows":112,"n_cols":23,"rows_kept":112,"merged":[[7,1,8,6],[9,1,9,3],[10,1,11,3],[10,4,11,4],[10,5,11,5],[10,6,11,6],[12,2,12,3],[13,2,13,3],[14,2,14,3],[15,2,15,3],[16,2,16,3],[17,2,17,3],[18,2,18,3],[19,2,19,3],[20,2,20,3],[21,2,21,3],[22,2,22,3],[23,2,23,3],[24,2,24,3],[25,2,25,3],[26,2,26,3],[27,2,27,3],[28,2,28,3],[29,1,42,1],[29,2,30,2],[31,2,32,2],[33,2,34,2],[35,2,36,2],[37,2,38,2],[39,2,40,2],[41,2,42,2],[43,2,43,3],[46,1,47,1],[46,2,47,2],[46,3,47,3],[46,4,47,4],[61,1,62,2],[61,3,62,3],[61,4,62,4],[61,5,62,5],[63,1,63,2],[70,1,71,1],[70,2,71,2],[70,3,71,3],[70,4,71,4],[79,1,80,1],[79,2,80,2],[83,1,84,1],[83,2,84,2],[83,3,83,8],[89,1,89,2],[90,1,92,1],[94,1,95,1],[94,2,95,2],[94,3,94,5],[94,6,95,6]]}
[null,"SERVICIO DE SALUD "]
[null,{"$f":"CONCATENATE(\"COMUNA: \",NOMBRE!B2,\"  \",\"( \",NOMBRE!C2,NOMBRE!D2,NOMBRE!E2,NOMBRE!F2,NOMBRE!G2,\" )\")","v":"COMUNA:   (  )"}]
[null,{"$f":"CONCATENATE(\"ESTABLECIMIENTO/ESTRATEGIA: \",NOMBRE!B3,\"  \",\"( \",NOMBRE!C3,NOMBRE!D3,NOMBRE!E3,NOMBRE!F3,NOMBRE!G3,NOMBRE!H3,\" )\")","v":"ESTABLECIMIENTO/ESTRATEGIA:   (  )"}]
[null,{"$f":"CONCATENATE(\"MES: \",NOMBRE!B6,\"  \",\"( \",NOMBRE!C6,NOMBRE!D6,\" )\")","v":"MES:   (  )"}]
[null,{"$f":"CONCATENATE(\"AÑO: \",NOMBRE!B7)","v":"AÑO: 2024"}]
[]
[]
[null,"REM-B18.   ACTIVIDADES DE APOYO DIAGNOSTICO Y TERAPEUTICO\n     (USO EXCLUSIVO DE ESTABLECIMIENTOS MUNICIPALES)"]
[]
[null,"SECCIÓN A: EXÁMENES DE DIAGNOSTICO"]
[null,"EXÁMENES",null,null,"TOTAL","SAPU/SAR/SUR","Resto Establecimientos APS"]
[{"$nulls":5},"Total","Total"]
[null,"TOTAL EXÁMENES LABORATORIO",null,null,{"$f":"SUM(F13:G13)","v":{"v":591880,"d":"591,880"}},{"$f":"SUM(F14:F16,F18:F19,F24:F25)","v":477},{"$f":"SUM(G14:G16,G18:G19,G24:G25)","v":{"v":591403,"d":"591,403"}}," "]
["18010100","I  ","HEMATOLÓGICOS",null,{"$f":"SUM(F14:G14)","v":{"v":93537,"d":"93,537"}},{"$f":"IFERROR(VLOOKUP($A14,FILTRO.12!A5:K167,3,FALSE),0)","v":0},{"$f":"IFERROR(VLOOKUP($A14,FILTRO.12!A5:K167,4,FALSE),0)","v":{"v":93537,"d":"93,537"}}]
["18010200","II  ","BIOQUÍMICOS",null,{"$f":"SUM(F15:G15)","v":{"v":323002,"d":"323,002"}},{"$f":"IFERROR(VLOOKUP($A15,FILTRO.12!A6:K168,3,FALSE),0)","v":477},{"$f":"IFERROR(VLOOKUP($A15,FILTRO.12!A6:K168,4,FALSE),0)","v":{"v":322525,"d":"322,525"}}]
["18090100","III","HORMONALES",null,{"v":63572,"d":"63,572"},{"$f":"IFERROR(VLOOKUP($A16,FILTRO.12!A7:K169,3,FALSE),0)","v":0},{"$f":"IFERROR(VLOOKUP($A16,FILTRO.12!A7:K169,4,FALSE),0)","v":{"v":63572,"d":"63,572"}}]
[null,"IV","GENÉTICA",null,null,{"$f":"IFERROR(VLOOKUP($A17,FILTRO.12!A8:K170,3,FALSE),0)","v":0},{"$f":"IFERROR(VLOOKUP($A17,FILTRO.12!A8:K170,4,FALSE),0)","v":0}]
["18010500","V","INMUNOLÓGICOS",null,{"$f":"SUM(F18:G18)","v":0},{"$f":"IFERROR(VLOOKUP($A18,FILTRO.12!A9:K171,3,FALSE),0)","v":0},{"$f":"IFERROR(VLOOKUP($A18,FILTRO.12!A9:K171,4,FALSE),0)","v":0}]
["18010601","VI  ","MICROBIOLÓGICOS",null,0,{"$f":"IFERROR(VLOOKUP($A19,FILTRO.12!A10:K172,3,FALSE),0)","v":0},{"$f":"IFERROR(VLOOKUP($A19,FILTRO.12!A10:K172,4,FALSE),0)","v":0}]
[null,null,"a)   BACTERIAS Y HONGOS"]
[null,null,"b)   PARÁSITOS"]
[null,null,"c)   VIRUS"]
[null,"VII","PROCEDIMIENTO O DETERMINACIÓN DIRECTA C/PACIENTE"]
["18010800","VIII  ","EX.  DE DEPOSICIONES EXUDADOS. SECREC. Y OTROS LIQ.  ",null,{"$f":"SUM(F24:G24)","v":{"v":3548,"d":"3,548"}},{"$f":"IFERROR(VLOOKUP($A24,FILTRO.12!A5:K334,3,FALSE),0)","v":0},{"$f":"IFERROR(VLOOKUP($A24,FILTRO.12!A5:K334,4,FALSE),0)","v":{"v":3548,"d":"3,548"}}]
["18010900","IX   ","ORINA",null,{"v":108221,"d":"108,221"},{"$f":"IFERROR(VLOOKUP($A25,FILTRO.12!A16:K178,3,FALSE),0)","v":0},{"$f":"IFERROR(VLOOKUP($A25,FILTRO.12!A6:K335,4,FALSE),0)","v":{"v":108221,"d":"108,221"}}]
[null,"TOTAL EXÁMENES IMAGENOLOGIA",null,null,{"$f":"SUM(F26:G26)","v":{"v":10179,"d":"10,179"}},{"$f":"SUM(F27+F28+F44)","v":0},{"$f":"SUM(G27+G28)","v":{"v":10179,"d":"10,179"}}]
["18011001","a)","EX. RADIOLÓGICOS SIMPLES",null,{"$f":"SUM(F27:G27)","v":{"v":7312,"d":"7,312"}},{"$f":"IFERROR(VLOOKUP($A27,FILTRO.12!A18:K180,3,FALSE),0)","v":0},{"$f":"IFERROR(VLOOKUP($A27,FILTRO.12!A8:K337,4,FALSE),0)","v":{"v":7312,"d":"7,312"}}]
["18011002",null," Ecotomografías",null,{"$f":"SUM(F28:G28)","v":{"v":2867,"d":"2,867"}},{"$f":"IFERROR(VLOOKUP($A28,FILTRO.12!A19:K181,3,FALSE),0)","v":0},{"$f":"IFERROR(VLOOKUP($A28,FILTRO.12!A9:K338,4,FALSE),0)","v":{"v":2867,"d":"2,867"}}]
["18400500",null," Ecotomografías abdominal ",null,{"v":1049,"d":"1,049"},{"$f":"IFERROR(VLOOKUP($A29,FILTRO.12!A20:K182,3,FALSE),0)","v":0},{"$f":"IFERROR(VLOOKUP($A29,FILTRO.12!A10:K339,4,FALSE),0)","v":{"v":1049,"d":"1,049"}}]
["18700240",null,"Ecografías Obstétrica Primer Trimestre (<11 semanas)","Médico/a",{"$f":"SUM(G30)","v":18},{"$f":"IFERROR(VLOOKUP($A30,FILTRO.12!A21:K183,3,FALSE),0)","v":0},{"$f":"IFERROR(VLOOKUP($A30,FILTRO.12!A11:K340,4,FALSE),0)","v":18}]
["18700250",null,null,"Matrón/a",{"$f":"SUM(G31)","v":812},{"$f":"IFERROR(VLOOKUP($A31,FILTRO.12!A22:K184,3,FALSE),0)","v":0},{"$f":"IFERROR(VLOOKUP($A31,FILTRO.12!A12:K341,4,FALSE),0)","v":812}]
["18700260",null,"Ecografias Obstétricas Primer Trimestre (11 - 14 semanas)","Médico/a",{"$f":"SUM(G32)","v":9},{"$f":"IFERROR(VLOOKUP($A32,FILTRO.12!A23:K185,3,FALSE),0)","v":0},{"$f":"IFERROR(VLOOKUP($A32,FILTRO.12!A13:K342,4,FALSE),0)","v":9}]
["18700270",null,null,"Matrón/a",{"v":1003,"d":"1,003"},{"$f":"IFERROR(VLOOKUP($A33,FILTRO.12!A24:K186,3,FALSE),0)","v":0},{"$f":"IFERROR(VLOOKUP($A33,FILTRO.12!A14:K343,4,FALSE),0)","v":{"v":1003,"d":"1,003"}}]
["18700280",null,"Ecografias Obstétricas Segundo Trimestre (22 - 24 semanas)","Médico/a",8,{"$f":"IFERROR(VLOOKUP($A34,FILTRO.12!A25:K187,3,FALSE),0)","v":0},{"$f":"IFERROR(VLOOKUP($A34,FILTRO.12!A15:K344,4,FALSE),0)","v":8}]
["18700290",null,null,"Matrón/a",606,{"$f":"IFERROR(VLOOKUP($A35,FILTRO.12!A26:K188,3,FALSE),0)","v":0},{"$f":"IFERROR(VLOOKUP($A35,FILTRO.12!A16:K345,4,FALSE),0)","v":606}]
["18700300",null,"Ecografias Obstétricas Tercer Trimestre (30 - 34 semanas)","Médico/a",32,{"$f":"IFERROR(VLOOKUP($A36,FILTRO.12!A27:K189,3,FALSE),0)","v":0},{"$f":"IFERROR(VLOOKUP($A36,FILTRO.12!A17:K346,4,FALSE),0)","v":32}]
["18700310",null,null,"Matrón/a",500,{"$f":"IFERROR(VLOOKUP($A37,FILTRO.12!A28:K190,3,FALSE),0)","v":0},{"$f":"IFERROR(VLOOKUP($A37,FILTRO.12!A18:K347,4,FALSE),0)","v":500}]
[null,null,"Total Ecografías Obstétricas por profesional","Médico/a",{"$f":"SUM(E30+E32+E34+E36)","v":67},{"$f":"IFERROR(VLOOKUP($A38,FILTRO.12!A29:K191,3,FALSE),0)","v":0},{"$f":"IFERROR(VLOOKUP($A38,FILTRO.12!A19:K348,4,FALSE),0)","v":0}]
[{"$nulls":3},"Matrón/a",{"$f":"SUM(E31+E33+E35+E37)","v":{"v":2921,"d":"2,921"}},{"$f":"IFERROR(VLOOKUP($A39,FILTRO.12!A30:K192,3,FALSE),0)","v":0},{"$f":"IFERROR(VLOOKUP($A39,FILTRO.12!A20:K349,4,FALSE),0)","v":0}]
["18700320",null,"Ecografía de seguimiento DIU (Regulación de la Fertilidad)","Médico/a",{"$f":"SUM(G40)","v":0},{"$f":"IFERROR(VLOOKUP($A40,FILTRO.12!A31:K193,3,FALSE),0)","v":0},{"$f":"IFERROR(VLOOKUP($A40,FILTRO.12!A21:K350,4,FALSE),0)","v":0}]
{"$rows_left_out":73}
{"sheet":"BM18A","index":2,"n_rows":631,"n_cols":9,"rows_kept":631,"merged":[[5,1,5,3],[6,1,6,6],[9,1,10,1],[9,2,10,2],[9,3,10,3],[9,4,10,4],[9,5,10,5],[9,6,10,6],[11,1,11,2],[11,3,11,6],[97,1,97,2],[99,1,99,2],[99,3,99,6],[169,1,169,2],[171,1,171,2],[171,3,171,6],[178,1,178,2],[180,1,180,2],[180,3,180,6],[238,1,238,2],[240,1,240,2],[240,3,240,6],[319,1,319,2],[321,1,321,2],[366,1,366,2],[368,1,368,2],[399,1,399,2],[400,1,400,2],[402,1,402,2],[402,3,402,6],[487,1,487,8],[488,1,489,1],[488,2,489,2],[488,3,489,3],[488,4,489,4],[488,5,489,5],[488,6,488,7],[488,8,489,8],[490,1,490,2],[490,3,490,8],[493,1,493,2],[493,3,493,8],[505,1,505,2],[507,1,507,2],[514,1,514,2],[516,1,516,2],[516,3,516,8],[519,1,519,2],[521,1,521,2],[521,3,521,8],[526,1,526,2],[528,1,528,2],[528,3,528,8],[533,1,533,2],[535,1,535,2],[535,3,535,8],[539,1,539,2],[541,1,541,2],[541,3,541,8],[544,1,544,2],[546,1,546,2],[546,3,546,8],[549,1,549,2],[549,3,549,8],[557,1,557,2],[559,1,559,2],[559,3,559,8],[584,1,584,2],[586,1,586,2],[586,3,586,8],[605,1,605,2],[607,3,608,3],[607,4,608,4],[607,5,608,5],[607,6,608,6],[611,1,611,2],[613,1,613,3],[613,4,613,8],[614,1,615,2],[614,3,615,3],[614,4,615,4],[614,5,615,5],[614,6,614,7],[614,8,615,8]]}
[null,"SERVICIO DE SALUD "]
[null,{"$f":"CONCATENATE(\"COMUNA: \",NOMBRE!B2,\"  \",\"( \",NOMBRE!C2,NOMBRE!D2,NOMBRE!E2,NOMBRE!F2,NOMBRE!G2,\" )\")","v":"COMUNA:   (  )"}]
[null,{"$f":"CONCATENATE(\"ESTABLECIMIENTO/ESTRATEGIA: \",NOMBRE!B3,\"  \",\"( \",NOMBRE!C3,NOMBRE!D3,NOMBRE!E3,NOMBRE!F3,NOMBRE!G3,NOMBRE!H3,\" )\")","v":"ESTABLECIMIENTO/ESTRATEGIA:   (  )"}]
[null,{"$f":"CONCATENATE(\"MES: \",NOMBRE!B6,\"  \",\"( \",NOMBRE!C6,NOMBRE!D6,\" )\")","v":"MES:   (  )"}]
[null,{"$f":"CONCATENATE(\"AÑO: \",NOMBRE!B7)","v":"AÑO: 2024"}]
[]
[null,"REM-18A  -  LIBRO DE PRESTACIONES DE APOYO DIAGNOSTICO y TERAPÉUTICO\n(USO EXCLUSIVO DE ESTABLECIMIENTOS MUNICIPALES)"]
[]
[null,"SECCIÓN A: EXÁMENES DE DIAGNOSTICO"]
[null,"CÓDIGOS","EXÁMENES","TOTAL","SAPU/SAR/SUR","Resto Establecimientos APS","Compra de Servicios"]
[]
[null,"SANGRE HEMATOLOGÍA"]
["80301001","0301001","Acidificación del suero, test de Ham",{"$f":"SUM(E13:F13)","v":0},{"$f":"IFERROR(VLOOKUP($A13,FILTRO.12!A5:K334,3,FALSE),0)","v":0},{"$f":"IFERROR(VLOOKUP($A13,FILTRO.12!A5:K334,4,FALSE),0)","v":0},{"$f":"IFERROR(VLOOKUP($A13,FILTRO.12!A5:K334,5,FALSE),0)","v":0}]
["80301002","0301002","Acido fólico o folatos",{"$f":"SUM(E14:F14)","v":0},{"$f":"IFERROR(VLOOKUP($A14,FILTRO.12!A6:K335,3,FALSE),0)","v":0},{"$f":"IFERROR(VLOOKUP($A14,FILTRO.12!A6:K335,4,FALSE),0)","v":0},{"$f":"IFERROR(VLOOKUP($A14,FILTRO.12!A6:K335,5,FALSE),0)","v":4}]
["80301003","0301003","Adenograma, esplenograma, mielograma c/u",{"$f":"SUM(E15:F15)","v":0},{"$f":"IFERROR(VLOOKUP($A15,FILTRO.12!A7:K336,3,FALSE),0)","v":0},{"$f":"IFERROR(VLOOKUP($A15,FILTRO.12!A7:K336,4,FALSE),0)","v":0},{"$f":"IFERROR(VLOOKUP($A15,FILTRO.12!A7:K336,5,FALSE),0)","v":0}]
["80301004","0301004","Adhesividad plaquetaria",0,{"$f":"IFERROR(VLOOKUP($A16,FILTRO.12!A8:K337,3,FALSE),0)","v":0},{"$f":"IFERROR(VLOOKUP($A16,FILTRO.12!A8:K337,4,FALSE),0)","v":0},{"$f":"IFERROR(VLOOKUP($A16,FILTRO.12!A8:K337,5,FALSE),0)","v":0}]
["80301005","0301005","Aglutininas anti Rho",0,{"$f":"IFERROR(VLOOKUP($A17,FILTRO.12!A9:K338,3,FALSE),0)","v":0},{"$f":"IFERROR(VLOOKUP($A17,FILTRO.12!A9:K338,4,FALSE),0)","v":0},{"$f":"IFERROR(VLOOKUP($A17,FILTRO.12!A9:K338,5,FALSE),0)","v":0}]
["80301006","0301006","Agregación plaquetaria",0,{"$f":"IFERROR(VLOOKUP($A18,FILTRO.12!A10:K339,3,FALSE),0)","v":0},{"$f":"IFERROR(VLOOKUP($A18,FILTRO.12!A10:K339,4,FALSE),0)","v":0},{"$f":"IFERROR(VLOOKUP($A18,FILTRO.12!A10:K339,5,FALSE),0)","v":0}]
["80301007","0301007","Anticoagulantes circulantes o anticoagulante lúpico",0,{"$f":"IFERROR(VLOOKUP($A19,FILTRO.12!A11:K340,3,FALSE),0)","v":0},{"$f":"IFERROR(VLOOKUP($A19,FILTRO.12!A11:K340,4,FALSE),0)","v":0},{"$f":"IFERROR(VLOOKUP($A19,FILTRO.12!A11:K340,5,FALSE),0)","v":0}]
["80301008","0301008","Antitrombina III",0,{"$f":"IFERROR(VLOOKUP($A20,FILTRO.12!A12:K341,3,FALSE),0)","v":0},{"$f":"IFERROR(VLOOKUP($A20,FILTRO.12!A12:K341,4,FALSE),0)","v":0},{"$f":"IFERROR(VLOOKUP($A20,FILTRO.12!A12:K341,5,FALSE),0)","v":0}]
["80301009","0301009","Auto-hemólisis test,  con y sin glucosa",0,{"$f":"IFERROR(VLOOKUP($A21,FILTRO.12!A13:K342,3,FALSE),0)","v":0},{"$f":"IFERROR(VLOOKUP($A21,FILTRO.12!A13:K342,4,FALSE),0)","v":0},{"$f":"IFERROR(VLOOKUP($A21,FILTRO.12!A13:K342,5,FALSE),0)","v":0}]
["80301010","0301010","Células del lupus, cada muestra",0,{"$f":"IFERROR(VLOOKUP($A22,FILTRO.12!A14:K343,3,FALSE),0)","v":0},{"$f":"IFERROR(VLOOKUP($A22,FILTRO.12!A14:K343,4,FALSE),0)","v":0},{"$f":"IFERROR(VLOOKUP($A22,FILTRO.12!A14:K343,5,FALSE),0)","v":0}]
["80301011","0301011","Coagulación, tiempo de",7,{"$f":"IFERROR(VLOOKUP($A23,FILTRO.12!A15:K344,3,FALSE),0)","v":0},{"$f":"IFERROR(VLOOKUP($A23,FILTRO.12!A15:K344,4,FALSE),0)","v":7},{"$f":"IFERROR(VLOOKUP($A23,FILTRO.12!A15:K344,5,FALSE),0)","v":539}]
["80301012","0301012","Coágulo,  tiempo de retracción del",0,{"$f":"IFERROR(VLOOKUP($A24,FILTRO.12!A16:K345,3,FALSE),0)","v":0},{"$f":"IFERROR(VLOOKUP($A24,FILTRO.12!A16:K345,4,FALSE),0)","v":0},{"$f":"IFERROR(VLOOKUP($A24,FILTRO.12!A16:K345,5,FALSE),0)","v":0}]
["80301013","0301013","Coágulo, tiempo de lisis del",0,{"$f":"IFERROR(VLOOKUP($A25,FILTRO.12!A17:K346,3,FALSE),0)","v":0},{"$f":"IFERROR(VLOOKUP($A25,FILTRO.12!A17:K346,4,FALSE),0)","v":0},{"$f":"IFERROR(VLOOKUP($A25,FILTRO.12!A17:K346,5,FALSE),0)","v":0}]
["80301014","0301014","Coombs directo, test de",5,{"$f":"IFERROR(VLOOKUP($A26,FILTRO.12!A18:K347,3,FALSE),0)","v":0},{"$f":"IFERROR(VLOOKUP($A26,FILTRO.12!A18:K347,4,FALSE),0)","v":5},{"$f":"IFERROR(VLOOKUP($A26,FILTRO.12!A18:K347,5,FALSE),0)","v":83}]
["80301015","0301015","Coombs indirecto, prueba de",31,{"$f":"IFERROR(VLOOKUP($A27,FILTRO.12!A19:K348,3,FALSE),0)","v":0},{"$f":"IFERROR(VLOOKUP($A27,FILTRO.12!A19:K348,4,FALSE),0)","v":31},{"$f":"IFERROR(VLOOKUP($A27,FILTRO.12!A19:K348,5,FALSE),0)","v":{"v":1639,"d":"1,639"}}]
["80301016","0301016","Cuerpos de Heinz",0,{"$f":"IFERROR(VLOOKUP($A28,FILTRO.12!A20:K349,3,FALSE),0)","v":0},{"$f":"IFERROR(VLOOKUP($A28,FILTRO.12!A20:K349,4,FALSE),0)","v":0},{"$f":"IFERROR(VLOOKUP($A28,FILTRO.12!A20:K349,5,FALSE),0)","v":0}]
["80301017","0301017","Deshidrogenasa glucosa-6-fosfato en eritrocitos",0,{"$f":"IFERROR(VLOOKUP($A29,FILTRO.12!A21:K350,3,FALSE),0)","v":0},{"$f":"IFERROR(VLOOKUP($A29,FILTRO.12!A21:K350,4,FALSE),0)","v":0},{"$f":"IFERROR(VLOOKUP($A29,FILTRO.12!A21:K350,5,FALSE),0)","v":4}]
["80301020","0301020","Euglobulinas, tiempo de lisis de",0,{"$f":"IFERROR(VLOOKUP($A30,FILTRO.12!A22:K351,3,FALSE),0)","v":0},{"$f":"IFERROR(VLOOKUP($A30,FILTRO.12!A22:K351,4,FALSE),0)","v":0},{"$f":"IFERROR(VLOOKUP($A30,FILTRO.12!A22:K351,5,FALSE),0)","v":0}]
["80301021","0301021","Fibrinógeno",0,{"$f":"IFERROR(VLOOKUP($A31,FILTRO.12!A23:K352,3,FALSE),0)","v":0},{"$f":"IFERROR(VLOOKUP($A31,FILTRO.12!A23:K352,4,FALSE),0)","v":0},{"$f":"IFERROR(VLOOKUP($A31,FILTRO.12!A23:K352,5,FALSE),0)","v":0}]
["80301022","0301022","Test de neutralización plaquetaria",0,{"$f":"IFERROR(VLOOKUP($A32,FILTRO.12!A24:K353,3,FALSE),0)","v":0},{"$f":"IFERROR(VLOOKUP($A32,FILTRO.12!A24:K353,4,FALSE),0)","v":0},{"$f":"IFERROR(VLOOKUP($A32,FILTRO.12!A24:K353,5,FALSE),0)","v":0}]
["80301023","0301023","Factor III plaquetario",0,{"$f":"IFERROR(VLOOKUP($A33,FILTRO.12!A25:K354,3,FALSE),0)","v":0},{"$f":"IFERROR(VLOOKUP($A33,FILTRO.12!A25:K354,4,FALSE),0)","v":0},{"$f":"IFERROR(VLOOKUP($A33,FILTRO.12!A25:K354,5,FALSE),0)","v":0}]
["80301024","0301024","Factor V",0,{"$f":"IFERROR(VLOOKUP($A34,FILTRO.12!A26:K355,3,FALSE),0)","v":0},{"$f":"IFERROR(VLOOKUP($A34,FILTRO.12!A26:K355,4,FALSE),0)","v":0},{"$f":"IFERROR(VLOOKUP($A34,FILTRO.12!A26:K355,5,FALSE),0)","v":0}]
["80301025","0301025","Factores VII, VIII, IX, X, XI, XII, XIII, c/u",0,{"$f":"IFERROR(VLOOKUP($A35,FILTRO.12!A27:K356,3,FALSE),0)","v":0},{"$f":"IFERROR(VLOOKUP($A35,FILTRO.12!A27:K356,4,FALSE),0)","v":0},{"$f":"IFERROR(VLOOKUP($A35,FILTRO.12!A27:K356,5,FALSE),0)","v":0}]
["80301026","0301026","Ferritina",0,{"$f":"IFERROR(VLOOKUP($A36,FILTRO.12!A28:K357,3,FALSE),0)","v":0},{"$f":"IFERROR(VLOOKUP($A36,FILTRO.12!A28:K357,4,FALSE),0)","v":0},{"$f":"IFERROR(VLOOKUP($A36,FILTRO.12!A28:K357,5,FALSE),0)","v":3}]
["80301027","0301027","Fibrinógeno, productos de degradación del",0,{"$f":"IFERROR(VLOOKUP($A37,FILTRO.12!A29:K358,3,FALSE),0)","v":0},{"$f":"IFERROR(VLOOKUP($A37,FILTRO.12!A29:K358,4,FALSE),0)","v":0},{"$f":"IFERROR(VLOOKUP($A37,FILTRO.12!A29:K358,5,FALSE),0)","v":0}]
["80301028","0301028","Fierro sérico",0,{"$f":"IFERROR(VLOOKUP($A38,FILTRO.12!A30:K359,3,FALSE),0)","v":0},{"$f":"IFERROR(VLOOKUP($A38,FILTRO.12!A30:K359,4,FALSE),0)","v":0},{"$f":"IFERROR(VLOOKUP($A38,FILTRO.12!A30:K359,5,FALSE),0)","v":0}]
["80301029","0301029","Fierro, capacidad de fijación del (incluye fierro sérico)",0,{"$f":"IFERROR(VLOOKUP($A39,FILTRO.12!A31:K360,3,FALSE),0)","v":0},{"$f":"IFERROR(VLOOKUP($A39,FILTRO.12!A31:K360,4,FALSE),0)","v":0},{"$f":"IFERROR(VLOOKUP($A39,FILTRO.12!A31:K360,5,FALSE),0)","v":0}]
["80301030","0301030","Fierro, cinética del (cada determinación)",0,{"$f":"IFERROR(VLOOKUP($A40,FILTRO.12!A32:K361,3,FALSE),0)","v":0},{"$f":"IFERROR(VLOOKUP($A40,FILTRO.12!A32:K361,4,FALSE),0)","v":0},{"$f":"IFERROR(VLOOKUP($A40,FILTRO.12!A32:K361,5,FALSE),0)","v":3}]
{"$rows_left_out":592}
{"sheet":"FILTRO.12","index":3,"n_rows":334,"n_cols":11,"rows_kept":334}
["Mes","(Todas)"]
["establecimiento","(Todas)"]
["comuna","(Todas)"]
[]
["Etiquetas de fila","Suma de Col01","Suma de Col02","Suma de Col03","Suma de Col04","Suma de Col06","Suma de Col05","Suma de Col07","Suma de Col08","Suma de Col09","Suma de Col10"]
["18010100",93537,0,93537]
["18010200",323002,477,322525]
["18010500",3469,0,3469]
["18010601",22828,27,22801]
["18010800",3548,0,3548]
["18010900",110846,2625,108221]
["18011001",56568,49256,7312]
["18011002",2867,0,2867]
["18020200",188,160,28]
["18020300",22323,15893,6437]
["18020400",984,2,982]
["18020500",149172,32653,116510]
["18020600",160,142,18]
["18020700",1458,1091,367]
["18020800",974,960,14]
["18020900",999,0,999]
["18030000",5605,4077,1528]
["18040100",4061,434,3627]
["18040200",1520,69,1451]
["18050100",96939,16643,80253]
["18050200",1954,208,1746]
["18050300",691,327,364]
["18050400",14515,310,14781]
["18050500",62613,2601,60018]
["18070100",331,39,231,40,8,4,9]
["18070300",852,296,355,27,70,22,82]
["18090000",33981,603,33130]
["18090100",63572,0,63572]
["18090200",7837,1666]
["18400400",206,169,37]
["18400500",1049,0,1049]
["18400700",1139477]
["18400900",5374,952,4422]
["18700100",118,22,86,10,null,2]
["18700240",18,null,18]
{"$rows_left_out":295}
{"sheet":"Filtro_","index":4,"n_rows":324,"n_cols":8,"rows_kept":324,"hidden":true}
["Mes","(Todas)"]
["Comuna","(Todas)"]
["Establecimiento","(Todas)"]
[]
["Etiquetas de fila","Suma de Col01","Suma de Col02","Suma de Col03","Suma de Col04","Suma de Col05","Suma de Col06","Suma de Col07"]
["18010100",70428,0,70428]
["18010200",237224,466,236758]
["18010500",2444,0,2444]
["18010601",16728,25,16703]
["18010800",2612,0,2612]
["18010900",79611,1375,78236]
["18011001",40680,36007,4673]
["18011002",1642,0,1642]
["18020200",138,115,23]
["18020300",16420,11656,4771]
["18020400",831,2,829]
["18020500",112299,22812,89478]
["18020600",120,109,11]
["18020700",1127,823,304]
["18020800",668,654,14]
["18020900",831,0,831]
["18030000",4126,3003,1123]
["18040100",2989,283,2706]
["18040200",1115,53,1062]
["18050100",73834,12283,61513]
["18050200",1767,208,1559]
["18050300",540,304,236]
["18050400",10997,190,10827]
["18050500",46234,1923,44311]
["18070100",331,39,231,40,4,8,9]
["18070300",625,219,278,18,14,50,46]
["18090000",27158,603,26412]
["18090100",46593,0,46593]
["18090200",5965,1260]
["18400400",169,136,33]
["18400500",622,0,622]
["18400700",817457]
["18400900",4421,801,3620]
["18700100",115,22,84,9,0]
["18700240",18,null,18]
{"$rows_left_out":284}