{"text_format":"3","workbook":"xlsx","n_sheets":3,"sheets":["BM18","BM18A","filtro.12"],"not_rendered":{"external_links":2,"pivot_tables":1},"read":"whole","date_system":"1900"}

{"sheet":"BM18","index":0,"n_rows":96,"n_cols":7,"rows_kept":96,"merged":[[7,1,8,6],[9,1,9,3],[10,1,11,3],[10,4,11,4],[10,5,11,5],[10,6,11,6],[12,2,12,3],[13,2,13,3],[14,2,14,3],[15,2,15,3],[16,2,16,3],[17,2,17,3],[18,2,18,3],[19,2,19,3],[20,2,20,3],[21,2,21,3],[22,2,22,3],[23,1,36,1],[23,2,24,2],[25,2,26,2],[27,2,28,2],[29,2,30,2],[31,2,32,2],[33,2,34,2],[35,2,36,2],[39,1,40,1],[39,2,40,2],[39,3,40,3],[39,4,40,4],[54,1,55,1],[54,2,55,2],[58,1,58,2],[59,1,61,1]]}
[null,"SERVICIO DE SALUD "]
[null,{"$f":"CONCATENATE(\"COMUNA: \",[1]NOMBRE!B2,\"  \",\"( \",[1]NOMBRE!C2,[1]NOMBRE!D2,[1]NOMBRE!E2,[1]NOMBRE!F2,[1]NOMBRE!G2,\" )\")","v":"COMUNA: 0  ( 00000 )"}]
[null,{"$f":"CONCATENATE(\"ESTABLECIMIENTO/ESTRATEGIA: \",[1]NOMBRE!B3,\"  \",\"( \",[1]NOMBRE!C3,[1]NOMBRE!D3,[1]NOMBRE!E3,[1]NOMBRE!F3,[1]NOMBRE!G3,[1]NOMBRE!H3,\" )\")","v":"ESTABLECIMIENTO/ESTRATEGIA: 0  ( 000000 )"}]
[null,{"$f":"CONCATENATE(\"MES: \",[1]NOMBRE!B6,\"  \",\"( \",[1]NOMBRE!C6,[1]NOMBRE!D6,\" )\")","v":"MES: 0  ( 00 )"}]
[null,{"$f":"CONCATENATE(\"AÑO: \",[1]NOMBRE!B7)","v":"AÑO: 2025"}]
[]
[]
[null,"REM-B18.   ACTIVIDADES DE APOYO DIAGNOSTICO Y TERAPEUTICO\n     (USO EXCLUSIVO DE ESTABLECIMIENTOS MUNICIPALES)"]
[]
[null,"SECCIÓN A: EXÁMENES DE DIAGNOSTICO"]
[null,"EXÁMENES",null,null,"TOTAL","SAPU/SAR/SUR","Resto Establecimientos APS"]
[{"$nulls":5},"Total","Total"]
[null,"TOTAL EXÁMENES LABORATORIO",null,null,{"$f":"SUM(F13:G13)","v":{"v":758991,"d":"758,991"}},{"$f":"SUM(F14:F20)","v":{"v":5296,"d":"5,296"}},{"$f":"SUM(G14:G20)","v":{"v":753695,"d":"753,695"}}]
[18010100,"I","HEMATOLÓGICOS",null,{"v":99508,"d":"99,508"},{"$f":"IFERROR(VLOOKUP($A14,[2]filtro.12!$A5:$H178,3,FALSE),0)","v":2},{"$f":"IFERROR(VLOOKUP($A14,[2]filtro.12!A5:H178,4,FALSE),0)","v":{"v":99506,"d":"99,506"}}]
[18010200,"II","BIOQUÍMICOS",null,{"v":408037,"d":"408,037"},{"$f":"IFERROR(VLOOKUP($A15,[2]filtro.12!$A6:$H179,3,FALSE),0)","v":9},{"$f":"IFERROR(VLOOKUP($A15,[2]filtro.12!A6:H179,4,FALSE),0)","v":{"v":408028,"d":"408,028"}}]
[18090100,"III","HORMONALES",null,{"v":78993,"d":"78,993"},{"$f":"IFERROR(VLOOKUP($A16,[2]filtro.12!$A7:$H180,3,FALSE),0)","v":0},{"$f":"IFERROR(VLOOKUP($A16,[2]filtro.12!A7:H180,4,FALSE),0)","v":{"v":78993,"d":"78,993"}}]
[18010500,"V","INMUNOLÓGICOS",null,{"v":2104,"d":"2,104"},{"$f":"IFERROR(VLOOKUP($A17,[2]filtro.12!$A8:$H181,3,FALSE),0)","v":0},{"$f":"IFERROR(VLOOKUP($A17,[2]filtro.12!A8:H181,4,FALSE),0)","v":{"v":2104,"d":"2,104"}}]
[18010601,"VI","MICROBIOLÓGICOS",null,{"v":27208,"d":"27,208"},{"$f":"IFERROR(VLOOKUP($A18,[2]filtro.12!$A9:$H182,3,FALSE),0)","v":40},{"$f":"IFERROR(VLOOKUP($A18,[2]filtro.12!A9:H182,4,FALSE),0)","v":{"v":27168,"d":"27,168"}}]
[18010800,"VIII","EX.  DE DEPOSICIONES EXUDADOS. SECREC. Y OTROS LIQ.  ",null,480,{"$f":"IFERROR(VLOOKUP($A19,[2]filtro.12!$A10:$H183,3,FALSE),0)","v":0},{"$f":"IFERROR(VLOOKUP($A19,[2]filtro.12!A10:H183,4,FALSE),0)","v":480}]
[18010900,"IX","ORINA",null,{"v":142661,"d":"142,661"},{"$f":"IFERROR(VLOOKUP($A20,[2]filtro.12!$A11:$H184,3,FALSE),0)","v":{"v":5245,"d":"5,245"}},{"$f":"IFERROR(VLOOKUP($A20,[2]filtro.12!A11:H184,4,FALSE),0)","v":{"v":137416,"d":"137,416"}}]
[null,"TOTAL EXÁMENES IMAGENOLOGIA"]
[18011001,"a)","EX. RADIOLÓGICOS SIMPLES",null,{"$f":"IFERROR(VLOOKUP($A22,[2]filtro.12!$A5:$H178,2,FALSE),0)","v":{"v":43237,"d":"43,237"}},{"$f":"IFERROR(VLOOKUP($A22,[2]filtro.12!A5:H178,3,FALSE),0)","v":{"v":38654,"d":"38,654"}},{"$f":"IFERROR(VLOOKUP($A22,[2]filtro.12!$A5:$H178,4,FALSE),0)","v":{"v":4583,"d":"4,583"}}]
[18700370,null,"ECOGRAFÍAS OBSTÉTRICAS Y GINECOLÓGICAS",null,{"$f":"IFERROR(VLOOKUP($A23,[2]filtro.12!$A6:$H179,2,FALSE),0)","v":{"v":4304,"d":"4,304"}},{"$f":"IFERROR(VLOOKUP($A23,[2]filtro.12!A6:H179,3,FALSE),0)","v":0},{"$f":"IFERROR(VLOOKUP($A23,[2]TdBM.12!A6:H179,4,FALSE),0)","v":{"v":4304,"d":"4,304"}}]
[18700240,null,"Ecografías Obstétricas Primer Trimestre (<11 semanas)","Médico/a",{"$f":"IFERROR(VLOOKUP($A24,[2]filtro.12!$A7:$H180,2,FALSE),0)","v":1},{"$f":"IFERROR(VLOOKUP($A24,[2]filtro.12!A7:H180,3,FALSE),0)","v":0},{"$f":"IFERROR(VLOOKUP($A24,[2]TdBM.12!A7:H180,4,FALSE),0)","v":1}]
[18700250,null,null,"Matrón/a",{"$f":"IFERROR(VLOOKUP($A25,[2]filtro.12!$A8:$H181,2,FALSE),0)","v":903},{"$f":"IFERROR(VLOOKUP($A25,[2]filtro.12!A8:H181,3,FALSE),0)","v":0},{"$f":"IFERROR(VLOOKUP($A25,[2]TdBM.12!A8:H181,4,FALSE),0)","v":903}]
[18700260,null,"Ecografias Obstétricas Primer Trimestre (11 - 14 semanas)","Médico/a",{"$f":"IFERROR(VLOOKUP($A26,[2]filtro.12!$A9:$H182,2,FALSE),0)","v":1},{"$f":"IFERROR(VLOOKUP($A26,[2]filtro.12!A9:H182,3,FALSE),0)","v":0},{"$f":"IFERROR(VLOOKUP($A26,[2]TdBM.12!A9:H182,4,FALSE),0)","v":1}]
[18700270,null,null,"Matrón/a",{"$f":"IFERROR(VLOOKUP($A27,[2]filtro.12!$A10:$H183,2,FALSE),0)","v":{"v":1659,"d":"1,659"}},{"$f":"IFERROR(VLOOKUP($A27,[2]filtro.12!A10:H183,3,FALSE),0)","v":0},{"$f":"IFERROR(VLOOKUP($A27,[2]TdBM.12!A10:H183,4,FALSE),0)","v":{"v":1659,"d":"1,659"}}]
[18700280,null,"Ecografias Obstétricas Segundo Trimestre (22 - 24 semanas)","Médico/a",{"$f":"IFERROR(VLOOKUP($A28,[2]filtro.12!$A11:$H184,2,FALSE),0)","v":1},{"$f":"IFERROR(VLOOKUP($A28,[2]filtro.12!A11:H184,3,FALSE),0)","v":0},{"$f":"IFERROR(VLOOKUP($A28,[2]TdBM.12!A11:H184,4,FALSE),0)","v":1}]
[18700290,null,null,"Matrón/a",{"$f":"IFERROR(VLOOKUP($A29,[2]filtro.12!$A12:$H185,2,FALSE),0)","v":967},{"$f":"IFERROR(VLOOKUP($A29,[2]filtro.12!A12:H185,3,FALSE),0)","v":0},{"$f":"IFERROR(VLOOKUP($A29,[2]TdBM.12!A12:H185,4,FALSE),0)","v":967}]
[18700300,null,"Ecografias Obstétricas Tercer Trimestre (30 - 34 semanas)","Médico/a",{"$f":"IFERROR(VLOOKUP($A30,[2]filtro.12!$A13:$H186,2,FALSE),0)","v":8},{"$f":"IFERROR(VLOOKUP($A30,[2]filtro.12!A13:H186,3,FALSE),0)","v":0},{"$f":"IFERROR(VLOOKUP($A30,[2]TdBM.12!A13:H186,4,FALSE),0)","v":8}]
[18700310,null,null,"Matrón/a",{"$f":"IFERROR(VLOOKUP($A31,[2]filtro.12!$A14:$H187,2,FALSE),0)","v":955},{"$f":"IFERROR(VLOOKUP($A31,[2]filtro.12!A14:H187,3,FALSE),0)","v":0},{"$f":"IFERROR(VLOOKUP($A31,[2]TdBM.12!A14:H187,4,FALSE),0)","v":955}]
[null,null,"Total Ecografías Obstétricas por profesional","Médico/a",{"$f":"IFERROR(VLOOKUP($A32,[2]filtro.12!$A15:$H188,2,FALSE),0)","v":0},{"$f":"IFERROR(VLOOKUP($A32,[2]filtro.12!A15:H188,3,FALSE),0)","v":0}]
[{"$nulls":3},"Matrón/a",{"$f":"IFERROR(VLOOKUP($A33,[2]filtro.12!$A16:$H189,2,FALSE),0)","v":0},{"$f":"IFERROR(VLOOKUP($A33,[2]filtro.12!A16:H189,3,FALSE),0)","v":0}]
[18700320,null,"Ecografía de seguimiento DIU (Regulación de la Fertilidad)","Médico/a",{"$f":"IFERROR(VLOOKUP($A34,[2]filtro.12!$A17:$H190,2,FALSE),0)","v":0},{"$f":"IFERROR(VLOOKUP($A34,[2]filtro.12!A17:H190,3,FALSE),0)","v":0},{"$f":"IFERROR(VLOOKUP($A34,[2]TdBM.12!A17:H190,4,FALSE),0)","v":0}]
[18700330,null,null,"Matrón/a",{"$f":"IFERROR(VLOOKUP($A35,[2]filtro.12!$A18:$H191,2,FALSE),0)","v":201},{"$f":"IFERROR(VLOOKUP($A35,[2]filtro.12!A18:H191,3,FALSE),0)","v":0},{"$f":"IFERROR(VLOOKUP($A35,[2]TdBM.12!A18:H191,4,FALSE),0)","v":201}]
[18700340,null,"Ecografía Transvaginal (control de Climaterio y Ginecológico)","Médico/a",{"$f":"IFERROR(VLOOKUP($A36,[2]filtro.12!$A19:$H192,2,FALSE),0)","v":5},{"$f":"IFERROR(VLOOKUP($A36,[2]filtro.12!A19:H192,3,FALSE),0)","v":0},{"$f":"IFERROR(VLOOKUP($A36,[2]TdBM.12!A19:H192,4,FALSE),0)","v":5}]
[18700350,null,null,"Matrón/a",{"$f":"IFERROR(VLOOKUP($A37,[2]filtro.12!$A20:$H193,2,FALSE),0)","v":604},{"$f":"IFERROR(VLOOKUP($A37,[2]filtro.12!A20:H193,3,FALSE),0)","v":0},{"$f":"IFERROR(VLOOKUP($A37,[2]TdBM.12!A20:H193,4,FALSE),0)","v":604}]
[]
[null,"SECCIÓN B:  PROCEDIMIENTO E INTERVENCIONES QUIRÚRGICAS DE APOYO CLÍNICO Y TERAPÉUTICO"]
[null,"PROCEDIMIENTOS","TOTAL","SAPU/SAR/SUR","Resto Establecimientos APS"]
{"$rows_left_out":48}
{"sheet":"BM18A","index":1,"n_rows":646,"n_cols":7,"rows_kept":646,"merged":[[5,1,5,3],[6,1,6,6],[9,1,10,1],[9,2,10,2],[9,3,10,3],[9,4,10,4],[9,5,10,5],[9,6,10,6],[11,1,11,2],[11,3,11,6],[19,1,19,2],[21,1,21,2],[21,3,21,6],[42,1,42,2],[44,1,44,2],[44,3,44,6],[48,1,48,2],[50,1,50,2],[50,3,50,6],[53,1,53,2],[55,1,55,2],[55,3,55,6],[72,1,72,2],[74,1,74,2],[77,1,77,2],[79,1,79,2],[87,1,87,2],[88,1,88,2],[90,1,90,2],[90,3,90,6],[120,1,121,1],[120,2,121,2],[120,3,121,3],[120,4,121,4],[120,5,121,5],[120,6,121,6],[122,1,122,2],[127,1,127,2],[129,1,129,2],[129,5,129,6],[139,1,139,2],[141,1,141,2],[147,1,147,2],[149,1,149,2],[157,1,157,2],[159,1,159,2],[163,1,163,2],[165,1,165,2],[168,1,168,2],[170,1,170,2],[176,1,176,2],[178,1,178,2],[185,1,185,2],[187,1,187,2],[205,1,205,2]]}
[null,"SERVICIO DE SALUD "]
[null,{"$f":"CONCATENATE(\"COMUNA: \",[1]NOMBRE!B2,\"  \",\"( \",[1]NOMBRE!C2,[1]NOMBRE!D2,[1]NOMBRE!E2,[1]NOMBRE!F2,[1]NOMBRE!G2,\" )\")","v":"COMUNA: 0  ( 00000 )"}]
[null,{"$f":"CONCATENATE(\"ESTABLECIMIENTO/ESTRATEGIA: \",[1]NOMBRE!B3,\"  \",\"( \",[1]NOMBRE!C3,[1]NOMBRE!D3,[1]NOMBRE!E3,[1]NOMBRE!F3,[1]NOMBRE!G3,[1]NOMBRE!H3,\" )\")","v":"ESTABLECIMIENTO/ESTRATEGIA: 0  ( 000000 )"}]
[null,{"$f":"CONCATENATE(\"MES: \",[1]NOMBRE!B6,\"  \",\"( \",[1]NOMBRE!C6,[1]NOMBRE!D6,\" )\")","v":"MES: 0  ( 00 )"}]
[null,{"$f":"CONCATENATE(\"AÑO: \",[1]NOMBRE!B7)","v":"AÑO: 2025"}]
[]
[null,"REM-18A  -  LIBRO DE PRESTACIONES DE APOYO DIAGNOSTICO y TERAPÉUTICO\n(USO EXCLUSIVO DE ESTABLECIMIENTOS MUNICIPALES)"]
[]
[null,"SECCIÓN A: EXÁMENES DE DIAGNOSTICO"]
[null,"CÓDIGOS","EXÁMENES","TOTAL","SAPU/SAR/SUR","Resto Establecimientos APS","Compra de Servicios"]
[]
[null,"SANGRE HEMATOLOGÍA"]
[80301036,"0301036","Hematocrito (proc. aut.)",{"$f":"IFERROR(VLOOKUP($A13,[2]filtro.12!$A5:$H178,2,FALSE),0)","v":{"v":5995,"d":"5,995"}},{"$f":"IFERROR(VLOOKUP($A13,[2]filtro.12!$A5:$H178,3,FALSE),0)","v":0},{"$f":"IFERROR(VLOOKUP($A13,[2]filtro.12!$A5:$H178,4,FALSE),0)","v":{"v":5493,"d":"5,493"}},{"$f":"IFERROR(VLOOKUP($A13,[2]filtro.12!$A5:$H178,5,FALSE),0)","v":{"v":32822,"d":"32,822"}}]
[80301041,"0301041","Hemoglobina glicada A1c",{"$f":"IFERROR(VLOOKUP($A14,[2]filtro.12!$A6:$H179,2,FALSE),0)","v":{"v":37710,"d":"37,710"}},{"$f":"IFERROR(VLOOKUP($A14,[2]filtro.12!$A6:$H179,3,FALSE),0)","v":0},{"$f":"IFERROR(VLOOKUP($A14,[2]filtro.12!$A6:$H179,4,FALSE),0)","v":{"v":37397,"d":"37,397"}},{"$f":"IFERROR(VLOOKUP($A14,[2]filtro.12!$A6:$H179,5,FALSE),0)","v":{"v":59200,"d":"59,200"}}]
[80301045,"0301045","Hemograma (incluye recuentos de leucocitos, eritrocitos, plaquetas, hemoglobina, hematocrito, fórmula leucocitaria, características de los elementos figurados y velocidad de eritrosedimentación)",{"$f":"IFERROR(VLOOKUP($A15,[2]filtro.12!$A7:$H180,2,FALSE),0)","v":{"v":52253,"d":"52,253"}},{"$f":"IFERROR(VLOOKUP($A15,[2]filtro.12!$A7:$H180,3,FALSE),0)","v":1},{"$f":"IFERROR(VLOOKUP($A15,[2]filtro.12!$A7:$H180,4,FALSE),0)","v":{"v":52195,"d":"52,195"}},{"$f":"IFERROR(VLOOKUP($A15,[2]filtro.12!$A7:$H180,5,FALSE),0)","v":{"v":77705,"d":"77,705"}}]
[80301065,"0301065","Recuento de leucocitos, absoluto (proc. aut.)",{"$f":"IFERROR(VLOOKUP($A16,[2]filtro.12!$A8:$H181,2,FALSE),0)","v":50},{"$f":"IFERROR(VLOOKUP($A16,[2]filtro.12!$A8:$H181,3,FALSE),0)","v":0},{"$f":"IFERROR(VLOOKUP($A16,[2]filtro.12!$A8:$H181,4,FALSE),0)","v":50},{"$f":"IFERROR(VLOOKUP($A16,[2]filtro.12!$A8:$H181,5,FALSE),0)","v":139}]
[80301067,"0301067","Recuento de plaquetas (absoluto)",{"$f":"IFERROR(VLOOKUP($A17,[2]filtro.12!$A9:$H182,2,FALSE),0)","v":146},{"$f":"IFERROR(VLOOKUP($A17,[2]filtro.12!$A9:$H182,3,FALSE),0)","v":0},{"$f":"IFERROR(VLOOKUP($A17,[2]filtro.12!$A9:$H182,4,FALSE),0)","v":146},{"$f":"IFERROR(VLOOKUP($A17,[2]filtro.12!$A9:$H182,5,FALSE),0)","v":75}]
[82201010,"0301059","Tiempo de protrombina (incluye INR, Razón Internacional Normalizada)",{"$f":"IFERROR(VLOOKUP($A18,[2]filtro.12!$A10:$H183,2,FALSE),0)","v":{"v":2905,"d":"2,905"}},{"$f":"IFERROR(VLOOKUP($A18,[2]filtro.12!$A10:$H183,3,FALSE),0)","v":1},{"$f":"IFERROR(VLOOKUP($A18,[2]filtro.12!$A10:$H183,4,FALSE),0)","v":{"v":2904,"d":"2,904"}},{"$f":"IFERROR(VLOOKUP($A18,[2]filtro.12!$A10:$H183,5,FALSE),0)","v":{"v":2910,"d":"2,910"}}]
[80301086,"0301086","Velocidad de eritrosedimentación (proc. aut.)",{"$f":"IFERROR(VLOOKUP($A19,[2]filtro.12!$A11:$H184,2,FALSE),0)","v":388},{"$f":"IFERROR(VLOOKUP($A19,[2]filtro.12!$A11:$H184,3,FALSE),0)","v":0},{"$f":"IFERROR(VLOOKUP($A19,[2]filtro.12!$A11:$H184,4,FALSE),0)","v":385},{"$f":"IFERROR(VLOOKUP($A19,[2]filtro.12!$A11:$H184,5,FALSE),0)","v":{"v":1508,"d":"1,508"}}]
[null,"TOTAL",null,{"$f":"SUM(D13:D19)","v":{"v":99447,"d":"99,447"}},{"$f":"SUM(E13:E19)","v":2},{"$f":"SUM(F13:F19)","v":{"v":98570,"d":"98,570"}},{"$f":"SUM(G13:G19)","v":{"v":174359,"d":"174,359"}}]
[]
[null,"SANGRE BIOQUÍMICO"]
[80302005,"0302005","Ácido úrico, en sangre",{"$f":"IFERROR(VLOOKUP($A23,[2]filtro.12!$A15:$H188,2,FALSE),0)","v":{"v":33889,"d":"33,889"}},{"$f":"IFERROR(VLOOKUP($A23,[2]filtro.12!$A15:$H188,3,FALSE),0)","v":0},{"$f":"IFERROR(VLOOKUP($A23,[2]filtro.12!$A15:$H188,4,FALSE),0)","v":{"v":33871,"d":"33,871"}},{"$f":"IFERROR(VLOOKUP($A23,[2]filtro.12!$A15:$H188,5,FALSE),0)","v":{"v":35558,"d":"35,558"}}]
[80302013,"0302013","Bilirrubina total y conjugada",{"$f":"IFERROR(VLOOKUP($A24,[2]filtro.12!$A16:$H189,2,FALSE),0)","v":660},{"$f":"IFERROR(VLOOKUP($A24,[2]filtro.12!$A16:$H189,3,FALSE),0)","v":0},{"$f":"IFERROR(VLOOKUP($A24,[2]filtro.12!$A16:$H189,4,FALSE),0)","v":631},{"$f":"IFERROR(VLOOKUP($A24,[2]filtro.12!$A16:$H189,5,FALSE),0)","v":{"v":8726,"d":"8,726"}}]
[80302067,"0302067","Colesterol total (proc. aut.)",{"$f":"IFERROR(VLOOKUP($A25,[2]filtro.12!$A17:$H190,2,FALSE),0)","v":{"v":3768,"d":"3,768"}},{"$f":"IFERROR(VLOOKUP($A25,[2]filtro.12!$A17:$H190,3,FALSE),0)","v":0},{"$f":"IFERROR(VLOOKUP($A25,[2]filtro.12!$A17:$H190,4,FALSE),0)","v":{"v":3734,"d":"3,734"}},{"$f":"IFERROR(VLOOKUP($A25,[2]filtro.12!$A17:$H190,5,FALSE),0)","v":{"v":46917,"d":"46,917"}}]
[80302068,"0302068","Colesterol HDL (proc. aut.)",{"$f":"IFERROR(VLOOKUP($A26,[2]filtro.12!$A18:$H191,2,FALSE),0)","v":{"v":1749,"d":"1,749"}},{"$f":"IFERROR(VLOOKUP($A26,[2]filtro.12!$A18:$H191,3,FALSE),0)","v":0},{"$f":"IFERROR(VLOOKUP($A26,[2]filtro.12!$A18:$H191,4,FALSE),0)","v":{"v":1723,"d":"1,723"}},{"$f":"IFERROR(VLOOKUP($A26,[2]filtro.12!$A18:$H191,5,FALSE),0)","v":{"v":37095,"d":"37,095"}}]
[80302023,"0302023","Creatinina en sangre",{"$f":"IFERROR(VLOOKUP($A27,[2]filtro.12!$A19:$H192,2,FALSE),0)","v":{"v":57974,"d":"57,974"}},{"$f":"IFERROR(VLOOKUP($A27,[2]filtro.12!$A19:$H192,3,FALSE),0)","v":0},{"$f":"IFERROR(VLOOKUP($A27,[2]filtro.12!$A19:$H192,4,FALSE),0)","v":{"v":57438,"d":"57,438"}},{"$f":"IFERROR(VLOOKUP($A27,[2]filtro.12!$A19:$H192,5,FALSE),0)","v":{"v":96432,"d":"96,432"}}]
[80302024,"0302024","Clearance de creatinina (proc.aut.)",{"$f":"IFERROR(VLOOKUP($A28,[2]filtro.12!$A20:$H193,2,FALSE),0)","v":{"v":2456,"d":"2,456"}},{"$f":"IFERROR(VLOOKUP($A28,[2]filtro.12!$A20:$H193,3,FALSE),0)","v":0},{"$f":"IFERROR(VLOOKUP($A28,[2]filtro.12!$A20:$H193,4,FALSE),0)","v":{"v":2456,"d":"2,456"}},{"$f":"IFERROR(VLOOKUP($A28,[2]filtro.12!$A20:$H193,5,FALSE),0)","v":{"v":7388,"d":"7,388"}}]
[80302032,"0302032","Electrolitos plasmáticos (sodio, potasio, cloro) c/u",{"$f":"IFERROR(VLOOKUP($A29,[2]filtro.12!$A21:$H194,2,FALSE),0)","v":{"v":92757,"d":"92,757"}},{"$f":"IFERROR(VLOOKUP($A29,[2]filtro.12!$A21:$H194,3,FALSE),0)","v":0},{"$f":"IFERROR(VLOOKUP($A29,[2]filtro.12!$A21:$H194,4,FALSE),0)","v":{"v":92371,"d":"92,371"}},{"$f":"IFERROR(VLOOKUP($A29,[2]filtro.12!$A21:$H194,5,FALSE),0)","v":{"v":83561,"d":"83,561"}}]
[80302034,"0302034","Perfil lipídico (incluye mediciones de colesterol total, HDL-colesterol y triglicéridos con estimaciones por fórmula de LDL-colesterol, VLDL-colesterol y colesterol no-HDL)",{"$f":"IFERROR(VLOOKUP($A30,[2]filtro.12!$A22:$H195,2,FALSE),0)","v":{"v":60613,"d":"60,613"}},{"$f":"IFERROR(VLOOKUP($A30,[2]filtro.12!$A22:$H195,3,FALSE),0)","v":0},{"$f":"IFERROR(VLOOKUP($A30,[2]filtro.12!$A22:$H195,4,FALSE),0)","v":{"v":60613,"d":"60,613"}},{"$f":"IFERROR(VLOOKUP($A30,[2]filtro.12!$A22:$H195,5,FALSE),0)","v":{"v":71715,"d":"71,715"}}]
[80302035,"0302035","Fármacos y/o drogas; niveles plasmáticos de (alcohol, anorexígenos, antiarrítmicos, antibióticos, antidepresivos, antiepilépticos, antihistamínicos, antiinflamatorios y analgésicos, estimulantes respiratorios, tranquilizantes mayores y menores, etc.) c/u",{"$f":"IFERROR(VLOOKUP($A31,[2]filtro.12!$A23:$H196,2,FALSE),0)","v":609},{"$f":"IFERROR(VLOOKUP($A31,[2]filtro.12!$A23:$H196,3,FALSE),0)","v":0},{"$f":"IFERROR(VLOOKUP($A31,[2]filtro.12!$A23:$H196,4,FALSE),0)","v":609},{"$f":"IFERROR(VLOOKUP($A31,[2]filtro.12!$A23:$H196,5,FALSE),0)","v":{"v":6288,"d":"6,288"}}]
[80302040,"0302040","Fosfatasas alcalinas totales",{"$f":"IFERROR(VLOOKUP($A32,[2]filtro.12!$A24:$H197,2,FALSE),0)","v":648},{"$f":"IFERROR(VLOOKUP($A32,[2]filtro.12!$A24:$H197,3,FALSE),0)","v":0},{"$f":"IFERROR(VLOOKUP($A32,[2]filtro.12!$A24:$H197,4,FALSE),0)","v":626},{"$f":"IFERROR(VLOOKUP($A32,[2]filtro.12!$A24:$H197,5,FALSE),0)","v":{"v":7543,"d":"7,543"}}]
[80302047,"0302047","Glucosa en sangre",{"$f":"IFERROR(VLOOKUP($A33,[2]filtro.12!$A25:$H198,2,FALSE),0)","v":{"v":70099,"d":"70,099"}},{"$f":"IFERROR(VLOOKUP($A33,[2]filtro.12!$A25:$H198,3,FALSE),0)","v":0},{"$f":"IFERROR(VLOOKUP($A33,[2]filtro.12!$A25:$H198,4,FALSE),0)","v":{"v":69458,"d":"69,458"}},{"$f":"IFERROR(VLOOKUP($A33,[2]filtro.12!$A25:$H198,5,FALSE),0)","v":{"v":118279,"d":"118,279"}}]
[80302048,"0302048","Glucosa, Prueba de Tolerancia a la Glucosa Oral (PTGO), (dos determinaciones)",{"$f":"IFERROR(VLOOKUP($A34,[2]filtro.12!$A26:$H199,2,FALSE),0)","v":{"v":5320,"d":"5,320"}},{"$f":"IFERROR(VLOOKUP($A34,[2]filtro.12!$A26:$H199,3,FALSE),0)","v":0},{"$f":"IFERROR(VLOOKUP($A34,[2]filtro.12!$A26:$H199,4,FALSE),0)","v":{"v":5252,"d":"5,252"}},{"$f":"IFERROR(VLOOKUP($A34,[2]filtro.12!$A26:$H199,5,FALSE),0)","v":{"v":10944,"d":"10,944"}}]
[80302057,"0302057","Nitrógeno ureico y/o úrea en sangre",{"$f":"IFERROR(VLOOKUP($A35,[2]filtro.12!$A27:$H200,2,FALSE),0)","v":{"v":36477,"d":"36,477"}},{"$f":"IFERROR(VLOOKUP($A35,[2]filtro.12!$A27:$H200,3,FALSE),0)","v":0},{"$f":"IFERROR(VLOOKUP($A35,[2]filtro.12!$A27:$H200,4,FALSE),0)","v":{"v":36456,"d":"36,456"}},{"$f":"IFERROR(VLOOKUP($A35,[2]filtro.12!$A27:$H200,5,FALSE),0)","v":{"v":43470,"d":"43,470"}}]
[80302075,"0302075","Perfil bioquímico (determinación automatizada de 12 parámetros)",{"$f":"IFERROR(VLOOKUP($A36,[2]filtro.12!$A28:$H201,2,FALSE),0)","v":443},{"$f":"IFERROR(VLOOKUP($A36,[2]filtro.12!$A28:$H201,3,FALSE),0)","v":7},{"$f":"IFERROR(VLOOKUP($A36,[2]filtro.12!$A28:$H201,4,FALSE),0)","v":436},{"$f":"IFERROR(VLOOKUP($A36,[2]filtro.12!$A28:$H201,5,FALSE),0)","v":{"v":2481,"d":"2,481"}}]
[80302076,"0302076","Perfil Hepático (incluye tiempo de protrombina, bilirrubina total y conjugada, fosfatasas alcalinas totales, GGT, transaminasas GOT/AST y GPT/ALT)",{"$f":"IFERROR(VLOOKUP($A37,[2]filtro.12!$A29:$H202,2,FALSE),0)","v":{"v":31763,"d":"31,763"}},{"$f":"IFERROR(VLOOKUP($A37,[2]filtro.12!$A29:$H202,3,FALSE),0)","v":0},{"$f":"IFERROR(VLOOKUP($A37,[2]filtro.12!$A29:$H202,4,FALSE),0)","v":{"v":31763,"d":"31,763"}},{"$f":"IFERROR(VLOOKUP($A37,[2]filtro.12!$A29:$H202,5,FALSE),0)","v":{"v":25161,"d":"25,161"}}]
[80302063,"0302063","Transaminasas, oxalacética (GOT/AST), Pirúvica (GPT/ALT), c/u",{"$f":"IFERROR(VLOOKUP($A38,[2]filtro.12!$A30:$H203,2,FALSE),0)","v":{"v":1137,"d":"1,137"}},{"$f":"IFERROR(VLOOKUP($A38,[2]filtro.12!$A30:$H203,3,FALSE),0)","v":0},{"$f":"IFERROR(VLOOKUP($A38,[2]filtro.12!$A30:$H203,4,FALSE),0)","v":{"v":1067,"d":"1,067"}},{"$f":"IFERROR(VLOOKUP($A38,[2]filtro.12!$A30:$H203,5,FALSE),0)","v":{"v":18659,"d":"18,659"}}]
[80302064,"0302064","Triglicéridos en sangre (proc.aut.)",{"$f":"IFERROR(VLOOKUP($A39,[2]filtro.12!$A31:$H204,2,FALSE),0)","v":{"v":3758,"d":"3,758"}},{"$f":"IFERROR(VLOOKUP($A39,[2]filtro.12!$A31:$H204,3,FALSE),0)","v":0},{"$f":"IFERROR(VLOOKUP($A39,[2]filtro.12!$A31:$H204,4,FALSE),0)","v":{"v":3095,"d":"3,095"}},{"$f":"IFERROR(VLOOKUP($A39,[2]filtro.12!$A31:$H204,5,FALSE),0)","v":{"v":41936,"d":"41,936"}}]
[82201011,"0302100","Proteínas totales en sangre",{"$f":"IFERROR(VLOOKUP($A40,[2]filtro.12!$A32:$H205,2,FALSE),0)","v":{"v":1054,"d":"1,054"}},{"$f":"IFERROR(VLOOKUP($A40,[2]filtro.12!$A32:$H205,3,FALSE),0)","v":0},{"$f":"IFERROR(VLOOKUP($A40,[2]filtro.12!$A32:$H205,4,FALSE),0)","v":{"v":1050,"d":"1,050"}},{"$f":"IFERROR(VLOOKUP($A40,[2]filtro.12!$A32:$H205,5,FALSE),0)","v":{"v":1631,"d":"1,631"}}]
{"$rows_left_out":607}
{"sheet":"filtro.12","index":2,"n_rows":178,"n_cols":8,"rows_kept":178}
["comuna","(Todas)"]
["establecimiento","(Todas)"]
["Mes","(Todas)"]
[]
["Etiquetas de fila","Suma de Col01","Suma de Col02","Suma de Col03","Suma de Col04","Suma de Col05","Suma de Col06","Suma de Col07"]
[18010100,99508,2,99506]
[18010200,408037,9,408028]
[18010500,2104,0,2104]
[18010601,27208,40,27168]
[18010800,480,0,480]
[18010900,142661,5245,137416]
[18011001,43237,38654,4583]
[18020200,632,178,454]
[18020300,28141,21919,6222]
[18020400,113,6,107]
[18020500,138381,36215,102166]
[18020600,848,608,240]
[18020700,3127,1723,1404]
[18020800,2079,2079]
[18020900,37722,25,37697]
[18030000,4296,2944,1352]
[18090100,78993,0,78993]
[18090200,9210,1373]
[18090300,64,0]
[18400700,566706]
[18700240,1,null,1]
[18700250,903,null,903]
[18700260,1,null,1]
[18700270,1659,null,1659]
[18700280,1,null,1]
[18700290,967,null,967]
[18700300,8,null,8]
[18700310,955,null,955]
[18700330,201,null,201]
[18700340,5,null,5]
[18700350,604,null,604]
[18700360,1082893,418526,664367]
[18700370,4304,0,4304]
[80106002,99974,19081,80882]
[80106006,460,261,199,3]
{"$rows_left_out":138}