{"text_format":"3","workbook":"xlsx","n_sheets":5,"sheets":["NOMBRE","B","B17","Control","MACROS"],"not_rendered":{"images":1,"macros":1,"defined_names":8},"read":"whole","date_system":"1900"}

{"sheet":"NOMBRE","index":0,"n_rows":36,"n_cols":32,"rows_kept":36,"merged":[[0,0,0,1],[0,2,0,6],[1,8,1,13],[2,8,2,13],[8,0,8,1],[13,0,13,1],[16,1,18,1]]}
["DATOS DEL ESTABLECIMIENTO",null,"CÓDIGOS"]
["NOMBRE DE COMUNA",{"$nulls":7},{"$f":"IF(OR(NOMBRE!C2=\"\",NOMBRE!D2=\"\",NOMBRE!E2=\"\",NOMBRE!F2=\"\",NOMBRE!G2=\"\"),\"Falta Cód. Com.\",\"\")","v":"Falta Cód. Com."},{"$nulls":22},{"$f":"IF(I2>\"\",1,0)","v":1}]
["NOMBRE ESTABLECIMIENTO/ESTRATEGIA",{"$nulls":7},{"$f":"IF(OR(NOMBRE!C3=\"\",NOMBRE!D3=\"\",NOMBRE!E3=\"\",NOMBRE!F3=\"\",NOMBRE!G3=\"\",NOMBRE!H3=\"\"),\"Falta Cód. Est.\",\"\")","v":"Falta Cód. Est."},{"$nulls":22},{"$f":"IF(I3>\"\",1,0)","v":1}]
["TIPO DE ESTABLECIMIENTO/ESTRATEGIA",{"$nulls":7},{"$f":"IF(OR(NOMBRE!B4=\"\"),\"Falta Tipo. Est.\",\"\")","v":"Falta Tipo. Est."},{"$nulls":22},{"$f":"IF(I4>\"\",1,0)","v":1}]
["DEPENDENCIA",{"$nulls":7},{"$f":"IF(OR(NOMBRE!B5=\"\"),\"Falta Dependencia. Est.\",\"\")","v":"Falta Dependencia. Est."},{"$nulls":22},{"$f":"IF(I5>\"\",1,0)","v":1}]
["MES:",{"$nulls":7},{"$f":"IF(OR(NOMBRE!C6=\"\",NOMBRE!D6=\"\"),\"Falta Cód. Mes.\",\"\")","v":"Falta Cód. Mes."},{"$nulls":22},{"$f":"IF(I6>\"\",1,0)","v":1}]
["AÑO:",2017,{"$nulls":29},{"$f":"SUM(AF2:AF6)","v":5}]
[]
["Versión 1.6: MAYO 2017"]
[]
["Director Servicio de Salud o Director Establecimiento",{"$nulls":24},"ENERO","Establecimiento de Mayor Complejidad (EMAYC)","SERVICIO DE SALUD"]
["Jefe de Estadisticas",{"$nulls":24},"FEBRERO","Establecimiento de Mediana Complejidad (EMEDC)","MUNICIPAL"]
[{"$nulls":25},"MARZO","Establecimiento de Menor Complejidad (EMENC)","OTRA INSTITUCIÓN (Delegado)"]
["MINSAL - DEIS",{"$nulls":24},"ABRIL","Centros de Diagnóstico Terapéutico (CDT)"]
[{"$nulls":25},"MAYO","Centro de Referencia de Salud (CRS)"]
[{"$nulls":25},"JUNIO","Consultorio General Urbano (CGU)"]
[null,"SERIE BS",{"$nulls":23},"JULIO","Consultorio General Urbano (CGU) - CESFAM"]
[{"$nulls":25},"AGOSTO","Consultorio General Urbano(CGU) con SAPU/SUR/SAR"]
[{"$nulls":25},"SEPTIEMBRE","Consultorio General Urbano (CGU) - CESFAM con SAPU/SAR"]
[{"$nulls":25},"OCTUBRE","Consultorio General Rural (CGR)"]
[{"$nulls":25},"NOVIEMBRE","Consultorio General Rural (CGR) - CESFAM"]
[{"$nulls":25},"DICIEMBRE","Consultorio General Rural (CGR) con SAPU/SUR/SAR"]
[{"$nulls":26},"Consultorio General Rural (CGR) - CESFAM con SAPU/SUR/SAR"]
[{"$nulls":26},"Posta de Salud Rural (PSR)"]
[{"$nulls":26},"Centro Comunitario de Salud Familiar (CECOF)"]
[{"$nulls":26},"Consultorio de Salud Mental (COSAM)"]
[{"$nulls":26},"Programa de Reparación y Atención Integral de Salud (PRAIS)"]
[{"$nulls":26},"Centro de Atención Funcionarios (CAF)"]
[{"$nulls":26},"Clínica Dental Móvil (CDM)"]
[{"$nulls":26},"Dirección Servicio de Salud (DSS)"]
[{"$nulls":26},"Servicio de Atención Primaria de Urgencia (SAPU)"]
[{"$nulls":26},"Servicio de Atención Primaria de Urgencia Alta Resolución (SAR)"]
[{"$nulls":26},"Laboratorio Clínico o Dental"]
[{"$nulls":26},"Servicio de Atención Primaria de Urgencia Dental (SAPUDENT)"]
[{"$nulls":26},"Centro de Rehabilitación (CR)"]
[{"$nulls":26},"Hospital de Campaña"]

{"sheet":"B","index":1,"n_rows":3055,"n_cols":41,"rows_kept":3055,"merged":[[0,2,2,2],[0,3,2,3],[0,4,0,7],[0,8,0,14],[0,15,1,17],[0,18,1,20],[0,21,1,23],[0,24,1,26],[0,27,1,29],[0,30,1,32],[0,33,2,33],[0,34,1,35],[0,36,2,36],[0,37,2,37],[0,38,2,38],[0,39,2,39],[1,0,2,0],[1,1,2,1],[1,4,2,4],[1,5,1,6],[1,7,2,7],[1,8,2,8],[1,9,1,11],[1,12,1,14],[3,2,3,38],[25,2,25,39],[39,3,39,39],[57,2,57,39],[62,2,62,39],[72,2,72,38],[98,3,98,39],[111,2,111,39],[126,3,126,39],[141,3,141,39],[236,21,236,26],[236,30,236,39],[312,20,312,26],[312,30,312,39],[363,19,363,26],[363,30,363,39],[371,21,371,26],[371,30,371,39],[441,3,441,26],[441,30,441,39],[489,3,489,26],[489,30,489,39],[515,3,515,26],[515,30,515,39],[535,0,535,1],[535,3,535,26],[535,30,535,39],[547,2,547,39],[563,3,563,26],[563,30,563,39],[610,3,610,26],[610,30,610,39],[645,3,645,39],[646,3,646,26],[646,30,646,39],[705,3,705,26],[705,30,705,39],[731,3,731,26],[731,30,731,39],[761,2,761,39],[783,2,783,39],[817,2,817,39],[880,3,880,39],[887,0,887,1],[887,3,887,39],[888,0,888,1],[888,3,888,39],[889,3,889,26],[889,30,889,39],[894,3,894,26],[894,30,894,39],[898,3,898,26],[898,30,898,39],[905,3,905,26],[905,30,905,39],[914,3,914,26],[914,30,914,39],[918,3,918,26],[918,30,918,39],[922,4,922,39],[926,3,926,39],[934,3,934,39],[937,3,937,39],[938,3,938,39],[945,2,945,39],[946,3,946,39],[950,3,950,39],[968,3,968,39],[986,2,986,39],[1047,3,1047,39],[1063,3,1063,39],[1075,2,1075,39],[1078,2,1078,39],[1101,2,1101,39],[1111,2,1111,39],[1112,2,1112,39],[1120,2,1120,39],[1174,2,1174,39],[1246,2,1246,39],[1303,3,1303,39],[1383,3,1383,39],[1448,2,1448,39],[1525,3,1525,39],[1528,2,1528,39],[1589,3,1589,39],[1590,2,1590,39],[1658,3,1658,39],[1676,3,1676,39],[1677,3,1677,39],[1703,0,1703,1],[1703,2,1703,39],[1812,2,1812,39],[1841,2,1841,39],[1921,2,1921,39],[1991,2,1991,39],[2055,2,2055,39],[2056,2,2056,39],[2061,2,2061,39],[2153,2,2153,39],[2192,0,2192,1],[2192,3,2192,39],[2220,2,2220,39],[2221,2,2221,39],[2231,3,2231,39],[2316,2,2316,39],[2343,2,2343,39],[2349,2,2349,39],[2384,3,2384,39],[2392,0,2392,1],[2392,2,2392,39],[2411,2,2411,39],[2625,2,2625,39],[2630,3,2630,39],[2642,0,2642,1],[2642,2,2642,39],[2697,2,2697,39],[2700,2,2700,39],[2709,2,2709,39],[2718,24,2718,39],[2719,2,2719,39],[2738,2,2738,39],[2775,2,2775,39],[2801,2,2801,39],[2851,11,2851,39],[2852,2,2852,39],[2856,2,2856,39],[2896,2,2896,39],[2905,2,2905,39],[2925,2,2925,39],[2932,2,2932,39]]}
[null,null,"MODALIDAD","TOTAL","ACTIVIDADES",{"$nulls":3},"INTERVENCIONES QUIRÚRGICAS",{"$nulls":6},"INTERVENCIONES QUIRÚRGICAS MAYORES NO AMBULATORIAS ELECTIVAS",null,null,"INTERVENCIONES QUIRÚRGICAS MAYORES AMBULATORIAS ELECTIVA",null,null,"INTERVENCIONES QUIRÚRGICAS MAYORES AMBULATORIAS URGENCIA",null,null,"INTERVENCIONES QUIRÚRGICAS MAYORES NO AMBULATORIAS URGENCIA",null,null,"PROCEDENCIA",null,null,"PRODUCCION INTRA HOSPITAL",null,null,"OPERATIVO","COMPRAS REALIZADAS",null,"VENTAS DE SERVICIOS"," TIPO DE ACTIVIDAD","TRANSFERENCIA \n2017","TOTAL \nFACTURADO"]
["CODIGO","GLOSA",null,null,"TOTAL BENEFI-CIARIOS","BENEFICIARIOS",null,"NO BENEFI-CIARIOS","TOTAL BENEFICIARIOS","PRINCIPAL",null,null,"SECUNDARIA",{"$nulls":5},"< 15 AÑOS",null,null,"< 15 AÑOS",null,null,"< 15 AÑOS"]
[{"$nulls":5},"MAI","MLE",null,null,"MAI","MLE","NO BENEFI-CIARIO","MAI","MLE","NO BENEFI-CIARIO","TOTAL","< 15 AÑOS","15 AÑOS Y MÁS","TOTAL","< 15 AÑOS","15 AÑOS Y MÁS","TOTAL","< 15 AÑOS","15 AÑOS Y MÁS","TOTAL","< 15 AÑOS","15 AÑOS Y MÁS","ATENCION CERRADA","ATENCION ABIERTA","EMERGENCIA","POR \nHONO-\nRARIOS","POR CONVENIOS","POR\nCONSULTO-\nRES DE \nLLAMADA",null,"AL SISTEMA ","EXTRA-SISTEMA"]
[null,"CONSULTAS Y ATENCION MEDICA "]
["0101101","Consulta o control médico integral en atención primaria","MAI",{"$f":"SUM(E5+H5)","v":0},{"$f":"SUM(F5:G5)","v":0},{"$nulls":32},"Aten",{"v":4590,"d":"4,590"},{"$f":"AM5*F5","v":0}]
["0101102","Consulta o control médico integral en especialidades (Hosp. Mediana Complejidad)","MAI",{"$f":"SUM(E6+H6)","v":0},{"$f":"SUM(F6:G6)","v":0},{"$nulls":32},"Aten",{"v":5780,"d":"5,780"},{"$f":"AM6*F6","v":0}]
["0101103","Consulta médica integral en servicio de urgencia (Hosp. Alta Complejidad)","MAI",0,0,{"$nulls":32},"Cons",{"v":12390,"d":"12,390"},{"$f":"AM7*F7","v":0}]
["0101104","Consulta médica integral en C.R.S.","MAI",0,0,{"$nulls":32},"Cons",{"v":7400,"d":"7,400"},{"$f":"AM8*F8","v":0}]
["0101105","Consulta médica integral en servicio de urgencia (Hosp. Mediana Complejidad)","MAI",0,0,{"$nulls":32},"Cons",{"v":8120,"d":"8,120"},{"$f":"AM9*F9","v":0}]
["0101106","Asistencia de cardiólogo a cirugías no cardíacas","MAI",0,0,{"$nulls":32},"Aten",{"v":15530,"d":"15,530"},{"$f":"AM10*F10","v":0}]
["0101107","Atención médica del recién nacido","MAI",0,0,{"$nulls":32},"Aten",{"v":15530,"d":"15,530"},0]
["0101108","Consulta integral de especialidades en Cirugía, Ginecología y Obstetricia, Ortopedia y Traumatología (en CDT)","MAI",0,0,{"$nulls":32},"Cons",{"v":6260,"d":"6,260"},0]
["0101109","Consulta integral de especialidades en Urología, Otorrinolaringología, Medicina Fisica y Rehabilitación, Dermatología, Pediatría y Subespecialidades (en CDT)","MAI",0,0,{"$nulls":32},"Cons",{"v":7510,"d":"7,510"},0]
["0101110","Consulta integral de especialidades en Medicina Interna y Subespecialidades, Oftalmología, Neurología, Oncología (en CDT)","MAI",0,0,{"$nulls":32},"Cons",{"v":9310,"d":"9,310"},0]
["0101111","Consulta integral de especialidades en Cirugía, Ginecología y Obstetricia, Ortopedia y Traumatología (Hosp. Alta Complejidad)","MAI",0,0,{"$nulls":32},"Cons",{"v":6260,"d":"6,260"},0]
["0101112","Consulta integral de especialidades en Urología, Otorrinolaringología, Medicina Física y Rehabilitación, Dermatología, Pediatría y Subespecialidades (Hosp. Alta Complejidad)","MAI",0,0,{"$nulls":32},"Cons",{"v":7510,"d":"7,510"},0]
["0101113","Consulta integral de especialidades en Medicina Interna y Subespecialidades, Oftalmología, Neurología, Oncología (Hosp. Alta Complejidad)","MAI",0,0,{"$nulls":32},"Cons",{"v":9310,"d":"9,310"},0]
[null,"TOTAL ARANCEL MAI",null,{"$f":"SUM(D5:D17)","v":0},{"$f":"SUM(E5:E17)","v":0},0,0,0,{"$nulls":19},0,0,0,0,0,0,0,0,0,0,0,{"v":115500,"d":"115,500"},0]
["0101001","Consulta médica general","MLE",{"$f":"SUM(E19+H19)","v":0},{"$f":"SUM(F19:G19)","v":0},{"$nulls":32},"Cons"]
[null,"Consultas de urgencia en Hospitales de baja complejidad",null,{"$f":"SUM(E20+H20)","v":0},{"$f":"SUM(F20:G20)","v":0}]
[null,"Consultas de especialidad en hospitales de baja complejidad y establecimientos de APS",null,{"$f":"SUM(E21+H21)","v":0},{"$f":"SUM(F21:G21)","v":0}]
[null,"Otras consulta médica de especialidades ",null,{"$f":"SUM(E22+H22)","v":0},{"$f":"SUM(F22:G22)","v":0},{"$nulls":32},"Cons"]
[null,"Consulta médica de especialidad en servicio de urgencia",null,{"$f":"SUM(E23+H23)","v":0},{"$f":"SUM(F23:G23)","v":0},{"$nulls":32},"Cons"]
[null,"TOTAL ARANCEL MLE Y NO ARANCELADO",null,{"$f":"SUM(D19:D23)","v":0},{"$f":"SUM(E19:E23)","v":0},0,0,0,{"$nulls":19},0,0,0,0,0,0,0,0,0,0,0]
[null,"TOTAL PRODUCCION",null,{"$f":"SUM(D18,D24)","v":0},{"$f":"SUM(E18,E24)","v":0},0,0,0,{"$nulls":19},0,0,0,0,0,0,0,0,0,0,0,{"v":115500,"d":"115,500"},0]
[null,"CONSULTAS POR OTROS PROFESIONALES DE LA SALUD                                       "]
["0102001","Consulta o control por enfermera, matrona o nutricionista","MAI",0,0,{"$nulls":32},"Aten",{"v":1220,"d":"1,220"},{"$f":"AM27*F27","v":0}]
["0102002","Control de salud niño con EDP por enfermera","MAI",0,0,{"$nulls":32},"Ctrl",{"v":2090,"d":"2,090"},0]
["0102003","Consulta o control por auxiliar de enfermería","MAI",0,0,{"$nulls":32},"Aten",670,0]
["0102005","Consulta por fonoaudiólogo","MAI",0,0,{"$nulls":32},"Cons",{"v":1660,"d":"1,660"},0]
["0102006","Atención kinesiológica integral ambulatoria","MAI",0,0,{"$nulls":32},"Aten",{"v":1340,"d":"1,340"},0]
["0102007","Atención integral por terapeuta ocupacional","MAI",0,0,{"$nulls":32},"Aten",{"v":1220,"d":"1,220"},0]
[null,"TOTAL ARANCEL MAI",null,{"$f":"SUM(D27:D32)","v":0},{"$f":"SUM(E27:E32)","v":0},{"$f":"SUM(F27:F32)","v":0},{"$f":"SUM(G27:G32)","v":0},{"$f":"SUM(H27:H32)","v":0},{"$nulls":19},{"$f":"SUM(AB27:AB32)","v":0},0,0,0,0,0,0,0,0,0,null,{"$f":"SUM(AM27:AM32)","v":{"v":8200,"d":"8,200"}},{"$f":"SUM(AN27:AN32)","v":0}]
[null,"Consulta por otros profesionales ",null,0,0,{"$nulls":32},"Cons"]
[null,"Consultas/ Controles de Especialidades Odontológica",null,0,0,{"$nulls":32},"Aten"]
[null,"Consultas de morbilidad odontológica",null,0,0,{"$nulls":32},"Cons"]
[null,"Consultas de urgencia odontológica",null,0,0,{"$nulls":32},"Cons"]
[null,"TOTAL ARANCEL MLE Y NO ARANCELADO",null,{"$f":"SUM(D34:D37)","v":0},{"$f":"SUM(E34:E37)","v":0},{"$f":"SUM(F34:F37)","v":0},{"$f":"SUM(G34:G37)","v":0},{"$f":"SUM(H34:H37)","v":0},{"$nulls":19},{"$f":"SUM(AB34:AB37)","v":0},0,0,0,0,0,0,0,0,0]
[null,"TOTAL PRODUCCION",null,{"$f":"SUM(D33+D38)","v":0},{"$f":"SUM(E33+E38)","v":0},{"$f":"SUM(F33+F38)","v":0},{"$f":"SUM(G33+G38)","v":0},{"$f":"SUM(H33+H38)","v":0},{"$nulls":19},{"$f":"SUM(AB33+AB38)","v":0},0,0,0,0,0,0,0,0,0,null,{"$f":"SUM(AM33+AM38)","v":{"v":8200,"d":"8,200"}},{"$f":"SUM(AN33+AN38)","v":0}]
[null,"EDUCACION DE GRUPO                                                                                         "]
["0103001","Educación de grupo por médico","MAI",0,0,{"$nulls":32},"Educ",{"v":4010,"d":"4,010"},{"$f":"AM41*F41","v":0}]
["0103002","Educación de grupo por enfermera, matrona o nutricionista","MAI",0,0,{"$nulls":32},"Educ",{"v":2200,"d":"2,200"},{"$f":"AM42*F42","v":0}]
["0103003","Educación de grupo por asistente social","MAI",0,0,{"$nulls":32},"Educ",{"v":2200,"d":"2,200"},{"$f":"AM43*F43","v":0}]
["0103004","Educación de grupo por auxiliar de enfermería","MAI",0,0,{"$nulls":32},"Educ",670,{"$f":"AM44*F44","v":0}]
[null,"TOTAL ARANCEL MAI",null,{"$f":"SUM(D41:D44)","v":0},{"$f":"SUM(E41:E44)","v":0},{"$f":"SUM(F41:F44)","v":0},{"$f":"SUM(G41:G44)","v":0},{"$f":"SUM(H41:H44)","v":0},{"$nulls":19},{"$f":"SUM(AB41:AB44)","v":0},0,0,0,0,0,0,0,0,0,null,{"$f":"SUM(AM41:AM44)","v":{"v":9080,"d":"9,080"}},{"$f":"SUM(AN41:AN44)","v":0}]
[null,"Educación de grupo por otro integrante del equipo de salud",null,0,0,{"$nulls":32},"Educ"]
[null,"TOTAL ARANCEL MLE Y NO ARANCELADO",null,{"$f":"D46","v":0},{"$f":"E46","v":0},{"$f":"F46","v":0},{"$f":"G46","v":0},{"$f":"H46","v":0},{"$nulls":19},{"$f":"AB46","v":0},0,0,0,0,0,0,0,0,0]
[null,"TOTAL PRODUCCION",null,{"$f":"SUM(D45+D47)","v":0},{"$f":"SUM(E45+E47)","v":0},{"$f":"SUM(F45+F47)","v":0},{"$f":"SUM(G45+G47)","v":0},{"$f":"SUM(H45+H47)","v":0},{"$nulls":19},{"$f":"SUM(AB45+AB47)","v":0},0,0,0,0,0,0,0,0,0,null,{"$f":"SUM(AM45+AM47)","v":{"v":9080,"d":"9,080"}},{"$f":"SUM(AN45+AN47)","v":0}]
[null,"VISITAS DOMICILIARIAS                                                                                       "]
["0104001","Visita a domicilio por enfermera, matrona o nutricionista","MAI",0,0,{"$nulls":32},"Vdom",{"v":1910,"d":"1,910"},{"$f":"AM50*F50","v":0}]
["0104002","Visita a domicilio por asistente social","MAI",0,0,{"$nulls":32},"Vdom",{"v":1910,"d":"1,910"},{"$f":"AM51*F51","v":0}]
["0104003","Visita a domicilio por auxiliar de enfermería","MAI",0,0,{"$nulls":32},"Vdom",{"v":1100,"d":"1,100"},{"$f":"AM52*F52","v":0}]
[null,"TOTAL ARANCEL MAI",null,{"$f":"SUM(D50:D52)","v":0},{"$f":"SUM(E50:E52)","v":0},{"$f":"SUM(F50:F52)","v":0},{"$f":"SUM(G50:G52)","v":0},{"$f":"SUM(H50:H52)","v":0},{"$nulls":19},{"$f":"SUM(AB50:AB52)","v":0},0,0,{"$f":"SUM(AE50:AE52)","v":0},0,0,0,0,0,0,null,{"$f":"SUM(AM50:AM52)","v":{"v":4920,"d":"4,920"}},{"$f":"SUM(AN50:AN52)","v":0}]
[null,"Visita a domicilio por otro integrante del equipo de salud",null,0,0,{"$nulls":32},"Vdom"]
[null," Visita domiciaria por otro profesional y técnicos paramédico",null,0,0,{"$nulls":32},"Vdom"]
[null,"TOTAL ARANCEL MLE Y NO ARANCELADO",null,{"$f":"SUM(D54:D55)","v":0},{"$f":"SUM(E54:E55)","v":0},{"$f":"SUM(F54:F55)","v":0},{"$f":"SUM(G54:G55)","v":0},{"$f":"SUM(H54:H55)","v":0},{"$nulls":19},{"$f":"SUM(AB54:AB55)","v":0},0,0,0,0,0,0,0,0,0]
[null,"TOTAL PRODUCCION",null,{"$f":"SUM(D53+D56)","v":0},{"$f":"SUM(E53+E56)","v":0},{"$f":"SUM(F53+F56)","v":0},{"$f":"SUM(G53+G56)","v":0},{"$f":"SUM(H53+H56)","v":0},{"$nulls":19},{"$f":"SUM(AB53+AB56)","v":0},0,0,0,0,0,0,0,0,0,null,{"$f":"SUM(AM53+AM56)","v":{"v":4920,"d":"4,920"}},{"$f":"SUM(AN53+AN56)","v":0}]
[null,"VACUNACION Y DESPARASITACION                                                                      "]
["0105001","Vacunaciones (sólo considera administración)","MAI",0,0,{"$nulls":32},"PNI",830,{"$f":"AM59*F59","v":0}]
["0105002","Desparasitación sarna (cada persona)","MAI",0,0,{"$nulls":32},"PNI",100,{"$f":"AM60*F60","v":0}]
["0105003","Desparasitación pediculosis (cada persona)","MAI",0,0,{"$nulls":32},"PNI",100,{"$f":"AM61*F61","v":0}]
[null,"TOTAL",null,{"$f":"SUM(D59:D61)","v":0},{"$f":"SUM(E59:E61)","v":0},{"$f":"SUM(F59:F61)","v":0},{"$f":"SUM(G59:G61)","v":0},{"$f":"SUM(H59:H61)","v":0},{"$nulls":19},{"$f":"SUM(AB59:AB61)","v":0},0,0,0,0,0,0,0,0,0,null,{"$f":"SUM(AM59:AM61)","v":{"v":1030,"d":"1,030"}},{"$f":"SUM(AN59:AN61)","v":0}]
[null,"MISCELANEOS                                                                                            "]
["0106002","Curación simple ambulatoria","MAI",0,0,{"$nulls":32},"Proc",730,{"$f":"AM64*F64","v":0}]
["0106005","Autocontrol pacientes Diabetico insulino dependiente (D.I.D. mensual)","MAI",0,0,{"$nulls":32},"Proc",{"v":16550,"d":"16,550"},{"$f":"AM65*F65","v":0}]
["0106006","Oxigenoterapia domiciliaria (pacientes oxígeno dependientes)","MAI",0,0,{"$nulls":32},"Proc",{"v":38010,"d":"38,010"},{"$f":"AM66*F66","v":0}]
["0106004","Despacho de recetas a crónicos","MAI",0,0,{"$nulls":32},"Proc",{"v":2200,"d":"2,200"},{"$f":"AM67*F67","v":0}]
["0106001","Abreu","MAI",0,0,{"$nulls":32},"Proc",{"v":1480,"d":"1,480"},{"$f":"AM68*F68","v":0}]
[null,"TOTAL ARANCEL MAI",null,{"$f":"SUM(D64:D68)","v":0},{"$f":"SUM(E64:E68)","v":0},{"$f":"SUM(F64:F68)","v":0},{"$f":"SUM(G64:G68)","v":0},{"$f":"SUM(H64:H68)","v":0},{"$nulls":19},{"$f":"SUM(AB64:AB68)","v":0},0,0,0,0,0,0,0,0,0,null,{"$f":"SUM(AM64:AM67)","v":{"v":57490,"d":"57,490"}},{"$f":"SUM(AN64:AN67)","v":0}]
[null,"Procedimientos de podología",null,0,0,{"$nulls":32},"Proc"]
[null,"TOTAL ARANCEL MLE Y NO ARANCELADO",null,{"$f":"D70","v":0},{"$f":"E70","v":0},{"$f":"F70","v":0},{"$f":"G70","v":0},{"$f":"H70","v":0},{"$nulls":19},{"$f":"AB70","v":0},0,0,0,0,0,0,0,0,0]
[null,"TOTAL PRODUCCION",null,{"$f":"SUM(D69+D71)","v":0},{"$f":"SUM(E69+E71)","v":0},{"$f":"SUM(F69+F71)","v":0},{"$f":"SUM(G69+G71)","v":0},{"$f":"SUM(H69+H71)","v":0},{"$nulls":19},{"$f":"SUM(AB69+AB71)","v":0},0,0,0,0,0,0,0,{"$f":"SUM(AJ69+AJ71)","v":0},{"$f":"SUM(AK69+AK71)","v":0},null,{"$f":"SUM(AM69+AM71)","v":{"v":57490,"d":"57,490"}},{"$f":"SUM(AN69+AN71)","v":0}]
[null,"OTRAS MISCELANEOS "]
[5099048,"Hemoglucotest instantáneo",null,{"$f":"SUM(E74+H74)","v":0},{"$f":"SUM(F74:G74)","v":0},{"$nulls":32},"Proc"]
[5099008,"Actividad Básica",null,0,0,{"$nulls":32},"Proc"]
[5099009,"Actividad Terapeutica",null,0,0,{"$nulls":32},"Proc"]
[5099010,"Evaluacion Actividad",null,0,0,{"$nulls":32},"Proc"]
[5099011,"Evaluacion  prevocacional",null,0,0,{"$nulls":32},"Proc"]
[5099063,"Evaluación cognitiva",null,0,0,{"$nulls":32},"Proc"]
[5099064,"Estimulación cognitiva",null,0,0,{"$nulls":32},"Proc"]
[5099111,"Curacion avanzada de herida",null,0,0,{"$nulls":32},"Proc"]
["0102701","Evaluación Motriz Funcional",null,0,0,{"$nulls":32},"Proc"]
["0102702","Evaluación cognitiva-perceptual",null,0,0,{"$nulls":32},"Proc"]
["0102703","Evaluación independencia en actividades de la vida diaria",null,0,0,{"$nulls":32},"Proc"]
["0102704","Evaluación barreras arquitectónicas",null,0,0,{"$nulls":32},"Proc"]
["0102705","Evaluación puesto de trabajo",null,0,0,{"$nulls":32},"Proc"]
["0102706","Evaluación del desarrollo Psicomotor",null,0,0,{"$nulls":32},"Proc"]
["0102707","Reentrenamiento de las funciones cognitiva-perceptual",null,0,0,{"$nulls":32},"Proc"]
["0102708","Reentrenamiento de las actividades de la vida diaria",null,0,0,{"$nulls":32},"Proc"]
["0102709","Reentrenamiento laboral",null,0,0,{"$nulls":32},"Proc"]
[null," Comité junta médica",null,0,0,{"$nulls":32},"Proc"]
[null," Consultorías médicas de especialidades",null,0,0,{"$nulls":32},"Proc"]
[null," Consultorías odontólogos",null,0,0,{"$nulls":32},"Proc"]
[null," Consejerias Individual por profesional de salud",null,0,0,{"$nulls":32},"Proc"]
[null," Consejerias Familiar por  profesionales de salud",null,0,0,{"$nulls":32},"Proc"]
[null,"Instalación de clips en lesiones sangrantes",null,0,0,{"$nulls":32},"Proc"]
[null," Instalación vendaje compresivo (Coban)",null,0,0,{"$nulls":32},"Proc"]
[null,"TOTAL",null,{"$f":"SUM(D74:D97)","v":0},{"$f":"SUM(E74:E97)","v":0},{"$f":"SUM(F74:F97)","v":0},{"$f":"SUM(G74:G97)","v":0},{"$f":"SUM(H74:H97)","v":0},{"$nulls":19},{"$f":"SUM(AB74:AB97)","v":0},0,0,0,0,0,0,0,0,0]
[null,"Trasplantes"]
[null," Estudio receptor donante cadáver ",null,0,{"$f":"SUM(F100:G100)","v":0},{"$nulls":32},"Act"]
[null," Estudio receptor donante vivo ",null,0,0,{"$nulls":32},"Act"]
[null," Estudio receptores corazón-pulmón ",null,0,0,{"$nulls":32},"Act"]
[null," Estudio pacientes trasplante medula ósea ",null,0,0,{"$nulls":32},"Act"]
[null," Trasplante de medula autólogo",null,0,0,{"$nulls":32},"Proc"]
[null," Trasplante de medula alógeno",null,0,0,{"$nulls":32},"Proc"]
[null," Trasplante medula de cordón",null,0,0,{"$nulls":32},"Proc"]
[null," Trasplante medula aploidentico",null,0,0,{"$nulls":32},"Proc"]
[null," Trasplante de córnea (incluye procuramiento y seguimiento por un año)",null,0,0,{"$nulls":32},"Cmay"]
[null," Soporte pretrasplante hepático extracorporeo por sesión ",null,0,0,{"$nulls":32},"Act"]
[null," Mantención donante cadáver (pulmón, corazón o hígado) (muerte cerebral) ",null,0,0,{"$nulls":32},"Act"]
[null,"TOTAL",null,{"$f":"SUM(D100:D110)","v":0},{"$f":"SUM(E100:E110)","v":0},{"$f":"SUM(F100:F110)","v":0},{"$f":"SUM(G100:G110)","v":0},{"$f":"SUM(H100:H110)","v":0},{"$nulls":19},{"$f":"SUM(AB100:AB110)","v":0},{"$f":"SUM(AC100:AC110)","v":0},0,0,0,0,0,0,0,0]
[null,"ATENCION CERRADA "]
["0203001","Día cama hospitalización integral medicina, cirugía, pediatría, obstetricia-ginecología y especialidades (sala 3 camas o más) (Hosp. Alta Complejidad)","MAI",0,{"$f":"SUM(F113:G113)","v":0},{"$nulls":32},"DsCa",{"v":36360,"d":"36,360"},{"$f":"AM113*F113","v":0}]
["0203102","Día cama hospitalización integral medicina, cirugía, pediatría, obstetricia-ginecología y especialidades (sala 3 camas o más) (Hosp. Mediana Complejidad)","MAI",0,{"$f":"SUM(F114:G114)","v":0},{"$nulls":32},"DsCa",{"v":33480,"d":"33,480"},0]
["0203103","Día cama hospitalización integral medicina, cirugía, pediatría, obstetricia-ginecología y especialidades (sala 3 camas o más) (Hosp. Baja Complejidad)","MAI",0,0,{"$nulls":32},"DsCa",{"v":27900,"d":"27,900"},0]
["0203002","Día cama hospitalización integral adulto en Unidad de Cuidado Intensivo (U.C.I.) ","MAI",0,0,{"$nulls":32},"DsCa",{"v":151180,"d":"151,180"},0]
["0203003","Día cama hospitalización integral pediátrica en Unidad de Cuidado Intensivo (U.C.I). ","MAI",0,0,{"$nulls":32},"DsCa",{"v":151180,"d":"151,180"},0]
["0203004","Día cama hospitalización integral neonatal en Unidad de Cuidado Intensivo (U.C.I.)","MAI",0,0,{"$nulls":32},"DsCa",{"v":151180,"d":"151,180"},0]
["0203005","Día cama hospitalización integral adulto en Unidad de Tratamiento Intermedio (U.T.I)","MAI",0,0,{"$nulls":32},"DsCa",{"v":73020,"d":"73,020"},0]
["0203006","Día cama hospitalización integral pediátrica en Unidad de Tratamiento Intermedio (U.T.I)","MAI",0,0,{"$nulls":32},"DsCa",{"v":73020,"d":"73,020"},0]
["0203007","Día cama hospitalización integral neonatal en Unidad de Tratamiento Intermedio (U.T.I)","MAI",0,0,{"$nulls":32},"DsCa",{"v":73020,"d":"73,020"},0]
["0203008","Día cama hospitalización integral incubadora","MAI",0,0,{"$nulls":32},"DsCa",{"v":65510,"d":"65,510"},0]
["0203009","Día cama hospitalización integral psiquiatría crónicos","MAI",0,0,{"$nulls":32},"DsCa",{"v":18590,"d":"18,590"},0]
["0203109","Día cama hosp. integral psiquiatría corta estadía","MAI",0,0,{"$nulls":32},"DsCa",{"v":29130,"d":"29,130"},0]
["0203209","Día cama hosp. integral desintoxicación alcohol y drogas","MAI",0,0,{"$nulls":32},"DsCa",{"v":30320,"d":"30,320"},0]
[null,"TOTAL",null,{"$f":"SUM(D113:D125)","v":0},{"$f":"SUM(E113:E125)","v":0},{"$f":"SUM(F113:F125)","v":0},{"$f":"SUM(G113:G125)","v":0},{"$f":"SUM(H113:H125)","v":0},{"$nulls":19},{"$f":"SUM(AB113:AB125)","v":0},{"$f":"SUM(AC113:AC125)","v":0},0,0,0,0,0,0,0,0,null,{"v":913890,"d":"913,890"},0]
[null,"MISCELANEOS  DIA CAMA                                                                                         "]
["0203010","Día cama integral psiquiátrico diurno","MAI",0,{"$f":"SUM(F128:G128)","v":0},{"$nulls":32},"DsCa",{"v":12220,"d":"12,220"},{"$f":"AM128*F128","v":0}]
["0203110","Día cama hospitalización integral psiquiatría mediana estadía","MAI",0,0,{"$nulls":32},"DsCa",{"v":29370,"d":"29,370"},0]
["0203011","Día cama integral de observación o día cama integral ambulatorio diurno","MAI",0,0,{"$nulls":32},"DsCa",{"v":12220,"d":"12,220"},0]
["0203111","Camilla de observación en servicio de urgencia","MAI",0,0,{"$nulls":32},"Cami",{"v":5390,"d":"5,390"},0]
["0203012","Día cama integral geriatría o crónicos","MAI",0,0,{"$nulls":32},"DsCa",{"v":36360,"d":"36,360"},0]
["0203013","Día estada en cámara hiperbárica","MAI",0,0,{"$nulls":32},"DsCa",{"v":98300,"d":"98,300"},0]
["0203014","Día cama hogar embarazada rural (del Servicio de Salud)","MAI",0,0,{"$nulls":32},"DsCa",{"v":11610,"d":"11,610"},0]
["0203015","Día cuna de hospitalización integral","MAI",0,0,{"$nulls":32},"DsCa",{"v":7060,"d":"7,060"},0]
["0203016","Día cama hospitalización integral urgencia H.U.A.P. (Sólo Hospital Urgencia Asistencia Pública)","MAI",0,0,{"$nulls":32},"DsCa",{"v":50960,"d":"50,960"},{"$f":"AM136*F136","v":0}]
["0203017","Día cama hogar protegido paciente psiquiátrico compensado","MAI",0,0,{"$nulls":32},"DsCa",{"v":8940,"d":"8,940"},{"$f":"AM137*F137","v":0}]
[null,"TOTAL ARANCEL MAI",null,{"$f":"SUM(D128:D137)","v":0},{"$f":"SUM(E128:E137)","v":0},{"$f":"SUM(F128:F137)","v":0},{"$f":"SUM(G128:G137)","v":0},{"$f":"SUM(H128:H137)","v":0},{"$nulls":19},{"$f":"SUM(AB128:AB137)","v":0},{"$f":"SUM(AC128:AC137)","v":0},0,0,0,0,0,0,0,0,null,{"v":272430,"d":"272,430"},0]
["0203211","Día Cama Residencia Protegida",null,{"$f":"SUM(E139+H139)","v":0},{"$f":"SUM(F139:G139)","v":0},{"$nulls":32},"DsCa"]
[null,"TOTAL ARANCEL MLE Y NO ARANCELADO",null,{"$f":"D139","v":0},{"$f":"E139","v":0},{"$f":"F139","v":0},{"$f":"G139","v":0},{"$f":"H139","v":0},{"$nulls":19},{"$f":"AB139","v":0},{"$f":"AC139","v":0},0,0,0,0,0,0,0,0]
[null,"TOTAL PRODUCCION",null,{"$f":"SUM(D138+D140)","v":0},{"$f":"SUM(E138+E140)","v":0},{"$f":"SUM(F138+F140)","v":0},{"$f":"SUM(G138+G140)","v":0},{"$f":"SUM(H138+H140)","v":0},{"$nulls":19},{"$f":"SUM(AB138+AB140)","v":0},{"$f":"SUM(AC138+AC140)","v":0},0,0,0,0,0,0,0,0,null,{"v":272430,"d":"272,430"},0]
["","EXAMENES DE LABORATORIO  "]
["","I.- SANGRE, HEMATOLOGIA"]
["0301001","Acidificación del suero, test de Ham","MAI"]
["0301002","Acido fólico o folatos","MAI",0,{"$f":"SUM(F145:G145)","v":0},{"$nulls":32},"ExLab",{"v":3860,"d":"3,860"},{"$f":"AM145*F145","v":0}]
["0301003","Adenograma, esplenograma, mielograma c/u","MAI",{"$f":"SUM(E146+H146)","v":0},{"$f":"SUM(F146:G146)","v":0},{"$nulls":32},"ExLab",{"v":4800,"d":"4,800"},0]
["0301004","Adhesividad plaquetaria","MAI"]
["0301005","Aglutininas anti Rho","MAI",0,0,{"$nulls":32},"ExLab",{"v":3440,"d":"3,440"},0]
["0301006","Agregación plaquetaria","MAI",0,0,{"$nulls":32},"ExLab",{"v":3440,"d":"3,440"},0]
["0301007","Anticoagulantes circulantes o anticoagulante lúpico","MAI",0,0,{"$nulls":32},"ExLab",{"v":3440,"d":"3,440"},0]
["0301008","Antitrombina III","MAI",0,0,{"$nulls":32},"ExLab",{"v":3440,"d":"3,440"},0]
["0301009","Auto-hemólisis test,  con y sin glucosa","MAI"]
["0301010","Células del lupus, cada muestra","MAI"]
["0301011","Coagulación, tiempo de","MAI",0,0,{"$nulls":32},"ExLab",{"v":1190,"d":"1,190"},0]
["0301012","Coágulo,  tiempo de retracción del","MAI"]
["0301013","Coágulo, tiempo de lisis del","MAI",0,0,{"$nulls":32},"ExLab",460,0]
["0301014","Coombs directo, test de","MAI",0,0,{"$nulls":32},"ExLab",940,0]
["0301015","Coombs indirecto, prueba de","MAI",0,0,{"$nulls":32},"ExLab",{"v":1720,"d":"1,720"},0]
["0301016","Cuerpos de Heinz","MAI"]
["0301017","Deshidrogenasa glucosa-6-fosfato en eritrocitos","MAI",0,0,{"$nulls":32},"ExLab",{"v":3610,"d":"3,610"},0]
["0301018","Deshidrogenasa 6-fosfogluconato en eritrocitos","MAI",0,0,{"$nulls":32},"ExLab",{"v":3610,"d":"3,610"},0]
["0301019","Drepanocitos, investigación de","MAI",0,0,{"$nulls":32},"ExLab",{"v":1720,"d":"1,720"},0]
["0301020","Euglobulinas, tiempo de lisis de","MAI",0,0,{"$nulls":32},"ExLab",{"v":1190,"d":"1,190"},0]
["0301021","Fibrinógeno","MAI",0,0,{"$nulls":32},"ExLab",{"v":1720,"d":"1,720"},0]
["0301022","Test de neutralización plaquetaria","MAI",0,0,{"$nulls":32},"ExLab",{"v":3440,"d":"3,440"},0]
["0301023","Factor III plaquetario","MAI"]
["0301024","Factor V","MAI",0,0,{"$nulls":32},"ExLab",{"v":1720,"d":"1,720"},0]
["0301025","Factores VII, VIII, IX, X, XI, XII, XIII, c/u","MAI",0,0,{"$nulls":32},"ExLab",{"v":3610,"d":"3,610"},0]
["0301026","Ferritina","MAI",0,0,{"$nulls":32},"ExLab",{"v":4390,"d":"4,390"},0]
["0301027","Fibrinógeno, productos de degradación del","MAI",0,0,{"$nulls":32},"ExLab",{"v":3610,"d":"3,610"},0]
["0301028","Fierro sérico","MAI",0,0,{"$nulls":32},"ExLab",{"v":1720,"d":"1,720"},0]
["0301029","Fierro, capacidad de fijación del (incluye fierro sérico)","MAI",0,0,{"$nulls":32},"ExLab",{"v":3610,"d":"3,610"},0]
["0301030","Fierro, cinética del (cada determinación)","MAI",0,0,{"$nulls":32},"ExLab",{"v":4390,"d":"4,390"},0]
["0301031","Fierro, prueba de sobrecarga","MAI",0,0,{"$nulls":32},"ExLab",{"v":3610,"d":"3,610"},0]
["0301032","Gelación por etanol","MAI"]
["0301033","Grupos menores. Tipificación o determinación de otros sistemas sanguíneos (Kell, Duffy, Kidd y otros) c/u.","MAI",0,0,{"$nulls":32},"ExLab",{"v":2120,"d":"2,120"},{"$f":"AM176*F176","v":0}]
["0301034","Grupos sanguíneos AB0 y Rho (incluye estudio de factor Du en Rh negativos)","MAI",0,0,{"$nulls":32},"ExLab",{"v":1950,"d":"1,950"},0]
["0301035","Haptoglobina cuantitativa","MAI",0,0,{"$nulls":32},"ExLab",{"v":3250,"d":"3,250"},0]
["0301036","Hematocrito (proc. aut.)","MAI",0,0,{"$nulls":32},"ExLab",540,0]
["0301037","Hemoglobina A2 cuantitativa","MAI",0,0,{"$nulls":32},"ExLab",{"v":3610,"d":"3,610"},0]
["0301038","Hemoglobina en sangre total (proc. aut.)","MAI",0,0,{"$nulls":32},"ExLab",540,0]
["0301039","Hemoglobina fetal cualitativa","MAI",0,0,{"$nulls":32},"ExLab",540,0]
["0301040","Hemoglobina fetal cuantitativa en eritrocitos","MAI",0,0,{"$nulls":32},"ExLab",{"v":3610,"d":"3,610"},0]
["0301041","Hemoglobina glicosilada","MAI",0,0,{"$nulls":32},"ExLab",{"v":3750,"d":"3,750"},0]
["0301042","Hemoglobina plasmática","MAI",0,0,{"$nulls":32},"ExLab",730,0]
["0301043","Hemoglobina termolabil","MAI"]
["0301044","Hemoglobina, electroforesis de (incluye Hb. total)","MAI",0,0,{"$nulls":32},"ExLab",{"v":3860,"d":"3,860"},0]
["0301045","Hemograma (incluye recuentos de leucocitos y eritrocitos, hemoglobina, hematocrito, fórmula leucocitaria, características de los elementos figurados y velocidad de eritrosedimentación)","MAI",0,0,{"$nulls":32},"ExLab",{"v":2470,"d":"2,470"},0]
["0301046","Hemolisinas","MAI"]
["0301047","Hemólisis con sucrosa, test de","MAI"]
["0301048","Hemosiderina medular","MAI",0,0,{"$nulls":32},"ExLab",730,0]
["0301049","Heparina, cuantificación de","MAI",0,0,{"$nulls":32},"ExLab",{"v":3610,"d":"3,610"},0]
["0301050","Isoinmunización, detección de anticuerpos irregulares (proc. aut.).","MAI",0,0,{"$nulls":32},"ExLab",{"v":2650,"d":"2,650"},0]
["0301051","Isoinmunización, detección e identificación de anticuerpos","MAI",0,0,{"$nulls":32},"ExLab",{"v":3610,"d":"3,610"},0]
["0301052","Isopropanol, test de","MAI"]
["0301053","Metahemalbúmina","MAI"]
["0301054","Metahemoglobina","MAI",0,0,{"$nulls":32},"ExLab",940,0]
["0301055","Muraminidasa en eritrocitos","MAI"]
["0301056","Piruvatoquinasa en eritrocitos","MAI"]
["0301057","Protamina sulfato, determinación de","MAI"]
["0301058","Protoporfirinas en eritrocitos","MAI"]
["0301059","Protrombina, tiempo de o consumo de (incluye INR, Relación Internacional Normalizada)","MAI",0,0,{"$nulls":32},"ExLab",{"v":1190,"d":"1,190"},0]
["0301062","Recuento de basófilos (absoluto)","MAI",0,0,{"$nulls":32},"ExLab",730,0]
["0301063","Recuento de eosinófilos (absoluto)","MAI",0,0,{"$nulls":32},"ExLab",730,0]
["0301064","Recuento de eritrocitos, absoluto (proc. aut.)","MAI",0,0,{"$nulls":32},"ExLab",540,0]
["0301065","Recuento de leucocitos, absoluto (proc. aut.)","MAI",0,0,{"$nulls":32},"ExLab",540,0]
["0301066","Recuento de linfocitos (absoluto)","MAI",0,0,{"$nulls":32},"ExLab",940,0]
["0301067","Recuento de plaquetas (absoluto)","MAI",0,0,{"$nulls":32},"ExLab",940,{"$f":"AM208*F208","v":0}]
["0301068","Recuento de reticulocitos (absoluto o porcentual)","MAI",0,0,{"$nulls":32},"ExLab",730,0]
["0301069","Recuento diferencial o fórmula leucocitaria (proc. aut.)","MAI",{"$f":"SUM(E210+H210)","v":0},{"$f":"SUM(F210:G210)","v":0},{"$nulls":32},"ExLab",{"v":1470,"d":"1,470"},0]
["0301070","Resistencia globular osmótica","MAI",0,0,{"$nulls":32},"ExLab",{"v":2420,"d":"2,420"},0]
["0301071","Sacarosa, prueba de la","MAI"]
["0301072","Sangría, tiempo de (Ivy) (no incluye dispositivo asociado )","MAI",0,0,{"$nulls":32},"ExLab",{"v":1190,"d":"1,190"},0]
["0301074","Sobrevida del eritrocito (Cr 51 o similar)","MAI"]
["0301075","Subgrupo ABO y Rh fenotipo - genotipo Rh, c/u","MAI",0,0,{"$nulls":32},"ExLab",{"v":2120,"d":"2,120"},0]
["0301076","Thorn, prueba de (no incluye ACTH)","MAI"]
["0301077","Tinción de estearasa","MAI"]
["0301078","Tinción de fosfatasas alcalinas o ácidas","MAI"]
["0301079","Tinción de glicógeno o PAS","MAI"]
["0301080","Tinción de lípidos","MAI"]
["0301081","Tinción de peroxidasas","MAI"]
["0301082","Transferrina","MAI",0,0,{"$nulls":32},"ExLab",{"v":4270,"d":"4,270"},0]
["0301083","Trombina, tiempo de","MAI",0,0,{"$nulls":32},"ExLab",{"v":1470,"d":"1,470"},0]
["0301084","Tromboplastina, tiempo de generación de (TGT)","MAI",0,0,{"$nulls":32},"ExLab",{"v":4800,"d":"4,800"},0]
["0301085","Tromboplastina, tiempo parcial de (TTPA, TTPK o similares)","MAI",0,0,{"$nulls":32},"ExLab",{"v":1880,"d":"1,880"},0]
["0301086","Velocidad de eritrosedimentación (proc. aut.)","MAI",0,0,{"$nulls":32},"ExLab",450,0]
["0301087","Vitamina B12, absorción de (Co 57 o similar)","MAI"]
["0301088","Volemia (incluye volumen globular total, volumen plasmático total y volumen sanguíneo total)","MAI"]
["0301089","Von Willebrand, Ag de (factor VIII Ag.)","MAI",0,0,{"$nulls":32},"ExLab",{"v":6920,"d":"6,920"},0]
["0301090","Cofactor de Ristocetina","MAI",0,0,{"$nulls":32},"ExLab",{"v":6920,"d":"6,920"},0]
["0301091","Proteína C","MAI",0,0,{"$nulls":32},"ExLab",{"v":23740,"d":"23,740"},0]
["0301092","Proteína S","MAI",0,0,{"$nulls":32},"ExLab",{"v":25860,"d":"25,860"},0]
["0301093","Resistencia Proteína C","MAI",0,0,{"$nulls":32},"ExLab",{"v":16960,"d":"16,960"},0]
["0301094","Estudio de la hemoglobinuria paroxística nocturna (HPN) por citometría de flujo","MAI",0,0,{"$nulls":32},"ExLab",{"v":36610,"d":"36,610"},0]
["0301095","Dímero-D","MAI",0,0,{"$nulls":32},"ExLab",{"v":8040,"d":"8,040"},0]
[null,"TOTAL",null,{"$f":"SUM(D144:D235)","v":0},{"$f":"SUM(E144:E235)","v":0},{"$f":"SUM(F144:F235)","v":0},{"$f":"SUM(G144:G235)","v":0},{"$f":"SUM(H144:H235)","v":0},{"$nulls":19},{"$f":"SUM(AB144:AB235)","v":0},0,0,{"$f":"SUM(AE144:AE235)","v":0},0,0,0,0,0,0,null,{"v":258650,"d":"258,650"},0]
[null,"II.- SANGRE, EXAMENES BIOQUIMICOS  "]
["0302001","Acetona cualitativa","MAI",0,0,{"$nulls":32},"ExLab",660,{"$f":"AM238*F238","v":0}]
["0302002","Acido cítrico","MAI",0,0,{"$nulls":32},"ExLab",{"v":1870,"d":"1,870"},0]
["0302004","Acido láctico","MAI",0,0,{"$nulls":32},"ExLab",{"v":3070,"d":"3,070"},0]
["0302005","Acido úrico","MAI",0,0,{"$nulls":32},"ExLab",{"v":1300,"d":"1,300"},0]
["0302007","Aldolasa","MAI"]
["0302008","Amilasa","MAI",0,0,{"$nulls":32},"ExLab",{"v":1910,"d":"1,910"},0]
["0302009","Aminoácidos, cualitativo","MAI",0,0,{"$nulls":32},"ExLab",{"v":4530,"d":"4,530"},0]
["0302010","Amonio","MAI",0,0,{"$nulls":32},"ExLab",{"v":1720,"d":"1,720"},0]
["0302070","Apolipoproteínas (A1, B u otras)","MAI",0,0,{"$nulls":32},"ExLab",{"v":5280,"d":"5,280"},0]
["0302011","Bicarbonato (proc. aut.)","MAI",0,0,{"$nulls":32},"ExLab",540,0]
["0302012","Bilirrubina total (proc. aut.)","MAI",0,0,{"$nulls":32},"ExLab",{"v":1070,"d":"1,070"},0]
["0302013","Bilirrubina total y conjugada","MAI",0,0,{"$nulls":32},"ExLab",{"v":1190,"d":"1,190"},0]
["0302014","Bromosulftaleína, prueba de (incluye medicamento y tomas de muestra)","MAI"]
["0302015","Calcio","MAI",0,0,{"$nulls":32},"ExLab",940,0]
["0302016","Calcio iónico, incluye proteínas totales","MAI"]
["0302017","Caroteno","MAI",0,0,{"$nulls":32},"ExLab",{"v":1720,"d":"1,720"},0]
["0302018","Caroteno, prueba de sobrecarga de (incluye tomas de muestra)","MAI",0,0,{"$nulls":32},"ExLab",{"v":3860,"d":"3,860"},0]
["0302019","Ceruloplasmina","MAI",0,0,{"$nulls":32},"ExLab",{"v":2640,"d":"2,640"},0]
["0302020","Cobre","MAI",0,0,{"$nulls":32},"ExLab",{"v":1260,"d":"1,260"},0]
["0302067","Colesterol total (proc. aut.)","MAI",0,0,{"$nulls":32},"ExLab",{"v":1120,"d":"1,120"},0]
["0302068","Colesterol HDL (proc. aut.)","MAI",0,0,{"$nulls":32},"ExLab",{"v":1660,"d":"1,660"},0]
["0302021","Colinesterasa en plasma o sangre total","MAI",0,0,{"$nulls":32},"ExLab",{"v":2410,"d":"2,410"},0]
["0302022","Creatina","MAI"]
["0302023","Creatinina","MAI",0,0,{"$nulls":32},"ExLab",{"v":1090,"d":"1,090"},0]
["0302024","Creatinina, depuración de (Clearence) (proc. aut.)","MAI",0,0,{"$nulls":32},"ExLab",{"v":2410,"d":"2,410"},0]
["0302025","Creatinquinasa CK - MB  miocárdica","MAI",0,0,{"$nulls":32},"ExLab",{"v":3860,"d":"3,860"},0]
["0302026","Creatinquinasa CK - total","MAI",0,0,{"$nulls":32},"ExLab",{"v":2950,"d":"2,950"},0]
["0302027","Troponina                         ","MAI",0,0,{"$nulls":32},"ExLab",{"v":8040,"d":"8,040"},0]
["0302028","Depuraciones (Clearance) exógenas de Hipurán, Rojo Congo, manitol e inulina, c/u (no incluye medicamento)","MAI"]
["0302029","Deshidrogenasa hidroxibutírica (HBDH)","MAI"]
["0302030","Deshidrogenasa láctica total (LDH)","MAI",0,0,{"$nulls":32},"ExLab",{"v":1760,"d":"1,760"},0]
["0302031","Deshidrogenasa láctica total (LDH), con separación de isoenzimas","MAI",0,0,{"$nulls":32},"ExLab",{"v":4800,"d":"4,800"},{"$f":"AM269*F269","v":0}]
["0302032","Electrolitos plasmáticos (sodio, potasio, cloro) c/u","MAI",0,0,{"$nulls":32},"ExLab",{"v":1010,"d":"1,010"},0]
["0302033","Enzima convertidora de angiotensina I","MAI",0,0,{"$nulls":32},"ExLab",{"v":4800,"d":"4,800"},0]
["0302034","Perfil Lipídico (incluye: colesterol total, HDL, LDL, VLDL y triglicéridos) ","MAI",0,0,{"$nulls":32},"ExLab",{"v":5110,"d":"5,110"},0]
["0302035","Fármacos y/o drogas; niveles plasmáticos de (alcohol, anorexígenos, antiarrítmicos, antibióticos, antidepresivos, antiepilépticos, antihistamínicos, antiinflamatorios y analgésicos, estimulantes respiratorios, tranquilizantes mayores y menores, etc.) c/u","MAI",0,0,{"$nulls":32},"ExLab",{"v":4590,"d":"4,590"},0]
["0302036","Fenilalanina","MAI",{"$f":"SUM(E274+H274)","v":0},{"$f":"SUM(F274:G274)","v":0},{"$nulls":32},"ExLab",{"v":1720,"d":"1,720"},0]
["0302037","Fosfatasas ácidas totales","MAI"]
["0302038","Fosfatasas ácidas totales y fracción prostática","MAI"]
["0302039","Fosfatasas alcalinas con separación de isoenzimas hepáticas, intestinales, óseas c/u","MAI",0,0,{"$nulls":32},"ExLab",{"v":4670,"d":"4,670"},0]
["0302040","Fosfatasas alcalinas totales","MAI",0,0,{"$nulls":32},"ExLab",{"v":1100,"d":"1,100"},0]
["0302041","Fosfolípidos","MAI"]
["0302042","Fósforo (fosfatos)","MAI",0,0,{"$nulls":32},"ExLab",{"v":1420,"d":"1,420"},0]
["0302043","Galactosa","MAI",0,0,{"$nulls":32},"ExLab",540,0]
["0302044","Galactosa, curva de tolerancia, (mínimo cuatro determinaciones) (no incluye la galactosa que se administra) (incluye los valores de todas las tomas de muestras necesarias)","MAI"]
["0302045","Gamma glutamiltranspeptidasa (GGT)","MAI",0,0,{"$nulls":32},"ExLab",{"v":1820,"d":"1,820"},0]
["0302046","Gases y equilibrio ácido base en sangre (incluye: pH, O2, CO2, exceso de base y bicarbonato), todos o cada uno de los parámetros","MAI",0,0,{"$nulls":32},"ExLab",{"v":3050,"d":"3,050"},0]
["0302047","Glucosa","MAI",0,0,{"$nulls":32},"ExLab",{"v":1090,"d":"1,090"},0]
["0302048","Glucosa, Prueba de Tolerancia a la Glucosa Oral (PTGO), (dos determinaciones) (no incluye la glucosa que se administra) (incluye el valor de las dos tomas de muestras)","MAI",0,0,{"$nulls":32},"ExLab",{"v":4900,"d":"4,900"},0]
["0302050","Adenosindeaminasa en sangre u otro fluído biológico.","MAI",0,0,{"$nulls":32},"ExLab",{"v":3610,"d":"3,610"},0]
["0302051","Lactosa, curva de tolerancia, (mínimo cuatro determinaciones) (no incluye la lactosa que se administra) (incluye los valores de todas las tomas de muestras necesarias)","MAI"]
["0302052","Leucinaminopeptidasa (LAP)","MAI",0,0,{"$nulls":32},"ExLab",{"v":1720,"d":"1,720"},0]
["0302053","Lipasa","MAI",0,0,{"$nulls":32},"ExLab",{"v":1870,"d":"1,870"},0]
["0302069","Lípidos totales (proc. aut.)","MAI"]
["0302054","Lipoproteínas, electroforesis de (incluye lípidos totales)","MAI"]
["0302055","Litio","MAI",0,0,{"$nulls":32},"ExLab",{"v":2410,"d":"2,410"},0]
["0302056","Magnesio","MAI",0,0,{"$nulls":32},"ExLab",{"v":2410,"d":"2,410"},0]
["0302057","Nitrógeno ureico y/o úrea","MAI",0,0,{"$nulls":32},"ExLab",{"v":1090,"d":"1,090"},0]
["0302058","Osmolalidad en sangre","MAI",0,0,{"$nulls":32},"ExLab",{"v":1380,"d":"1,380"},0]
["0302075","Perfil bioquímico (determinación automatizada de 12 parámetros)","MAI",0,0,{"$nulls":32},"ExLab",{"v":6920,"d":"6,920"},0]
["0302059","Proteínas fraccionadas albúmina/globulina (incluye código 03-02-060)","MAI"]
["0302060","Proteínas totales o albúminas, c/u","MAI",0,0,{"$nulls":32},"ExLab",{"v":1180,"d":"1,180"},0]
["0302061","Proteínas, electroforesis (incluye cód. 03-02-060)","MAI",0,0,{"$nulls":32},"ExLab",{"v":5020,"d":"5,020"},0]
["0302076","Perfil Hepático (incluye tiempo de protrombina, bilirrubina total y conjugada, fosfatasas alcalinas totales, GGT, transaminasas GOT/AST y GPT/ALT)","MAI",0,0,{"$nulls":32},"ExLab",{"v":8690,"d":"8,690"},{"$f":"AM301*F301","v":0}]
["0302063","Transaminasas, oxalacética (GOT/AST), Pirúvica (GPT/ALT), c/u","MAI",0,0,{"$nulls":32},"ExLab",{"v":1570,"d":"1,570"},0]
["0302064","Triglicéridos (proc. aut.)","MAI",0,0,{"$nulls":32},"ExLab",{"v":1430,"d":"1,430"},0]
["0302065","Vitaminas A, B, C, D, E, etc., c/u","MAI",0,0,{"$nulls":32},"ExLab",{"v":1430,"d":"1,430"},0]
["0302066","Xilosa, prueba de absorción (no incluye la xilosa que se administra)","MAI",0,0,{"$nulls":32},"ExLab",{"v":2550,"d":"2,550"},0]
["0302077","Vitamina B12 por inmunoensayo",null,0,0,{"$nulls":33},{"v":5840,"d":"5,840"},0]
["0302078","25 OH Vitamina D Total por inmunoensayo","MAI",0,0,{"$nulls":32},"ExLab",{"v":11630,"d":"11,630"},0]
["0302079","25 OH Vitamina D Total por espectrometría de masa","MAI",0,0,{"$nulls":32},"ExLab",{"v":11630,"d":"11,630"},0]
["0302080","Vitamina B6 por HPLC","MAI",0,0,{"$nulls":32},"ExLab",{"v":36770,"d":"36,770"},0]
["0302081","Calcio iónico (incluye medición de pH método ión selectivo)","MAI",0,0,{"$nulls":32},"ExLab",{"v":1670,"d":"1,670"},0]
["0302082","Fenilalanina cuantitativa en GSS","MAI",0,0,{"$nulls":32},"ExLab",{"v":6560,"d":"6,560"},0]
[null,"TOTAL",null,{"$f":"SUM(D238:D311)","v":0},{"$f":"SUM(E238:E311)","v":0},{"$f":"SUM(F238:F311)","v":0},{"$f":"SUM(G238:G311)","v":0},{"$f":"SUM(H238:H311)","v":0},{"$nulls":19},{"$f":"SUM(AB238:AB311)","v":0},0,0,{"$f":"SUM(AE238:AE311)","v":0},0,0,0,0,0,0,null,{"$f":"SUM(AM238:AM311)","v":{"v":216860,"d":"216,860"}},{"$f":"SUM(AN238:AN311)","v":0}]
[null,"III.- HORMONAS  "]
["0303001","Adenocorticotrofina (ACTH)","MAI",0,0,{"$nulls":32},"ExLab",{"v":6660,"d":"6,660"},{"$f":"AM314*F314","v":0}]
["0303002","Aldosterona","MAI",0,0,{"$nulls":32},"ExLab",{"v":5720,"d":"5,720"},0]
["0303003","Androstenediona","MAI",0,0,{"$nulls":32},"ExLab",{"v":4300,"d":"4,300"},0]
["0303004","Angiotensina","MAI",{"$f":"SUM(E317+H317)","v":0},0,{"$nulls":32},"ExLab",{"v":5210,"d":"5,210"},0]
["0303005","Catecolaminas","MAI"]
["0303006","Cortisol","MAI",0,0,{"$nulls":32},"ExLab",{"v":4300,"d":"4,300"},0]
["0303007","Crecimiento, hormona de (HGH) (somatotrofina)","MAI",0,0,{"$nulls":32},"ExLab",{"v":5720,"d":"5,720"},0]
["0303008","Dehidroepiandrosterona sulfato (DHA, DHEA)","MAI",0,0,{"$nulls":32},"ExLab",{"v":5720,"d":"5,720"},0]
["0303009","Eritropoyetina","MAI",0,0,{"$nulls":32},"ExLab",{"v":4060,"d":"4,060"},0]
["0303010","Estriol","MAI"]
["0303011","Estrona","MAI"]
["0303012","Gastrina","MAI",0,0,{"$nulls":32},"ExLab",{"v":5720,"d":"5,720"},0]
["0303013","Glucagón","MAI"]
["0303014","Gonadotrofina coriónica, sub-unidad beta (incluye titulación si corresponde) (Elisa, RIA o IRMA, Quimioluminiscencia u otra técnica).","MAI",0,0,{"$nulls":32},"ExLab",{"v":4260,"d":"4,260"},0]
["0303015","Hormona folículo estimulante (FSH)","MAI",0,0,{"$nulls":32},"ExLab",{"v":4260,"d":"4,260"},0]
["0303016","Hormona luteinizante (LH)","MAI",0,0,{"$nulls":32},"ExLab",{"v":4260,"d":"4,260"},0]
["0303047","IGF1 o Somatomedina - C (Insuline Like Growth Factor)","MAI",0,0,{"$nulls":32},"ExLab",{"v":9940,"d":"9,940"},0]
["0303048","IGFBP3, IGFBP1 (Insulin Like Growth Factor Binding Proteins)  c/u","MAI",0,0,{"$nulls":32},"ExLab",{"v":9940,"d":"9,940"},0]
["0303017","Insulina","MAI",0,0,{"$nulls":32},"ExLab",{"v":4260,"d":"4,260"},0]
["0303031","Insulina, curva de (mínimo dos determinaciones e incluye todas las tomas de muestras necesarias.  No incluye la glucosa que se administra)","MAI",0,0,{"$nulls":32},"ExLab",{"v":11480,"d":"11,480"},0]
["0303018","Parathormona, hormona Paratiroídea o PTH.","MAI",0,0,{"$nulls":32},"ExLab",{"v":6510,"d":"6,510"},0]
["0303019","Progesterona","MAI",0,0,{"$nulls":32},"ExLab",{"v":4260,"d":"4,260"},0]
["0303020","Prolactina (PRL)","MAI",0,0,{"$nulls":32},"ExLab",{"v":4260,"d":"4,260"},0]
["0303021","Renina","MAI",0,0,{"$nulls":32},"ExLab",{"v":5720,"d":"5,720"},0]
["0303046","SHGB (Sex-Hormone Binding Globulin)","MAI",0,0,{"$nulls":32},"ExLab",{"v":9940,"d":"9,940"},0]
["0303022","Testosterona","MAI",{"$f":"SUM(E339+H339)","v":0},{"$f":"SUM(F339:G339)","v":0},{"$nulls":32},"ExLab",{"v":4300,"d":"4,300"},0]
["0303023","Testosterona libre","MAI",0,0,{"$nulls":32},"ExLab",{"v":5210,"d":"5,210"},0]
["0303123","Índice androgénico (incluye Testosterona Total y SHBG)",null,{"$f":"SUM(E341+H341)","v":0},{"$f":"SUM(F341:G341)","v":0},{"$nulls":32},"ExLab",{"v":10600,"d":"10,600"},0]
["0303024","Tiroestimulante (TSH), hormona (adulto, niño o R.N.)                            ","MAI",0,0,{"$nulls":32},"ExLab",{"v":3730,"d":"3,730"},0]
["0303025","Tiroglobulina                                                                                   ","MAI",0,0,{"$nulls":32},"ExLab",{"v":5720,"d":"5,720"},0]
["0303026","Tiroxina libre (T4L)                                                                       ","MAI",0,0,{"$nulls":32},"ExLab",{"v":4260,"d":"4,260"},0]
["0303027","Tiroxina o tetrayodotironina (T4)                                               ","MAI",0,0,{"$nulls":32},"ExLab",{"v":3730,"d":"3,730"},0]
["0303028","Triyodotironina (T3)                                                               ","MAI",0,0,{"$nulls":32},"ExLab",{"v":3730,"d":"3,730"},0]
["0303029","17 – Hidroxiprogesterona","MAI",0,0,{"$nulls":32},"ExLab",{"v":5720,"d":"5,720"},0]
["0303030","Estradiol (17-Beta)","MAI",0,0,{"$nulls":32},"ExLab",{"v":4260,"d":"4,260"},0]
["0303032","Ac. Vainillilmandélico, cuantitativo","MAI"]
["0303033","Angiotensina","MAI",0,0,{"$nulls":32},"ExLab",{"v":5210,"d":"5,210"},0]
["0303034","Catecolaminas","MAI"]
["0303035","Cortisol libre urinario","MAI",0,0,{"$nulls":32},"ExLab",{"v":4690,"d":"4,690"},0]
["0303036","Estriol","MAI"]
["0303039","Gonadotrofina coriónica, sub-unidada Beta; titulación por (Elisa; RIA o IRMA; Quimioluminiscencia u otra técnica)","MAI",0,0,{"$nulls":32},"ExLab",{"v":4300,"d":"4,300"},0]
["0303040","Pregnandiol","MAI"]
["0303041","Pregnantriol","MAI"]
["0303042","Tetrahidrodesoxicortisol","MAI"]
["0303043","17 – Cetoesteroides","MAI"]
["0303044","17 – Hidroxicorticoesteroides","MAI"]
["0303049","Catecolaminas en sangre (incluye medición de Adrenalina, Noradrenalina y Dopamina por separado por métodos cromatográficos)","MAI",0,0,{"$nulls":32},"ExLab",{"v":25150,"d":"25,150"},0]
["0303050","Metanefrinas urinarias (incluye determinación de Metanefrina y Normetanefrina por separado por métodos cromatográficos)","MAI",0,0,{"$nulls":32},"ExLab",{"v":28440,"d":"28,440"},0]
["0303051","Catecolaminas urinarias (incluye medición de Adrenalina, Noradrenalina y Dopamina por separado por métodos cromatográficos)","MAI",0,0,{"$nulls":32},"ExLab",{"v":25150,"d":"25,150"},0]
[null,"TOTAL",null,{"$f":"SUM(D314:D362)","v":0},{"$f":"SUM(E314:E362)","v":0},{"$f":"SUM(F314:F362)","v":0},{"$f":"SUM(G314:G362)","v":0},{"$f":"SUM(H314:H362)","v":0},{"$nulls":19},{"$f":"SUM(AB314:AB362)","v":0},0,0,{"$f":"SUM(AE314:AE362)","v":0},0,0,0,0,0,0,null,{"v":270700,"d":"270,700"},0]
[null,"IV.- GENETICA  "]
["0304001","Cariograma en sangre por cultivo de linfocitos (incluye mínimo 25 mitosis con bandeo G y eventualmente Q, R, C, NOR) (montaje de 3 metafases bandeadas)","MAI",0,0,{"$nulls":32},"ExLab",{"v":37610,"d":"37,610"},{"$f":"AM365*F365","v":0}]
["0304002","Cariograma con técnicas especiales (incluye muestra de sangre o de médula ósea, tratamiento con FUDR, bromuro de etidio, medio deficiente en ácido fólico)","MAI",0,0,{"$nulls":32},"ExLab",{"v":40210,"d":"40,210"},0]
["0304003","Cariograma en fibroblastos por cultivo de trofoblasto, líquido amniótico, piel u otros bandeos G y eventualmente Q, R, C, NOR","MAI",0,0,{"$nulls":32},"ExLab",{"v":40210,"d":"40,210"},0]
["0304004","Cromatina sexual X e Y, corpúsculo de Barr y corpúsculo fluorescente de mucosa bucal, líquido amniótico, etc. c/u (análisis en 300 y 100 células respectivamente), c/u","MAI"]
["0304005","Dermatoglifos, toma de impresión palmar, análisis cualitativo y cuantitativo con diversas mediciones","MAI",0,0,{"$nulls":32},"ExLab",{"v":6480,"d":"6,480"},0]
["0304006","Fish en metafases. Búsqueda de una alteración constitucional con 1 sonda","MAI",0,0,{"$nulls":32},"ExLab",{"v":53420,"d":"53,420"},0]
[null,"TOTAL",null,{"$f":"SUM(D365:D370)","v":0},{"$f":"SUM(E365:E370)","v":0},{"$f":"SUM(F365:F370)","v":0},{"$f":"SUM(G365:G370)","v":0},{"$f":"SUM(H365:H370)","v":0},{"$nulls":19},{"$f":"SUM(AB365:AB370)","v":0},0,0,{"$f":"SUM(AE365:AE370)","v":0},0,0,0,0,0,0,0,{"v":177930,"d":"177,930"},0]
[null,"V.- INMUNOLOGIA                            "]
["0305001","Alfa -1- antitripsina cuantitativa","MAI",0,0,{"$nulls":32},"ExLab",{"v":4300,"d":"4,300"},{"$f":"AM373*F373","v":0}]
["0305002","Alfa -2- macroglobulina","MAI",0,0,{"$nulls":32},"ExLab",{"v":4170,"d":"4,170"},0]
["0305003","Alfa fetoproteínas","MAI",0,0,{"$nulls":32},"ExLab",{"v":4260,"d":"4,260"},0]
["0305004","Tamizaje de Anticuerpos anti antígenos nucleares extractables (a- ENA: Sm, RNP, Ro, La, Scl- 70 y Jo- 1)","MAI",0,0,{"$nulls":32},"ExLab",{"v":8530,"d":"8,530"},0]
["0305005","Anticuerpos antinucleares (ANA), antimitocondriales, anti DNA (ADNA), anti músculo liso, anticentrómero, u otros, c/u.","MAI",0,0,{"$nulls":32},"ExLab",{"v":5850,"d":"5,850"},0]
["0305006","Anticuerpos atípicos, pannel de identificación","MAI"]
["0305007","Anticuerpos específicos y otros autoanticuerpos (anticuerpos antitiroídeos: anticuerpos antimicrosomales y antitiroglobulinas y otros anticuerpos: prostático, espermios, etc.) c/u","MAI",0,0,{"$nulls":32},"ExLab",{"v":4720,"d":"4,720"},0]
["0305008","Antiestreptolisina O, por técnica de látex ","MAI",0,0,{"$nulls":32},"ExLab",{"v":3750,"d":"3,750"},0]
["0305009","Antígeno carcinoembrionario (CEA)","MAI",0,0,{"$nulls":32},"ExLab",{"v":5730,"d":"5,730"},0]
["0305070","Antígeno prostático específico","MAI",0,0,{"$nulls":32},"ExLab",{"v":7590,"d":"7,590"},0]
["0305170","Antígeno Ca 125, Ca 15-3 y Ca 19-9, c/u","MAI",0,0,{"$nulls":32},"ExLab",{"v":7590,"d":"7,590"},0]
["0305010","Beta-2-microglobulina","MAI",0,0,{"$nulls":32},"ExLab",{"v":5730,"d":"5,730"},0]
["0305011","Complejos inmunes circulantes","MAI"]
["0305012","Complemento C1Q, C2, C3, C4, etc., c/u","MAI",0,0,{"$nulls":32},"ExLab",{"v":3750,"d":"3,750"},0]
["0305013","Complemento hemolítico (CH 50)","MAI",0,0,{"$nulls":32},"ExLab",{"v":4720,"d":"4,720"},0]
["0305014","Crioglobulinas, precipitación en frío (cualitativa) o cuantitativa c/u","MAI",0,0,{"$nulls":32},"ExLab",910,0]
["0305015","Depósito de complejos inmunes por inmunofluorescencia","MAI",0,0,{"$nulls":32},"ExLab",{"v":2170,"d":"2,170"},0]
["0305016","Depósito de complemento por inmunofluorescencia (C3, C4), c/u","MAI"]
["0305017","Depósito de fibrinógeno por inmunofluorescencia","MAI"]
["0305018","Depósito de inmunoglobulina por inmunofluorescencia (IgG, IgA, IgM) c/u","MAI"]
["0305019","Factor reumatoídeo por técnica de látex u otras similares","MAI",0,0,{"$nulls":32},"ExLab",{"v":2170,"d":"2,170"},0]
["0305020","Factor reumatoídeo por técnica Scat, Waaler Rose, nefelométricas y/o turbidimétricas","MAI",0,0,{"$nulls":32},"ExLab",{"v":3870,"d":"3,870"},0]
["0305021","Inhibidor de C1Q, C2 y C3, c/u","MAI",0,0,{"$nulls":32},"ExLab",{"v":3750,"d":"3,750"},0]
["0305022","Inmunoelectroforesis de cadenas livianas Kappa o Lambda libres (Bence Jones) o unidas, c/u","MAI",0,0,{"$nulls":32},"ExLab",{"v":4300,"d":"4,300"},0]
["0305023","Inmunoelectroforesis de inmunoglobulinas cadenas pesadas (IgG, IgA, IgM) c/u","MAI",0,0,{"$nulls":32},"ExLab",{"v":3750,"d":"3,750"},0]
["0305024","Inmunoelectroforesis de inmunoglobulinas IgD e IgE c/u","MAI",0,0,{"$nulls":32},"ExLab",{"v":4170,"d":"4,170"},0]
["0305025","Inmunofijación de inmunoglobulina, c/u","MAI",0,0,{"$nulls":32},"ExLab",{"v":6510,"d":"6,510"},0]
["0305026","Inmunoglobulina IgA secretora","MAI",0,0,{"$nulls":32},"ExLab",{"v":3670,"d":"3,670"},0]
["0305027","Inmunoglobulinas IgA, IgG, IgM, c/u","MAI",0,0,{"$nulls":32},"ExLab",{"v":3750,"d":"3,750"},0]
["0305028","Inmunoglobulinas IgE, IgD total, c/u","MAI",0,0,{"$nulls":32},"ExLab",{"v":4300,"d":"4,300"},0]
["0305029","Inmunoglobulinas IgE, IgG específicas, c/u","MAI",0,0,{"$nulls":32},"ExLab",{"v":4300,"d":"4,300"},0]
["0305030","Proteína C reactiva por técnica de látex u otras similares","MAI",0,0,{"$nulls":32},"ExLab",{"v":3630,"d":"3,630"},0]
["0305031","Proteína C reactiva por técnicas nefelométricas y/o turbidimétricas","MAI",0,0,{"$nulls":32},"ExLab",{"v":5010,"d":"5,010"},{"$f":"AM405*F405","v":0}]
["0305032","Proteínas Bence Jones por electroforesis (incluye proteinuria)","MAI",{"$f":"SUM(E406+H406)","v":0},{"$f":"SUM(F406:G406)","v":0},{"$nulls":32},"ExLab",{"v":4930,"d":"4,930"},0]
["0305034","Quimiotaxis-leucotaxis","MAI",0,0,{"$nulls":32},"ExLab",{"v":5650,"d":"5,650"},0]
["0305181","Estudio de anticuerpo antitransglutaminasa (TTG)                                             ","MAI",0,0,{"$nulls":32},"ExLab",{"v":9290,"d":"9,290"},0]
["0305182","Reacción de Polimerasa en cadena (P.C.R.), virus Influenza, virus Herpes, citomegalovirus, hepatitis C, mycobacteria TBC, c/u (incluye toma muestra hisopado nasofaríngeo).              ","MAI"]
["0305035","Crioaglutininas","MAI",0,0,{"$nulls":32},"ExLab",{"v":1870,"d":"1,870"},0]
["0305036","Criohemolisinas","MAI",0,0,{"$nulls":32},"ExLab",{"v":1870,"d":"1,870"},0]
["0305037","Digestión fagocítica nitroblue-tetrazolium cualitativo y cuantitativo","MAI",0,0,{"$nulls":32},"ExLab",{"v":4800,"d":"4,800"},0]
["0305038","Fagocitosis: ingestión y digestión (killing) de levaduras por polimorfonucleares","MAI",0,0,{"$nulls":32},"ExLab",{"v":9850,"d":"9,850"},0]
["0305039","Fagocitosis: ingestión y digestión (killing) de bacterias por polimorfonucleares","MAI",0,0,{"$nulls":32},"ExLab",{"v":9850,"d":"9,850"},0]
["0305040","Inmunoadherencia de leucocitos macrófagos","MAI",0,0,{"$nulls":32},"ExLab",{"v":3860,"d":"3,860"},0]
["0305041","Intradermoreacción (PPD, histoplasmina, aspergilina, u otros, incluye el valor del antígeno y reacción de control), c/u. ","MAI",0,0,{"$nulls":32},"ExLab",{"v":3860,"d":"3,860"},0]
["0305042","LIF o MIF","MAI",0,0,{"$nulls":32},"ExLab",{"v":4800,"d":"4,800"},0]
["0305043","Linfocitos B (inmunofluorescencia)","MAI"]
["0305044","Linfocitos B (rosetas EAC) y linfocitos T (rosetas E) c/u","MAI",0,0,{"$nulls":32},"ExLab",{"v":4390,"d":"4,390"},0]
["0305045","Linfocitos T \"helper\" (OKT4) o supresores (OKT8) con antisuero monoclonal, c/u","MAI"]
["0305046","Linfocitos T totales (OKT3 y/o OKT11) con antisuero monoclonal o inmunofenotipificación de poblaciones y subpoblaciones celulares (antígenos o marcadores inmunocelulares)","MAI",0,0,{"$nulls":32},"ExLab",{"v":4800,"d":"4,800"},0]
["0305047","Linfotoxinas humanas, detección de","MAI",0,0,{"$nulls":32},"ExLab",{"v":6630,"d":"6,630"},0]
["0305048","Reacción cutánea 16 alergenos por escarificación (incluye el valor de los antígenos)","MAI"]
["0305049","Transformación linfoblástica a drogas, análisis de transformación espontanea con estimulo inespecífico y con diferentes concentraciones de la droga en 1000 células","MAI",0,0,{"$nulls":32},"ExLab",{"v":19190,"d":"19,190"},0]
["0305089","Linfocitos B totales (CD19)",null,{"$f":"SUM(E425+H425)","v":0},{"$f":"SUM(F425:G425)","v":0},{"$nulls":32},"ExLab",{"v":34950,"d":"34,950"},0]
["0305051","Absorción de autoanticuerpos del receptor","MAI",0,0,{"$nulls":32},"ExLab",{"v":5610,"d":"5,610"},0]
["0305052","Anticuerpos linfocitotóxicos (PRA) por microlinfocitotoxicidad","MAI",0,0,{"$nulls":32},"ExLab",{"v":6630,"d":"6,630"},0]
["0305053","Autocrossmatch con linfocitos T y B","MAI",0,0,{"$nulls":32},"ExLab",{"v":11730,"d":"11,730"},0]
["0305054","Autocross match con linfocitos totales","MAI",0,0,{"$nulls":32},"ExLab",{"v":9320,"d":"9,320"},0]
["0305056","Alocrossmatch con linfocitos totales","MAI",0,0,{"$nulls":32},"ExLab",{"v":7200,"d":"7,200"},0]
["0305057","Alocrossmatch con linfocitos T y B","MAI",0,0,{"$nulls":32},"ExLab",{"v":19190,"d":"19,190"},0]
["0305058","Cultivo mixto de linfocitos","MAI",0,0,{"$nulls":32},"ExLab",{"v":47930,"d":"47,930"},0]
["0305059","Identificación de clase de inmunoglobulinas de auto o alo cross match positivo","MAI",0,0,{"$nulls":32},"ExLab",{"v":19190,"d":"19,190"},0]
["0305060","Tipificación HLA B-27","MAI",0,0,{"$nulls":32},"ExLab",{"v":13310,"d":"13,310"},0]
["0305061","Tipificación HLA B-8","MAI",0,0,{"$nulls":32},"ExLab",{"v":13840,"d":"13,840"},0]
["0305062","Tipificación HLA  - DR serológica","MAI",0,0,{"$nulls":32},"ExLab",{"v":53230,"d":"53,230"},0]
["0305063","Tipificación HLA - A, B serológica","MAI",0,0,{"$nulls":32},"ExLab",{"v":66580,"d":"66,580"},0]
["0305064","Seroteca y mantención en la base  a receptores cadáver                       ","MAI",0,0,{"$nulls":32},"ExLab",{"v":15530,"d":"15,530"},{"$f":"AM438*F438","v":0}]
["0305090","Linfocitos T (CD3, CD4, CD8) o Natural Killers (CD16, CD 56) c/u","MAI",0,0,{"$nulls":32},"ExLab",{"v":20520,"d":"20,520"},{"$f":"AM439*F439","v":0}]
[null,"TOTAL",null,{"$f":"SUM(D373:D439)","v":0},{"$f":"SUM(E373:E439)","v":0},{"$f":"SUM(F373:F439)","v":0},{"$f":"SUM(G373:G439)","v":0},{"$f":"SUM(H373:H439)","v":0},{"$nulls":19},{"$f":"SUM(AB373:AB439)","v":0},0,0,{"$f":"SUM(AE373:AE439)","v":0},0,0,0,0,0,0,null,{"v":567350,"d":"567,350"},{"$f":"SUM(AN373:AN439)","v":0}]
[null,"VI.- EXAMENES MICROBIOLOGICOS                                                             ",{"$nulls":37},{"$f":"AM441*F441","v":0}]
[null,"A.-      BACTERIAS Y HONGOS"]
["0306001","Baciloscopía Ziehl-Neelsen por concentración de líquidos (orina u otros), c/u","MAI",0,0,{"$nulls":32},"ExLab",{"v":2030,"d":"2,030"},{"$f":"AM443*F443","v":0}]
["0306002","Baciloscopía Ziehl-Neelsen, c/u","MAI",0,0,{"$nulls":32},"ExLab",{"v":1370,"d":"1,370"},0]
["0306004","Examen directo al fresco, c/s tinción (incluye trichomonas)","MAI",0,0,{"$nulls":32},"ExLab",{"v":1190,"d":"1,190"},0]
["0306005","Tinción de Gram","MAI",0,0,{"$nulls":32},"ExLab",540,0]
["0306006","Ultramicroscopía (incluye toma de muestras)","MAI",0,0,{"$nulls":32},"ExLab",{"v":3580,"d":"3,580"},0]
["0306007","Coprocultivo, c/u","MAI",0,0,{"$nulls":32},"ExLab",{"v":3400,"d":"3,400"},0]
["0306008","Corriente (excepto coprocultivo, hemocultivo y urocultivo) c/u","MAI",0,0,{"$nulls":32},"ExLab",{"v":2850,"d":"2,850"},0]
["0306009","Hemocultivo aerobio, c/u","MAI"]
["0306010","Hemocultivo anaerobio, c/u","MAI"]
["0306011","Urocultivo, recuento de colonias y antibiograma (cualquier técnica) (incluye toma de orina aséptica) (no incluye recolector pediátrico)","MAI",0,0,{"$nulls":32},"ExLab",{"v":3000,"d":"3,000"},0]
["0306091","Hemocultivo aeróbico automatizado con antibiograma","MAI",0,0,{"$nulls":32},"ExLab",{"v":13500,"d":"13,500"},0]
["0306092","Hemocultivo anaeróbico automatizado con antibiograma","MAI",0,0,{"$nulls":32},"ExLab",{"v":9010,"d":"9,010"},0]
["0306093","Hemocultivo automatizado para micobacterias ","MAI",0,0,{"$nulls":32},"ExLab",{"v":12500,"d":"12,500"},0]
["0306012","Anaerobios (incluye cód. 03-06-008)","MAI",0,0,{"$nulls":32},"ExLab",{"v":5300,"d":"5,300"},0]
["0306013","Cultivo específico para Bordetella","MAI",0,0,{"$nulls":32},"ExLab",{"v":5020,"d":"5,020"},0]
["0306014","Campylobacter, Yersinia, Vibrio, c/u","MAI",0,0,{"$nulls":32},"ExLab",{"v":3580,"d":"3,580"},0]
["0306015","Difteria","MAI"]
["0306016","Neisseria gonorrhoeae (gonococo)","MAI",0,0,{"$nulls":32},"ExLab",{"v":2410,"d":"2,410"},0]
["0306017","Levaduras","MAI",0,0,{"$nulls":32},"ExLab",{"v":2190,"d":"2,190"},0]
["0306117","Hongos Filamentosos","MAI",0,0,{"$nulls":32},"ExLab",{"v":2480,"d":"2,480"},0]
["0306018","Cultivo para bacilo de Koch, (incluye otras micobacterias)","MAI",0,0,{"$nulls":32},"ExLab",{"v":3540,"d":"3,540"},0]
["0306019","Legionella","MAI",0,0,{"$nulls":32},"ExLab",{"v":3580,"d":"3,580"},0]
["0306020","Listeria","MAI"]
["0306021","Neisseria meningitidis (meningococo)","MAI"]
["0306022","Cultivo y Tipificación de micobacterias","MAI",0,0,{"$nulls":32},"ExLab",{"v":3580,"d":"3,580"},0]
["0306023","Mycoplasma y Ureaplasma, c/u","MAI",0,0,{"$nulls":32},"ExLab",{"v":5010,"d":"5,010"},0]
["0306024","Anaerobios  (mínimo 4 fármacos)","MAI"]
["0306025","Bacilo de Koch (cada fármaco)","MAI",0,0,{"$nulls":32},"ExLab",{"v":3580,"d":"3,580"},0]
["0306026","Corriente (mínimo 10 fármacos) (en caso de urocultivo no corresponde su cobro; incluido en el valor 03-06-011)","MAI",0,0,{"$nulls":32},"ExLab",{"v":2240,"d":"2,240"},0]
["0306027","Estudio de sensibilidad por dilución (CIM) (mínimo 6 fármacos) (en caso de urocultivo, no corresponde su cobro; incluido en el valor código 03-06-011)","MAI",{"$f":"SUM(E472+H472)","v":0},{"$f":"SUM(F472:G472)","v":0},{"$nulls":32},"ExLab",{"v":6280,"d":"6,280"},0]
["0306028","Antifungigrama (mínimo 4 fármacos antihongos)","MAI",0,0,{"$nulls":32},"ExLab",{"v":1720,"d":"1,720"},0]
["0306029","Autovacunas, incluye cultivo y preparación  de mínimo 10 ampollas","MAI"]
["0306030","Poder bactericida del suero","MAI"]
["0306031","Preparación de vacunas uni o polivalentes mantenidas en stock (mínimo 5 ampollas)","MAI"]
["0306032","Aspergilosis, candidiasis, histoplasmosis u otros hongos por inmunodiagnóstico c/u","MAI"]
["0306033","Brucella, reacción de aglutinación para (Wright-Hudleson) o similares","MAI",0,0,{"$nulls":32},"ExLab",{"v":1250,"d":"1,250"},0]
["0306034","Clamidias por inmunofluorescencia, peroxidasa, Elisa o similares","MAI",0,0,{"$nulls":32},"ExLab",{"v":4390,"d":"4,390"},0]
["0306035","Linfogranuloma venéreo, psitacosis, tifus exantemático, Mycoplasma por inmunodiagnóstico, c/u","MAI",0,0,{"$nulls":32},"ExLab",{"v":3680,"d":"3,680"},0]
["0306036","Mononucleosis, reacción de Paul Bunnell, Anticuerpos Heterófilos o similares","MAI",0,0,{"$nulls":32},"ExLab",{"v":1910,"d":"1,910"},0]
["0306037","Mycoplasma IgG, IgM, c/u. ","MAI",0,0,{"$nulls":32},"ExLab",{"v":3860,"d":"3,860"},0]
["0306038","R.P.R.","MAI",0,0,{"$nulls":32},"ExLab",{"v":2140,"d":"2,140"},0]
["0306039","Tíficas, reacciones de aglutinación  (Eberth H y O, paratyphi A y B) (Widal)","MAI",0,0,{"$nulls":32},"ExLab",{"v":3010,"d":"3,010"},0]
["0306040","Tifus exantemático, reacción de aglutinación  para (Weil-Felix)","MAI",0,0,{"$nulls":32},"ExLab",{"v":1250,"d":"1,250"},0]
["0306041","Treponema pallidum FTA - ABS, MHA-TP c/u","MAI",0,0,{"$nulls":32},"ExLab",{"v":3980,"d":"3,980"},0]
["0306042","V.D.R.L.","MAI",0,0,{"$nulls":32},"ExLab",{"v":2540,"d":"2,540"},0]
["0306094","Antígeno galactomanano","MAI",0,0,{"$nulls":32},"ExLab",{"v":17500,"d":"17,500"},0]
[null,"TOTAL",null,{"$f":"SUM(D443:D488)","v":0},{"$f":"SUM(E443:E488)","v":0},{"$f":"SUM(F443:F488)","v":0},{"$f":"SUM(G443:G488)","v":0},{"$f":"SUM(H443:H488)","v":0},{"$nulls":19},{"$f":"SUM(AB443:AB488)","v":0},0,0,{"$f":"SUM(AE443:AE488)","v":0},0,0,0,0,0,0,0,{"v":148990,"d":"148,990"},0]
[null,"B) PARASITOS                                                                                        "]
["0306043","Artrópodos macroscópicos y microscópicos (imagos y/o pupas y/o larvas), diagnóstico de","MAI",0,0,{"$nulls":32},"ExLab",{"v":2410,"d":"2,410"},{"$f":"AM491*F491","v":0}]
["0306045","Coproparasitario seriado con técnica  para Cryptosporidium sp o para Diantamoeba fragilis (incluye los códigos 03-06-048 y/o 03-06-059 más aplicación de técnica de frotis con tinción tricrómica o tinción Ziehl-Neelsen en por lo menos 3 muestras, según corresponda)","MAI",0,0,{"$nulls":32},"ExLab",{"v":7200,"d":"7,200"},0]
["0306046","Coproparasitario seriado para Fasciola hepática (incluye diagnostico de gusanos macroscópicos y ex. microscópico de 10 muestras separadas por método de Telemann y de otras 10 muestras separadas y simultáneas con las ant. por téc. de sedimentación)","MAI",0,0,{"$nulls":32},"ExLab",{"v":14390,"d":"14,390"},0]
["0306047","Coproparasitario seriado para Isospora y Sarcocystis (incluye diagnóstico de gusanos macroscópicos y examen  microscópico de 3 muestras separadas)","MAI",0,0,{"$nulls":32},"ExLab",{"v":3860,"d":"3,860"},0]
["0306048","Coproparasitológico seriado simple (incluye diagnostico de gusanos macroscópicos y examen microscópico por concentración de 3 muestras separadas método Telemann) (proc. aut.)","MAI",0,0,{"$nulls":32},"ExLab",{"v":2540,"d":"2,540"},0]
["0306049","Diagnostico de parásitos en jugo duodenal y/o bilis, examen macroscópico y microscópico (directo y/o concentración, c/s tinción)","MAI",0,0,{"$nulls":32},"ExLab",{"v":2410,"d":"2,410"},0]
["0306050","Diagnostico parasitario en exudados, secreciones y otros líquidos orgánicos (no especificados mas adelante), examen macro y microscópico de (incluye concentración y/o tinción cuando proceda), c/u","MAI",0,0,{"$nulls":32},"ExLab",{"v":2410,"d":"2,410"},0]
["0306051","Graham, examen de (incluye diagnostico de gusanos macroscópicos y examen microscópico de 5 muestras separadas)","MAI",0,0,{"$nulls":32},"ExLab",{"v":1720,"d":"1,720"},0]
["0306052","Gusanos macroscópicos, diagnóstico de (proc. aut.)","MAI",0,0,{"$nulls":32},"ExLab",{"v":1370,"d":"1,370"},0]
["0306053","Hemoparásitos, diagnóstico microscópico de (mínimo 10 frotis y/o gotas gruesas, c/s examen directo al fresco), cada sesión","MAI",0,0,{"$nulls":32},"ExLab",{"v":7200,"d":"7,200"},0]
["0306054","Hemoparásitos, diagnóstico por técnica de Strout o similar en hasta 10 tubos capilares, cada sesión","MAI",0,0,{"$nulls":32},"ExLab",{"v":9540,"d":"9,540"},0]
["0306056","Raspado de piel, examen microscópico de (\"Acarotest\"): de 6 a 10 preparaciones","MAI",0,0,{"$nulls":32},"ExLab",{"v":3250,"d":"3,250"},0]
["0306057","Tenias post. trat., Diagnostico y búsqueda de escólex de","MAI",0,0,{"$nulls":32},"ExLab"]
["0306058","Xenodiagnóstico (cada aplicación de 2 cajas, con 6 ninfas por lo menos c/u, examinadas a los 20 y/o 30 días y hasta por 60 días más si procede)","MAI",0,0,{"$nulls":32},"ExLab"]
["0306059","Coproparasitológico seriado simple (incluye diagnóstico de gusanos macroscopicos  y exámen microscopico por concentración de tres muestras separadas método PAFS (proc. aut.)","MAI",0,0,{"$nulls":32},"ExLab",{"v":3280,"d":"3,280"},0]
["0306060","Doble difusión (\"arco quinto\") (hidatidosis y otras), c/u","MAI",0,0,{"$nulls":32},"ExLab",{"v":3250,"d":"3,250"},0]
["0306061","Elisa indirecta (Chagas, hidatidosis, toxocariasis y otras), c/u","MAI",0,0,{"$nulls":32},"ExLab",{"v":4390,"d":"4,390"},0]
["0306062","Fijación del complemento (distomatosis, toxoplasmosis, cisticercosis y otras) c/u","MAI"]
["0306063","Floculación en bentonita, látex, precipitinas o similar (triquinosis, hidatidosis y otros), c/u","MAI"]
["0306064","Hemaglutinación indirecta (toxoplasmosis, Chagas, hidatidosis y otras), c/u","MAI"]
["0306065","Inmunoelectroforesis o contrainmunoelectroforesis (hidatidosis, distomatosis, amebiasis y otras), c/u","MAI"]
["0306066","Inmunofluorescencia indirecta (toxoplasmosis, Chagas, amebiasis y otras), c/u","MAI",0,0,{"$nulls":32},"ExLab",{"v":4390,"d":"4,390"},0]
["0306095","Parásitos: determinación por reacción de polimerasa en cadena (PCR)","MAI",0,0,{"$nulls":32},"ExLab",{"v":31960,"d":"31,960"},0]
["0306096","Parásitos: test rápido anticuerpos (Chagas y otros)","MAI",0,0,{"$nulls":32},"ExLab",{"v":8740,"d":"8,740"},0]
[null,"TOTAL",null,{"$f":"SUM(D491:D514)","v":0},{"$f":"SUM(E491:E514)","v":0},{"$f":"SUM(F491:F514)","v":0},{"$f":"SUM(G491:G514)","v":0},{"$f":"SUM(H491:H514)","v":0},{"$nulls":19},{"$f":"SUM(AB491:AB514)","v":0},0,0,{"$f":"SUM(AE491:AE514)","v":0},0,0,0,0,0,0,null,{"$f":"SUM(AM491:AM514)","v":{"v":114310,"d":"114,310"}},{"$f":"SUM(AN491:AN514)","v":0}]
[null,"C) VIRUS                                                                                                                       "]
["0306068","Aislamiento de virus (adenovirus, citomegalovirus, Coxsakie, herpes, influenza, polio, sarampión y otros), c/u","MAI",0,0,{"$nulls":32},"ExLab",{"v":5300,"d":"5,300"},{"$f":"AM517*F517","v":0}]
["0306069","Anticuerpos virales, determ. de (adenovirus, citomegalovirus, herpes simple, rubéola, Influenza  A y B; virus varicela-zoster; virus sincicial respiratorio; parainfluenza 1, 2 y 3, Epstein Barr y otros), c/u","MAI",0,0,{"$nulls":32},"ExLab",{"v":4550,"d":"4,550"},0]
["0306169","Anticuerpos virales, determ. de H.I.V.","MAI",0,0,{"$nulls":32},"ExLab",{"v":4520,"d":"4,520"},0]
["0306070","Antígenos virales determ. de (adenovirus, citomegalovirus, herpes simple, rubéola, influenza y otros), (por cualquier técnica ej: inmunofluorescencia), c/u","MAI",0,0,{"$nulls":32},"ExLab",{"v":4240,"d":"4,240"},0]
["0306170","Antígenos virales determ. de rotavirus, por cualquier técnica ","MAI",0,0,{"$nulls":32},"ExLab",{"v":4240,"d":"4,240"},0]
["0306270","Antígenos virales determ. de virus sincicial, por cualquier técnica ","MAI",0,0,{"$nulls":32},"ExLab",{"v":4670,"d":"4,670"},0]
["0306071","Fijación de complemento, reacción (adenovirus, citomegalovirus, herpes simple, influenza, rubéola y otros), c/u","MAI",0,0,{"$nulls":32},"ExLab",{"v":3580,"d":"3,580"},0]
["0306072","Reacción de seroneutralización para: virus polio, ECHO, Coxsakie, c/u","MAI",0,0,{"$nulls":32},"ExLab"]
["0306073","Virus hepatitis A, Anticore","MAI",0,0,{"$nulls":32},"ExLab"]
["0306074","Virus hepatitis A, anticuerpos IgM del","MAI",0,0,{"$nulls":32},"ExLab",{"v":6300,"d":"6,300"},0]
["0306075","Virus hepatitis B, anticuerpo del antígeno E del","MAI",0,0,{"$nulls":32},"ExLab",{"v":5300,"d":"5,300"},0]
["0306076","Virus hepatitis B, anticore total del (anti HBc total)","MAI",0,0,{"$nulls":32},"ExLab",{"v":5810,"d":"5,810"},0]
["0306077","Virus hepatitis B, anticuerpos de antígeno de superficie (australiano)","MAI",0,0,{"$nulls":32},"ExLab",{"v":4340,"d":"4,340"},0]
["0306078","Virus hepatitis B, antígeno E del (HBEAg)","MAI",0,0,{"$nulls":32},"ExLab",{"v":5300,"d":"5,300"},0]
["0306079","Virus hepatitis B, antígeno superficie","MAI",0,0,{"$nulls":32},"ExLab",{"v":4390,"d":"4,390"},0]
["0306080","Virus hepatitis B, anticore IgM del (anti HBc IgM)","MAI",0,0,{"$nulls":32},"ExLab",{"v":6000,"d":"6,000"},0]
["0306081","Virus hepatitis C, anticuerpos de (anti HCV)","MAI",0,0,{"$nulls":32},"ExLab",{"v":6660,"d":"6,660"},0]
["0306082","Reacción de Polimerasa en cadena (P.C.R.), virus Influenza, virus Herpes, citomegalovirus, hepatitis C, mycobacteria TBC, c/u (incluye toma muestra hisopado nasofaríngeo).","MAI",0,0,{"$nulls":32},"ExLab",{"v":25170,"d":"25,170"},0]
[null,"TOTAL",null,{"$f":"SUM(D517:D534)","v":0},{"$f":"SUM(E517:E534)","v":0},{"$f":"SUM(F517:F534)","v":0},{"$f":"SUM(G517:G534)","v":0},{"$f":"SUM(H517:H534)","v":0},{"$nulls":19},{"$f":"SUM(AB517:AB534)","v":0},0,0,{"$f":"SUM(AE517:AE534)","v":0},0,0,0,0,0,0,0,{"v":100370,"d":"100,370"},0]
["VII. PROCEDIMIENTOS O DETERMINACIONES DIRECTAMENTE CON EL PACIENTE             "]
["0307001","Dietilendiamina tetraacetato de sodio cromo (EDTA Cr 51)","MAI",0,0,{"$nulls":32},"ExLab",{"v":4800,"d":"4,800"},{"$f":"AM537*F537","v":0}]
["0307002","Prueba de la sed (volumen, densidad, osmolalidad seriada en sangre y orina)","MAI",{"$f":"SUM(E538+H538)","v":0},{"$f":"SUM(F538:G538)","v":0},{"$nulls":32},"ExLab",{"v":4270,"d":"4,270"},0]
["0307003","Prueba de sobrecarga de almidón","MAI",0,0,{"$nulls":32},"ExLab",{"v":2650,"d":"2,650"},0]
["0307004","Prueba de sobrecarga de insulina o tolbutamida","MAI",0,0,{"$nulls":32},"ExLab",{"v":3610,"d":"3,610"},0]
["0307005","Reacción cutánea de parche c/u","MAI",0,0,{"$nulls":32},"ExLab",540,0]
["0307006","Sobrecarga hídrica","MAI",0,0,{"$nulls":32},"ExLab",{"v":1190,"d":"1,190"},0]
["0307007","Test del sudor (procedimiento completo)","MAI",0,0,{"$nulls":32},"ExLab",{"v":11290,"d":"11,290"},0]
["0307008","Vasopresina test o similares (incluye, además, mediciones de diuresis)","MAI",0,0,{"$nulls":32},"ExLab",{"v":3610,"d":"3,610"},0]
["0307023","Aspirados nasofaríngeo para adulto y niño.","MAI",0,0,{"$nulls":32},"ExLab",{"v":1880,"d":"1,880"},0]
["0307024","Reacción cutánea a alergenos  (incluye el valor de los alergenos)","MAI",0,0,{"$nulls":32},"ExLab",{"v":4800,"d":"4,800"},0]
[null,"TOTAL",null,{"$f":"SUM(D537:D546)","v":0},{"$f":"SUM(E537:E546)","v":0},0,0,0,{"$nulls":19},0,0,0,0,0,0,0,0,0,0,0,{"v":38640,"d":"38,640"},0]
[null,"Toma de muestras "]
["0307009","Toma de muestra arterial en adultos","MLE",0,0,{"$nulls":32},"Proc"]
["0307010","Toma de muestra arterial en niños y lactantes","MLE",0,0,{"$nulls":32},"Proc"]
["0307011","Toma de muestra venosa en adultos","MLE",0,0,{"$nulls":32},"Proc"]
["0307012","Toma de muestra venosa en niños y lactantes","MLE",0,0,{"$nulls":32},"Proc"]
["0307013","Toma de muestra con técnica aséptica para hemocultivo, c/u","MLE",0,0,{"$nulls":32},"Proc"]
["0307014","Toma de muestra capilar ( adultos, niños y lactantes )","MLE",0,0,{"$nulls":32},"Proc"]
["0307016","Toma de muestra por punción traqueal","MLE",0,0,{"$nulls":32},"Proc"]
["0307017","Toma de muestra por punción vesical en recién nacidos","MLE",0,0,{"$nulls":32},"Proc"]
["0307018","Toma de muestra por punción medular ósea","MLE",0,0,{"$nulls":32},"Proc"]
["0307023","Aspirados nasofaríngeo para adulto y niño.","MLE",0,0,{"$nulls":32},"Proc"]
["0307019","Toma de muestra duodenal y/o bilis","MLE",0,0,{"$nulls":32},"Proc"]
["0307020","Toma de muestra gástrico para bacilo de Koch o similares (1 muestra)","MLE",0,0,{"$nulls":32},"Proc"]
["0307021","Toma de muestra gástrico fraccionado (test histamina;insulina)","MLE",0,0,{"$nulls":32},"Proc"]
["0307022","Toma de muestra pancreático","MLE",0,0,{"$nulls":32},"Proc"]
[null,"TOTAL",null,{"$f":"SUM(D549:D562)","v":0},{"$f":"SUM(E549:E562)","v":0},{"$f":"SUM(F549:F562)","v":0},{"$f":"SUM(G549:G562)","v":0},{"$f":"SUM(H549:H562)","v":0},{"$nulls":19},{"$f":"SUM(AB549:AB562)","v":0},0,0,0,0,0,0,0,0,0,0]
[null,"VIII. EXAMENES DE DEPOSICIONES, EXUDADOS, SECRECIONES Y OTROS LIQUIDOS        "]
["0308001","Azúcares reductores (Benedict-Fehling o similar)","MAI",0,0,{"$nulls":32},"ExLab",940,{"$f":"AM565*F565","v":0}]
["0308002","Balance graso (Van de Kamer) muestra de tres o más días","MAI"]
["0308003","Grasas neutras (Sudán III)","MAI",0,0,{"$nulls":32},"ExLab",540,0]
["0308004","Hemorragias ocultas, (bencidina, guayaco o test de Weber y similares), cualquier método, c/muestra","MAI",0,0,{"$nulls":32},"ExLab",940,0]
["0308005","Leucocitos fecales","MAI",0,0,{"$nulls":32},"ExLab",940,0]
["0308006","PH","MAI",0,0,{"$nulls":32},"ExLab",540,0]
["0308007","Porfirinas, c/u","MAI"]
["0308008","Urobilinógeno cuantitativo","MAI"]
["0308009","Células neoplásicas en fluídos biológicos","MAI",0,0,{"$nulls":32},"ExLab",{"v":3360,"d":"3,360"},0]
["0308010","Citológico c/s tinción (incluye examen al fresco, recuento celular y citológico porcentual)","MAI",0,0,{"$nulls":32},"ExLab",{"v":2420,"d":"2,420"},0]
["0308011","Directo al fresco c/s tinción, (incluye trichomonas)","MAI",0,0,{"$nulls":32},"ExLab",{"v":1190,"d":"1,190"},0]
["0308012","Electrolitos (sodio, potasio, cloro), c/u","MAI",0,0,{"$nulls":32},"ExLab",{"v":1190,"d":"1,190"},0]
["0308013","Eosinófilos, recuento de","MAI",0,0,{"$nulls":32},"ExLab",660,0]
["0308014","Físico-químico (incluye aspecto, color, pH, glucosa, proteína, Pandy y filancia)","MAI",0,0,{"$nulls":32},"ExLab",{"v":1880,"d":"1,880"},0]
["0308015","Glucosa","MAI",0,0,{"$nulls":32},"ExLab",540,0]
["0308016","Mucina, determinación de","MAI",0,0,{"$nulls":32},"ExLab",940,0]
["0308017","pH, (proc. aut.)","MAI",0,0,{"$nulls":32},"ExLab",540,0]
["0308018","Proteínas totales o albúmina (proc. aut.) c/u","MAI",0,0,{"$nulls":32},"ExLab",{"v":1190,"d":"1,190"},0]
["0308019","Proteínas, electroforesis de (incluye proteínas totales)","MAI",0,0,{"$nulls":32},"ExLab",{"v":5030,"d":"5,030"},0]
["0308020","Bandas oligoclonales (incluye electroforesis de L.C.R., suero e inmunofijación)","MAI",0,0,{"$nulls":32},"ExLab",{"v":17290,"d":"17,290"},0]
["0308021","Glutamina","MAI",0,0,{"$nulls":32},"ExLab",{"v":1590,"d":"1,590"},0]
["0308022","Indice IgG/albúmina (incluye determ. de IgG y albúmina en L.C.R. y suero)","MAI",0,0,{"$nulls":32},"ExLab",{"v":9550,"d":"9,550"},0]
["0308023","Estudio de cristales (con luz polarizada)","MAI",0,0,{"$nulls":32},"ExLab",{"v":1190,"d":"1,190"},0]
["0308024","Acidez titulable, pH, volumen (una muestra)","MAI"]
["0308025","Prueba de estimulación máxima con histamina, mínimo 5 muestras (no incluye la histamina ni el antihistamínico).","MAI",0,0,{"$nulls":32},"ExLab",{"v":4800,"d":"4,800"},0]
["0308026","Volumen, anhídrido carbónico, amilasa y lipasa","MAI"]
["0308027","Cristales de colesterol","MAI"]
["0308028","Lípidos biliares","MAI"]
["0308029","Espermiograma (físico y microscópico, con o sin observación hasta 24 horas)","MAI",0,0,{"$nulls":32},"ExLab",{"v":3300,"d":"3,300"},0]
["0308030","Fosfatasa ácida prostática","MAI",0,0,{"$nulls":32},"ExLab",{"v":2420,"d":"2,420"},0]
["0308031","Fructosa, consumo de","MAI",0,0,{"$nulls":32},"ExLab",{"v":1380,"d":"1,380"},0]
["0308033","Células anaranjadas (proc. aut.)","MAI",0,0,{"$nulls":32},"ExLab",540,0]
["0308034","Contaminantes (meconio y sangre) (proc. aut.)","MAI",0,0,{"$nulls":32},"ExLab",940,0]
["0308035","Creatinina (proc. aut.)","MAI",0,0,{"$nulls":32},"ExLab",940,0]
["0308036","Fosfatidil glicerol y/o fosfatidil inositol","MAI",0,0,{"$nulls":32},"ExLab",{"v":5300,"d":"5,300"},0]
["0308037","Indice de bilirrubina (prueba de Liley)","MAI",0,0,{"$nulls":32},"ExLab",{"v":1190,"d":"1,190"},0]
["0308038","Indice lecitina/esfingomielina","MAI",0,0,{"$nulls":32},"ExLab",{"v":4800,"d":"4,800"},0]
["0308039","Madurez fetal completa (físico; células anaranjadas, bilirrubina, test de Clements, creatinina, contaminantes)","MAI",0,0,{"$nulls":32},"ExLab",{"v":4800,"d":"4,800"},0]
["0308040","Test de Clements (proc. aut.)","MAI",{"$f":"SUM(E603+H603)","v":0},{"$f":"SUM(F603:G603)","v":0},{"$nulls":32},"ExLab",940,0]
["0308041","Colpocitograma","MAI",0,0,{"$nulls":32},"ExLab",{"v":1880,"d":"1,880"},0]
["0308042","Cristalización y filancia de moco cervical","MAI"]
["0308043","Moco-semen, prueba de compatibilidad","MAI",0,0,{"$nulls":32},"ExLab",{"v":1880,"d":"1,880"},0]
["0308044","Flujo vaginal o secreción uretral, estudio de (incluye toma de muestra y códigos 03-06-004, 03-06-005, 03-06-008, 03-06-017, y 03-06-026 )","MAI",0,0,{"$nulls":32},"ExLab",{"v":6580,"d":"6,580"},0]
["0308045","Amilasa en exudados, secreciones y otros líquidos","MAI",0,0,{"$nulls":32},"ExLab",{"v":3440,"d":"3,440"},0]
["0308046","Lipasa en exudados, secreciones y otros líquidos","MAI",0,0,{"$nulls":32},"ExLab",{"v":2260,"d":"2,260"},0]
[null,"TOTAL",null,{"$f":"SUM(D565:D609)","v":0},{"$f":"SUM(E565:E609)","v":0},{"$f":"SUM(F565:F609)","v":0},{"$f":"SUM(G565:G609)","v":0},{"$f":"SUM(H565:H609)","v":0},{"$nulls":19},{"$f":"SUM(AB565:AB609)","v":0},0,0,{"$f":"SUM(AE565:AE609)","v":0},0,0,0,0,0,0,0,{"v":99850,"d":"99,850"},0]
[null,"IX. EXAMENES ORINA         "]
["0309001","Acido ascórbico","MAI",0,0,{"$nulls":32},"ExLab",{"v":1880,"d":"1,880"},{"$f":"AM612*F612","v":0}]
["0309002","Acido delta aminolevulínico","MAI",0,0,{"$nulls":32},"ExLab",{"v":3860,"d":"3,860"},0]
["0309003","Acido fenilpirúvico (PKU, cualitativo)","MAI"]
["0309004","Acido úrico cuantitativo","MAI",0,0,{"$nulls":32},"ExLab",{"v":1720,"d":"1,720"},0]
["0309005","Acido 5 hidroxiindolacético cuantitativo","MAI",0,0,{"$nulls":32},"ExLab",{"v":4020,"d":"4,020"},0]
["0309006","Amilasa cuantitativa","MAI",0,0,{"$nulls":32},"ExLab",{"v":2120,"d":"2,120"},0]
["0309007","Aminoácidos (cualitativo) (excepto fenilalanina, PKU)","MAI",0,0,{"$nulls":32},"ExLab",{"v":3860,"d":"3,860"},0]
["0309008","Calcio cuantitativo","MAI",0,0,{"$nulls":32},"ExLab",{"v":1590,"d":"1,590"},0]
["0309009","Cálculo urinario (examen físico y químico)","MAI",0,0,{"$nulls":32},"ExLab",{"v":3320,"d":"3,320"},0]
["0309010","Creatinina cuantitativa","MAI",0,0,{"$nulls":32},"ExLab",{"v":1190,"d":"1,190"},0]
["0309011","Cuerpos cetónicos","MAI",0,0,{"$nulls":32},"ExLab",{"v":1190,"d":"1,190"},0]
["0309012","Electrolitos (sodio, potasio, cloro) c/u","MAI",0,0,{"$nulls":32},"ExLab",{"v":1190,"d":"1,190"},0]
["0309013","Microalbuminuria cuantitativa","MAI",0,0,{"$nulls":32},"ExLab",{"v":2410,"d":"2,410"},0]
["0309014","Embarazo, detección de (cualquier técnica)","MAI",0,0,{"$nulls":32},"ExLab",{"v":2030,"d":"2,030"},0]
["0309040","Fenilquetonuria (PKU), cuantitativo","MAI"]
["0309015","Fósforo cuantitativo","MAI",0,0,{"$nulls":32},"ExLab",{"v":1590,"d":"1,590"},0]
["0309016","Glucosa (cuantitativo)","MAI",0,0,{"$nulls":32},"ExLab",{"v":1060,"d":"1,060"},0]
["0309035","Hemosiderina","MAI",0,0,{"$nulls":32},"ExLab",900,0]
["0309017","Hidroxiprolina","MAI",0,0,{"$nulls":32},"ExLab",{"v":3610,"d":"3,610"},0]
["0309018","Melanogenuria (test de cloruro férrico)","MAI"]
["0309019","Mucopolisacáridos","MAI",0,0,{"$nulls":32},"ExLab",{"v":4800,"d":"4,800"},0]
["0309020","Nitrógeno ureico o urea cuantitativo","MAI",0,0,{"$nulls":32},"ExLab",660,0]
["0309021","Nucleótidos cíclicos (CAMP, CGM, u otros) c/u","MAI",0,0,{"$nulls":32},"ExLab",{"v":3860,"d":"3,860"},0]
["0309022","Orina completa, (incluye cód. 03-09-023 y 03-09-024)","MAI",0,0,{"$nulls":32},"ExLab",{"v":1530,"d":"1,530"},0]
["0309023","Orina, físico-químico (aspecto, color, densidad, pH, proteínas, glucosa, cuerpos cetónicos, urobilinógeno, bilirrubina, hemoglobina y nitritos) todos o cada uno de los parámetros (proc. aut.)","MAI",0,0,{"$nulls":32},"ExLab",940,0]
["0309024","Orina, sedimento (proc. aut.)","MAI",0,0,{"$nulls":32},"ExLab",870,0]
["0309025","Osmolalidad","MAI",0,0,{"$nulls":32},"ExLab",{"v":1380,"d":"1,380"},0]
["0309026","Osmolaridad","MAI",0,0,{"$nulls":32},"ExLab",{"v":1380,"d":"1,380"},0]
["0309027","Porfirinas, c/u","MAI",0,0,{"$nulls":32},"ExLab",{"v":1660,"d":"1,660"},0]
["0309028","Proteína (cuantitativa)","MAI",0,0,{"$nulls":32},"ExLab",{"v":1380,"d":"1,380"},0]
["0309029","Proteínas de Bence-Jones prueba térmica","MAI",0,0,{"$nulls":32},"ExLab",940,0]
["0309030","Urobilinógeno (cuantitativo)","MAI",0,0,{"$nulls":32},"ExLab",{"v":1590,"d":"1,590"},0]
["0309031","Screening de drogas                                    ","MAI",0,0,{"$nulls":32},"ExLab",{"v":5340,"d":"5,340"},0]
[null,"TOTAL",null,{"$f":"SUM(D612:D644)","v":0},{"$f":"SUM(E612:E644)","v":0},{"$f":"SUM(F612:F644)","v":0},{"$f":"SUM(G612:G644)","v":0},{"$f":"SUM(H612:H644)","v":0},{"$nulls":19},{"$f":"SUM(AB612:AB644)","v":0},0,0,{"$f":"SUM(AE612:AE644)","v":0},0,0,0,0,0,0,0,{"v":63870,"d":"63,870"},0]
[null,"GRUPO 04 : IMAGENOLOGIA                "]
[null,"A.EXAMENES RADIOLOGICOS SIMPLES      "]
["0401001","Radiografía de las glándulas salivales \"sialografía\"","MAI",0,0,{"$nulls":32},"ExIma",{"v":18310,"d":"18,310"},{"$f":"AM648*F648","v":0}]
["0401002","Radiografía de partes blandas, laringe lateral, cavum rinofaríngeo (rinofarinx). ","MAI",0,0,{"$nulls":32},"ExIma",{"v":7670,"d":"7,670"},0]
["0401004","Radiografía de tórax, proyección complementaria (oblicuas, selectivas u otras)","MAI",0,0,{"$nulls":32},"ExIma",{"v":5530,"d":"5,530"},0]
["0401006"," Estudio radiológico de corazón (incluye fluoroscopía, telerradiografías frontal y lateral con esofagograma) ","MAI",0,0,{"$nulls":32},"ExIma",{"v":16510,"d":"16,510"},0]
["0401008","Radiografía de tórax  frontal o lateral con equipo móvil fuera del departamento de rayos.","MAI",0,0,{"$nulls":32},"ExIma",{"v":8210,"d":"8,210"},0]
["0401009","Radiografía de tórax simple frontal o lateral ","MAI",0,0,{"$nulls":32},"ExIma",{"v":8210,"d":"8,210"},0]
["0401070","Radiografía de tórax frontal y lateral","MAI",0,0,{"$nulls":32},"ExIma",{"v":15040,"d":"15,040"},0]
["0401010","Mamografía bilateral","MAI",0,0,{"$nulls":32},"ExIma",{"v":17410,"d":"17,410"},0]
["0401110","Mamografía unilateral","MAI",0,0,{"$nulls":32},"ExIma",{"v":10380,"d":"10,380"},0]
["0401130","Mamografía proyección complementaria  (axilar u otras)","MAI",0,0,{"$nulls":32},"ExIma",{"v":3980,"d":"3,980"},0]
["0401011","Marcación preoperatoria de lesiones de la mama","MAI",0,0,{"$nulls":32},"ExIma",{"v":18310,"d":"18,310"},0]
["0401012","Radiografía de mama, pieza operatoria","MAI",0,0,{"$nulls":32},"ExIma",{"v":5530,"d":"5,530"},0]
["0401013","Radiografía de Abdomen Simple","MAI",0,0,{"$nulls":32},"ExIma",{"v":7300,"d":"7,300"},0]
["0401014","Radiografía de abdomen simple, proyección complementaria (lateral y/o oblicua)","MAI",0,0,{"$nulls":32},"ExIma",{"v":5530,"d":"5,530"},0]
["0401015","Colangiografía intra o postoperatoria (por sonda T, o similar)","MAI",0,0,{"$nulls":32},"ExIma",{"v":15270,"d":"15,270"},0]
["0401018","Enema baritado del colon (incluye llene y control post-vaciamiento)","MAI",0,0,{"$nulls":32},"ExIma",{"v":30790,"d":"30,790"},0]
["0401019","Enema baritado del colon o intestino delgado, doble contraste","MAI",{"$f":"SUM(E664+H664)","v":0},{"$f":"SUM(F664:G664)","v":0},{"$nulls":32},"ExIma",{"v":34630,"d":"34,630"},0]
["0401020","Esofagograma  (incluye pesquisa de cuerpo extraño) (proc.aut.)","MAI",0,0,{"$nulls":32},"ExIma",{"v":13700,"d":"13,700"},0]
["0401021","Radiografía de esófago, estómago y duodeno, relleno y/o doble contraste ","MAI",0,0,{"$nulls":32},"ExIma",{"v":30510,"d":"30,510"},0]
["0401022","Estudio radiológico de deglución faríngea","MAI",0,0,{"$nulls":32},"ExIma",{"v":13700,"d":"13,700"},0]
["0401023","Estudio radiológico del intestino delgado","MAI",0,0,{"$nulls":32},"ExIma",{"v":24430,"d":"24,430"},0]
["0401024","Radiografía de esófago, estómago y duodeno, simple en niños ","MAI",0,0,{"$nulls":32},"ExIma",{"v":22580,"d":"22,580"},0]
["0401027","Pielografía de eliminación o descendente: incluye renal y vesical simples previas, 3 placas post inyección de medio de contraste, controles de pie y cistografía pre y post miccional. ","MAI",0,0,{"$nulls":32},"ExIma",{"v":33240,"d":"33,240"},0]
["0401028","Radiografía renal simple (proc. aut.)","MAI",0,0,{"$nulls":32},"ExIma",{"v":7030,"d":"7,030"},0]
["0401029","Radiografía vesical simple o perivesical (proc. aut.)","MAI",0,0,{"$nulls":32},"ExIma",{"v":6110,"d":"6,110"},0]
["0401030","Radiografía agujeros ópticos, ambos lados","MAI",0,0,{"$nulls":32},"ExIma",{"v":12150,"d":"12,150"},0]
["0401031","Radiografía de cavidades perinasales, órbitas, articulaciones temporomandibulares, huesos propios de la nariz, malar, maxilar, arco cigomático y cara","MAI",0,0,{"$nulls":32},"ExIma",{"v":8210,"d":"8,210"},0]
["0401032","Radiografía de cráneo frontal y lateral","MAI",0,0,{"$nulls":32},"ExIma",{"v":8680,"d":"8,680"},{"$f":"AM675*F675","v":0}]
["0401033","Radiografía de Cráneo  proyección especial de  base de cráneo (Towne)","MAI",0,0,{"$nulls":32},"ExIma",{"v":6110,"d":"6,110"},0]
["0401034","Radiografía de globo ocular, estudio de cuerpo extraño","MAI",0,0,{"$nulls":32},"ExIma",{"v":15270,"d":"15,270"},0]
["0401035","Radiografía de oído, uno o ambos ","MAI",0,0,{"$nulls":32},"ExIma",{"v":11990,"d":"11,990"},0]
["0401040","Radiografía de silla turca frontal y lateral ","MAI",0,0,{"$nulls":32},"ExIma",{"v":10040,"d":"10,040"},0]
["0401042","Radiografía de columna cervical o atlas-axis (frontal y lateral)","MAI",0,0,{"$nulls":32},"ExIma",{"v":8210,"d":"8,210"},0]
["0401043","Radiografía de columna cervical (frontal, lateral y oblicuas)","MAI",0,0,{"$nulls":32},"ExIma",{"v":14640,"d":"14,640"},0]
["0401044","Radiografía de columna cervical  flexión y  extensión (Dinámicas)","MAI",0,0,{"$nulls":32},"ExIma",{"v":8210,"d":"8,210"},0]
["0401045","Radiografía de columna dorsal o dorsolumbar localizada, parrilla costal adultos (frontal y lateral).","MAI",0,0,{"$nulls":32},"ExIma",{"v":9610,"d":"9,610"},0]
["0401046","Radiografía columna lumbar o lumbosacra   ","MAI",0,0,{"$nulls":32},"ExIma",{"v":14150,"d":"14,150"},0]
["0401047","Radiografía columna lumbar o lumbosacra  flexión y  extensión (Dinámicas)","MAI",0,0,{"$nulls":32},"ExIma",{"v":12150,"d":"12,150"},0]
["0401048","Radiografía columna lumbar o lumbosacra, oblicuas adicionales ","MAI",0,0,{"$nulls":32},"ExIma",{"v":8210,"d":"8,210"},0]
["0401049","Radiografía de columna total, panorámica con folio graduado  frontal o lateral","MAI",0,0,{"$nulls":32},"ExIma",{"v":10990,"d":"10,990"},0]
["0401051","Radiografía de pelvis, cadera o coxofemoral","MAI",0,0,{"$nulls":32},"ExIma",{"v":6340,"d":"6,340"},0]
["0401151","Radiografía de pelvis, cadera o coxofemoral de RN, lactante o niño menor de 6 años.","MAI",0,0,{"$nulls":32},"ExIma",{"v":6340,"d":"6,340"},0]
["0401052","Radiografía de pelvis, cadera o coxofemoral, proyecciones especiales; (rotación interna, abducción, lateral, Lawenstein u otras)","MAI",0,0,{"$nulls":32},"ExIma",{"v":6110,"d":"6,110"},0]
["0401053","Radiografía de Sacrocoxis o articulaciones sacroilíacas.","MAI",0,0,{"$nulls":32},"ExIma",{"v":9130,"d":"9,130"},0]
["0401054","Radiografía de brazo, antebrazo, codo, muñeca, mano, dedos, pie  (frontal y lateral)","MAI",0,0,{"$nulls":32},"ExIma",{"v":7300,"d":"7,300"},0]
["0401055","Radiografía de clavícula.","MAI",0,0,{"$nulls":32},"ExIma",{"v":8440,"d":"8,440"},0]
["0401056","Radiografía Edad Ósea: carpo y mano ","MAI",0,0,{"$nulls":32},"ExIma",{"v":7300,"d":"7,300"},0]
["0401057","Radiografía Edad ósea : rodilla frontal","MAI",0,0,{"$nulls":32},"ExIma",{"v":8440,"d":"8,440"},0]
["0401058","Estudio radiológico de escafoides","MAI",0,0,{"$nulls":32},"ExIma",{"v":9130,"d":"9,130"},0]
["0401059","Estudio radiológico de muñeca o tobillo frontal lateral y oblicuas","MAI",0,0,{"$nulls":32},"ExIma",{"v":8530,"d":"8,530"},0]
["0401060","Radiografía de hombro, fémur, rodilla, pierna, costilla o esternón Frontal y Lateral","MAI",0,0,{"$nulls":32},"ExIma",{"v":8530,"d":"8,530"},0]
["0401062","Radiografía de Proyecciones especiales oblicuas u otras en hombro, brazo, codo, rodilla, rótulas, sesamoideos, axial de ambas rótulas o similares","MAI",0,0,{"$nulls":32},"ExIma",{"v":6110,"d":"6,110"},0]
["0401063","Radiografía de túnel intercondíleo o radio-carpiano","MAI",0,0,{"$nulls":32},"ExIma",{"v":6110,"d":"6,110"},0]
["0401064","Apoyo fluoroscópico a procedimientos intraoperatorios y/o biopsia (no incluye el proc.)","MAI",0,0,{"$nulls":32},"ExIma",{"v":6110,"d":"6,110"},{"$f":"AM701*F701","v":0}]
[5099115,"Radiografía de pelvis, cadera o coxofemoral de 1er screening  (entre 3 -6 meses)",null,{"$f":"SUM(E702+H702)","v":0},{"$f":"SUM(F702:G702)","v":0},{"$nulls":32},"ExIma"]
[5099116,"Radiografía torax por sospecha neumonía ",null,0,0,{"$nulls":32},"ExIma"]
[5099190,"Radiografía torax por sospecha otra patología crónica",null,0,0,{"$nulls":32},"ExIma"]
[null,"TOTAL",null,{"$f":"SUM(D648:D701)","v":0},{"$f":"SUM(E648:E701)","v":0},{"$f":"SUM(F648:F701)","v":0},{"$f":"SUM(G648:G701)","v":0},{"$f":"SUM(H648:H701)","v":0},{"$nulls":19},{"$f":"SUM(AB648:AB701)","v":0},{"$f":"SUM(AC648:AC701)","v":0},0,0,0,0,0,0,0,0,{"$f":"SUM(AL648:AL704)","v":0},{"$f":"SUM(AM648:AM701)","v":{"v":642450,"d":"642,450"}},0]
[null,"B.EXAMENES RADIOLOGICOS COMPLEJOS   "]
["0402001","Vía lagrimal (un lado) (2 exp.)","MAI",0,0,{"$nulls":32},"ExIma",{"v":15250,"d":"15,250"},{"$f":"AM707*F707","v":0}]
["0402005","Galactografía, un lado (a.c. 20-01-012) (3 exp.)","MAI",0,0,{"$nulls":32},"ExIma",{"v":8760,"d":"8,760"},0]
["0402008","Colangiopancreatografía endoscópica (5-7 exp)","MAI",0,0,{"$nulls":32},"ExIma",{"v":67050,"d":"67,050"},0]
["0402009","Fistulografía  (3 exp.)","MAI",0,0,{"$nulls":32},"ExIma",{"v":12020,"d":"12,020"},0]
["0402011","Histerosalpingografía (a.c. 20-01-013) (4 exp.; incluye prueba de Cotte tardía)","MAI",0,0,{"$nulls":32},"ExIma",{"v":17860,"d":"17,860"},0]
["0402012","Pielografía ascendente (3 exp.)","MAI",0,0,{"$nulls":32},"ExIma",{"v":50170,"d":"50,170"},0]
["0402014","Uretro y/o cistouretrografía miccional retrógrada  (5 exp.)","MAI",0,0,{"$nulls":32},"ExIma",{"v":25650,"d":"25,650"},0]
["0402015","Artrografía facetaria","MAI",0,0,{"$nulls":32},"ExIma",{"v":29270,"d":"29,270"},0]
["0402016","Discografía","MAI",0,0,{"$nulls":32},"ExIma",{"v":29270,"d":"29,270"},0]
["0402017","Neumoartrografía de cadera, hombro, codo, muñeca, etc., c/u (8 exp.)","MAI",0,0,{"$nulls":32},"ExIma",{"v":28880,"d":"28,880"},0]
["0402018","Neumoartrografía de rodilla (14 exp.)","MAI",0,0,{"$nulls":32},"ExIma",{"v":34730,"d":"34,730"},0]
["0402019","Angiografía selectiva de carótida externa o interna","MAI",0,0,{"$nulls":32},"ExIma",{"v":50600,"d":"50,600"},0]
["0402020","Angiografía selectiva medular","MAI",0,0,{"$nulls":32},"ExIma",{"v":50600,"d":"50,600"},0]
["0402024","Aortografía con AOT o cineangiografía","MAI",0,0,{"$nulls":32},"ExIma",{"v":53850,"d":"53,850"},0]
["0402025","Arteriografía de cada extremidad","MAI",0,0,{"$nulls":32},"ExIma",{"v":40130,"d":"40,130"},0]
["0402027","Arteriografía selectiva con AOT o cineangiografía (pulmonar, renal, tronco celíaco o similar) c/u","MAI",0,0,{"$nulls":32},"ExIma",{"v":65900,"d":"65,900"},0]
["0402029","Carótida vertebral por cateterización (de la subclavia axilar, humeral o femoral)","MAI",0,0,{"$nulls":32},"ExIma",{"v":47500,"d":"47,500"},0]
["0402031","Embolización o balonización (a.c. de la angiografía correspondiente) (incluye control radiológico inmediato)","MAI",0,0,{"$nulls":32},"ExIma",{"v":19580,"d":"19,580"},0]
["0402032","Instalación de catéter o sonda intracardíaca, control por radiólogo","MAI",0,0,{"$nulls":32},"ExIma",{"v":48320,"d":"48,320"},0]
["0402035","Cavografía","MAI",{"$f":"SUM(E726+H726)","v":0},{"$f":"SUM(F726:G726)","v":0},{"$nulls":32},"ExIma",{"v":34290,"d":"34,290"},0]
["0402038","Flebografía extremidad inferior o superior, un lado cada extremidad.","MAI",0,0,{"$nulls":32},"ExIma",{"v":25820,"d":"25,820"},0]
["0402040","Flebografía orbitaria o yugular","MAI",0,0,{"$nulls":32},"ExIma",{"v":36290,"d":"36,290"},0]
["0402041","Flebografía selectiva (suprarrenal y similares)","MAI",0,0,{"$nulls":32},"ExIma",{"v":34290,"d":"34,290"},0]
["0402050","Mielografía por punción lumbar con contraste hidrosoluble","MAI",0,0,{"$nulls":32},"ExIma",{"v":36290,"d":"36,290"},0]
[null,"TOTAL",null,{"$f":"SUM(D707:D730)","v":0},{"$f":"SUM(E707:E730)","v":0},{"$f":"SUM(F707:F730)","v":0},{"$f":"SUM(G707:G730)","v":0},{"$f":"SUM(H707:H730)","v":0},{"$nulls":19},{"$f":"SUM(AB707:AB730)","v":0},0,0,{"$f":"SUM(AE707:AE730)","v":0},0,0,0,0,0,0,0,{"v":862370,"d":"862,370"},0]
[null,"II.TOMOGRAFIA AXIAL COMPUTARIZADA (TAC)   "]
["0403001","Tomografía Computarizada de cráneo encefálica","MAI",0,0,{"$nulls":32},"ExIma",{"v":51710,"d":"51,710"},{"$f":"AM733*F733","v":0}]
["0403002","Tomografía Computarizada de hipotálamo-hipófisis","MAI",0,0,{"$nulls":32},"ExIma",{"v":57700,"d":"57,700"},0]
["0403003","Tomografía Computarizada de fosa posterior","MAI",0,0,{"$nulls":32},"ExIma",{"v":47570,"d":"47,570"},0]
["0403004","Tomografía Computarizada cortes coronales complementarios","MAI"]
["0403006","Tomografía Computarizada de temporal-oído ","MAI",0,0,{"$nulls":32},"ExIma",{"v":47570,"d":"47,570"},0]
["0403007","Tomografía Computarizada de órbitas maxilofacial ","MAI",0,0,{"$nulls":32},"ExIma",{"v":57700,"d":"57,700"},0]
["0403008","Tomografía Computarizada de columna cervical ","MAI",0,0,{"$nulls":32},"ExIma",{"v":63110,"d":"63,110"},0]
["0403009","Tomografía Computarizada de columna dorsal o lumbar","MAI"]
["0403010","Cada espacio adicional (10 cortes 2-4 mm)","MAI"]
["0403018","Tomografía Computarizada de Columna Dorsal ",null,{"$f":"SUM(E742+H742)","v":0},{"$f":"SUM(F742:G742)","v":0},{"$nulls":32},"ExIma",{"v":57610,"d":"57,610"},0]
["0403019","Tomografía Computarizada de Columna Lumbar ",null,0,0,{"$nulls":32},"ExIma",{"v":57610,"d":"57,610"},0]
["0403012","Tomografía Computarizada de cuello, partes blandas ","MAI",0,0,{"$nulls":32},"ExIma",{"v":47570,"d":"47,570"},0]
["0403013","Tomografía Computarizada de tórax total ","MAI",0,0,{"$nulls":32},"ExIma",{"v":74500,"d":"74,500"},0]
["0403014","Tomografía Computarizada de abdomen (hígado, vías y vesícula biliar, páncreas, bazo, suprarrenales y riñones)","MAI",0,0,{"$nulls":32},"ExIma",{"v":44370,"d":"44,370"},0]
["0403020","Tomografía Computarizada de Abdomen y Pelvis","MAI",0,0,{"$nulls":32},"ExIma",{"v":75430,"d":"75,430"},0]
["0403021","Tomografía Computarizada Pielografía","MAI",0,0,{"$nulls":32},"ExIma",{"v":17520,"d":"17,520"},0]
["0403022","Tomografía Computarizada Urografía","MAI",0,0,{"$nulls":32},"ExIma",{"v":43810,"d":"43,810"},0]
["0403023","Tomografía Computarizada de Colonografía ","MAI",0,0,{"$nulls":32},"ExIma",{"v":33410,"d":"33,410"},0]
["0403024","Tomografía Computarizada Planificación Radioterapia","MAI",0,0,{"$nulls":32},"ExIma",{"v":47460,"d":"47,460"},0]
["0403025","Tomografía Computarizada de Calcio Coronario","MAI",0,0,{"$nulls":32},"ExIma",{"v":20280,"d":"20,280"},0]
["0403104","Tomografia Computarizada Angio de Cuello","MAI",0,0,{"$nulls":32},"ExIma",{"v":42400,"d":"42,400"},0]
["0403105","Tomografía Computarizada Angio de Pelvis","MAI",0,0,{"$nulls":32},"ExIma",{"v":34610,"d":"34,610"},0]
["0403106","Tomografía Computarizada Angio Cardíaco","MAI",0,0,{"$nulls":32},"ExIma",{"v":38060,"d":"38,060"},0]
["0403016","Tomografía Computarizada de pelvis","MAI",0,0,{"$nulls":32},"ExIma",{"v":44370,"d":"44,370"},0]
["0403017","Tomografía Computarizada de extremidades","MAI",0,0,{"$nulls":32},"ExIma",{"v":40250,"d":"40,250"},0]
["0403101","Tomografía Computarizada angio  de encéfalo","MAI",0,0,{"$nulls":32},"ExIma",{"v":62730,"d":"62,730"},0]
["0403102","Tomografía Computarizada angio de tórax","MAI",0,0,{"$nulls":32},"ExIma",{"v":89230,"d":"89,230"},0]
["0403103","Tomografía Computarizada angio de abdomen","MAI",0,0,{"$nulls":32},"ExIma",{"v":84940,"d":"84,940"},0]
[null,"TOTAL",null,{"$f":"SUM(D733:D760)","v":0},{"$f":"SUM(E733:E760)","v":0},{"$f":"SUM(F733:F760)","v":0},{"$f":"SUM(G733:G760)","v":0},{"$f":"SUM(H733:H760)","v":0},{"$nulls":19},{"$f":"SUM(AB733:AB760)","v":0},0,0,{"$f":"SUM(AE733:AE760)","v":0},0,0,0,0,0,0,0,{"v":1281520,"d":"1,281,520"},0]
[null,"III.ULTRASONOGRAFIA                "]
["0404002","Ecografía obstétrica","MAI",0,0,{"$nulls":32},"ExIma",{"v":5600,"d":"5,600"},{"$f":"AM763*F763","v":0}]
["0404003","Ecografía abdominal (incluye hígado, vía biliar, vesícula, páncreas, riñones, bazo, retroperitoneo y grandes vasos)","MAI",0,0,{"$nulls":32},"ExIma",{"v":20520,"d":"20,520"},0]
["0404004","Ecografía como apoyo a cirugía, o a procedimiento (de tórax, muscular, partes blandas, etc.)","MAI",0,0,{"$nulls":32},"ExIma",{"v":12680,"d":"12,680"},0]
["0404005","Ecografía transvaginal o transrectal","MAI",0,0,{"$nulls":32},"ExIma",{"v":11410,"d":"11,410"},0]
["0404006","Ecografía ginecológica, pelviana femenina u obstétrica con estudio fetal","MAI",0,0,{"$nulls":32},"ExIma",{"v":10870,"d":"10,870"},0]
["0404007","Ecografía transvaginal para seguimiento de ovulación, procedimiento completo (6-8 sesiones )","MAI",0,0,{"$nulls":32},"ExIma",{"v":15850,"d":"15,850"},0]
["0404008","Ecografía para seguimiento de ovulación, procedimiento completo (6 a 8 sesiones)","MAI",0,0,{"$nulls":32},"ExIma",{"v":15850,"d":"15,850"},0]
["0404009","Ecografía pélvica masculina (incluye vejiga y próstata)","MAI",0,0,{"$nulls":32},"ExIma",{"v":11410,"d":"11,410"},0]
["0404010","Ecografía renal (bilateral), o de bazo","MAI",0,0,{"$nulls":32},"ExIma",{"v":14270,"d":"14,270"},0]
["0404011","Ecografía encefálica (RN o lactante)","MAI",0,0,{"$nulls":32},"ExIma",{"v":14270,"d":"14,270"},0]
["0404012","Ecografía mamaria bilateral (incluye Doppler)","MAI",0,0,{"$nulls":32},"ExIma",{"v":14270,"d":"14,270"},0]
["0404013","Ecografía ocular, uno o ambos ojos.","MAI",0,0,{"$nulls":32},"ExIma",{"v":14270,"d":"14,270"},0]
["0404014","Ecografía testicular (uno o ambos) (Incluye Doppler)","MAI",0,0,{"$nulls":32},"ExIma",{"v":14270,"d":"14,270"},0]
["0404015","Ecografía tiroidea (Incluye Doppler)","MAI",0,0,{"$nulls":32},"ExIma",{"v":14270,"d":"14,270"},0]
["0404016","Ecografía vascular periférica, articular o de partes blandas","MAI",0,0,{"$nulls":32},"ExIma",{"v":14270,"d":"14,270"},0]
["0404118","Ecografía vascular (arterial y venosa) periférica (bilateral)","MAI",0,0,{"$nulls":32},"ExIma",{"v":48730,"d":"48,730"},0]
["0404119","Ecografía doppler de vasos del cuello","MAI",0,0,{"$nulls":32},"ExIma",{"v":48730,"d":"48,730"},0]
["0404120","Ecografía transcraneana                                                                      ","MAI",0,0,{"$nulls":32},"ExIma",{"v":48730,"d":"48,730"},0]
["0404121","Ecografía abdominal o de vasos testiculares                               ","MAI",0,0,{"$nulls":32},"ExIma",{"v":48730,"d":"48,730"},0]
["0404122","Ecografía doppler de vasos placentarios                                       ","MAI",0,0,{"$nulls":32},"ExIma",{"v":48730,"d":"48,730"},0]
[null,"TOTAL",null,{"$f":"SUM(D763:D782)","v":0},{"$f":"SUM(E763:E782)","v":0},0,0,0,{"$nulls":19},0,0,0,0,0,0,0,0,0,0,0,{"v":447730,"d":"447,730"},0]
[null,"IV.- RESONANCIA MAGNÉTICA (incluye medio de contraste)     "]
["0405001","Resonancia Magnética cráneo encefálica","MAI",0,0,{"$nulls":32},"ExIma",{"v":165910,"d":"165,910"},0]
["0405002","Resonancia Magnética de hipotálamo - hipófisis","MAI",0,0,{"$nulls":32},"ExIma",{"v":165910,"d":"165,910"},0]
["0405003","Resonancia Magnética  de órbitas","MAI",0,0,{"$nulls":32},"ExIma",{"v":157360,"d":"157,360"},0]
["0405004","Resonancia Magnética de articulaciones temporomandibulares","MAI",0,0,{"$nulls":32},"ExIma",{"v":157360,"d":"157,360"},0]
["0405005","Resonancia Magnética  de columna cervical","MAI",0,0,{"$nulls":32},"ExIma",{"v":165910,"d":"165,910"},0]
["0405006","Resonancia Magnética de columna dorsal","MAI",0,0,{"$nulls":32},"ExIma",{"v":165910,"d":"165,910"},0]
["0405007","Resonancia Magnética de columna lumbar","MAI",{"$f":"SUM(E791+H791)","v":0},{"$f":"SUM(F791:G791)","v":0},{"$nulls":32},"ExIma",{"v":165910,"d":"165,910"},0]
["0405017","Resonancia Magnética Angiografía de Encéfalo ","MAI",0,0,{"$nulls":32},"ExIma",{"v":165910,"d":"165,910"},0]
["0405018","Resonancia Magnética Angiografía de Cuello","MAI",0,0,{"$nulls":32},"ExIma",{"v":165910,"d":"165,910"},0]
["0405019","Resonancia Magnética Angiografía de Tórax ","MAI",0,0,{"$nulls":32},"ExIma",{"v":165910,"d":"165,910"},{"$f":"AM794*F794","v":0}]
["0405020","Resonancia Magnética Angiografía de Abdomen ","MAI",0,0,{"$nulls":32},"ExIma",{"v":165910,"d":"165,910"},0]
["0405021","Resonancia Magnética Angiografía de Pelvis ","MAI",0,0,{"$nulls":32},"ExIma",{"v":165910,"d":"165,910"},0]
["0405022","Resonancia Magnética  Angiografía de Extremidad Superior Unilateral ","MAI",0,0,{"$nulls":32},"ExIma",{"v":165910,"d":"165,910"},0]
["0405023","Resonancia Magnética  Angiografia de Extremidad Inferior Unilateral ","MAI",0,0,{"$nulls":32},"ExIma",{"v":165910,"d":"165,910"},0]
["0405008","Angiografía por resonancia","MAI"]
["0405009","Resonancia Magnética de tórax","MAI",0,0,{"$nulls":32},"ExIma",{"v":165910,"d":"165,910"},0]
["0405010","Resonancia Magnética de abdomen ","MAI",0,0,{"$nulls":32},"ExIma",{"v":165910,"d":"165,910"},0]
["0405011","Resonancia Magnética de pelvis","MAI",0,0,{"$nulls":32},"ExIma",{"v":165910,"d":"165,910"},0]
["0405012","Resonancia Magnética de abdomen y pelvis","MAI",0,0,{"$nulls":32},"ExIma",{"v":248870,"d":"248,870"},0]
["0405013","Resonancia Magnética de rodilla","MAI",0,0,{"$nulls":32},"ExIma",{"v":136050,"d":"136,050"},0]
["0405014","Resonancia Magnética extremidad superior (uno o mas segmentos)","MAI"]
["0405015","Resonancia Extremidad inferior (uno o mas segmentos)","MAI"]
["0405024","Resonancia Magnética de Mano o Muñeca ",null,{"$f":"SUM(E807+H807)","v":0},{"$f":"SUM(F807:G807)","v":0},{"$nulls":32},"ExIma",{"v":136050,"d":"136,050"},0]
["0405025","Resonancia Magnética de Antebrazo o Brazo ",null,0,0,{"$nulls":32},"ExIma",{"v":136050,"d":"136,050"},0]
["0405026","Resonancia Magnética de Codo ",null,0,0,{"$nulls":32},"ExIma",{"v":136050,"d":"136,050"},0]
["0405027","Resonancia Magnética de Hombro ",null,0,0,{"$nulls":32},"ExIma",{"v":136050,"d":"136,050"},0]
["0405028","Resonancia Magnética de Pie, Antepie o Tobillo ",null,0,0,{"$nulls":32},"ExIma",{"v":136050,"d":"136,050"},0]
["0405029","Resonancia Magnética de Pierna",null,0,0,{"$nulls":32},"ExIma",{"v":136050,"d":"136,050"},0]
["0405030","Resonancia Magnética de Muslo",null,0,0,{"$nulls":32},"ExIma",{"v":136050,"d":"136,050"},0]
["0405031","Resonancia Magnética de Mama (bilateral)",null,0,0,{"$nulls":32},"ExIma",{"v":136050,"d":"136,050"},0]
["0405016","Resonancia Columna Total (cervical, dorsal, lumbar)","MAI",0,0,{"$nulls":32},"ExIma",{"v":298640,"d":"298,640"},0]
["0405098","Colangioresonancia","MAI",0,0,{"$nulls":32},"ExIma",{"v":111150,"d":"111,150"},0]
[null,"TOTAL",null,{"$f":"SUM(D785:D816)","v":0},{"$f":"SUM(E785:E816)","v":0},{"$f":"SUM(F785:F816)","v":0},{"$f":"SUM(G785:G816)","v":0},{"$f":"SUM(H785:H816)","v":0},{"$nulls":19},{"$f":"SUM(AB785:AB816)","v":0},0,0,0,0,0,0,0,0,0,0,{"v":4686480,"d":"4,686,480"},0]
[null,"Otros Exámenes de Imágenes"]
["0403998","Cisternotac",null,0,0,{"$nulls":32},"ExIma"]
["0488881","Urotac",null,0,0,{"$nulls":32},"ExIma"]
["0488882","Pielo-TAC",null,0,0,{"$nulls":32},"ExIma"]
["0403999","Estereotaxia",null,0,0,{"$nulls":32},"ExIma"]
["0488883","Angiotac pelvis",null,0,0,{"$nulls":32},"ExIma"]
["0488884","Angiotac miembro superior",null,0,0,{"$nulls":32},"ExIma"]
["0488885","Angiotac miembro inferior",null,0,0,{"$nulls":32},"ExIma"]
[null,"Estudio de deglución faríngea por videofluroscopía",null,0,0,{"$nulls":32},"ExIma"]
[null,"Biopsia mamaria guíado por ecotomografía",null,0,0,{"$nulls":32},"ExIma"]
[null,"Ecotomografia portátil (traslado desde imagenología al servicio que lo requiere)",null,0,0,{"$nulls":32},"ExIma"]
[null,"Biopsia CORE de mama",null,0,0,{"$nulls":32},"ExIma"]
[null,"Procedimiento Bajo Eco (paaf, punción de partes blandas, drenajes)",null,0,0,{"$nulls":32},"ExIma"]
[null,"Marcación Ecográfica",null,0,0,{"$nulls":32},"ExIma"]
[null,"Angiotomografia  computarizada de corazón  con estudios de vasos coronarios ",null,0,0,{"$nulls":32},"ExIma"]
[null,"Angiotomografía corazón con estudio de vasos coronarios",null,0,0,{"$nulls":32},"ExIma"]
[null,"Cintigrama",null,0,0,{"$nulls":32},"ExIma"]
[null,"Cintigrama oseo ",null,0,0,{"$nulls":32},"ExIma"]
[null,"Cintigrama sestamibi",null,0,0,{"$nulls":32},"ExIma"]
[null,"Cintigrama tc - ec",null,0,0,{"$nulls":32},"ExIma"]
[null,"Estudio de Flujo de Liquido Cefalo Raquideo",null,0,0,{"$nulls":32},"ExIma"]
[null,"Resonancia Funcional",null,0,0,{"$nulls":32},"ExIma"]
[null,"Estudio de Tractografía",null,0,0,{"$nulls":32},"ExIma"]
[null,"Espectroscopía por RNM",null,0,0,{"$nulls":32},"ExIma"]
[null,"Cavidades para nasales",null,0,0,{"$nulls":32},"ExIma"]
[null,"Resonancia Magnética Fetal",null,0,0,{"$nulls":32},"ExIma"]
[null,"Perfusión por Resonancia Magnética",null,0,0,{"$nulls":32},"ExIma"]
[null,"Tóracocentesis guíado por ecotomografía",null,0,0,{"$nulls":32},"ExIma"]
[null,"Laparocentesis guíado por ecotomografía",null,0,0,{"$nulls":32},"ExIma"]
[null,"Ablación por radiofrecuencia de tumores guíado por ecotomografía",null,0,0,{"$nulls":32},"ExIma"]
[null,"Ablación por radiofrecuencia de tumores guíado por TAC",null,0,0,{"$nulls":32},"ExIma"]
[null,"Contraste paramagnético para resonancia magnética",null,0,0,{"$nulls":32},"ExIma"]
[null,"Contraste yodado hidrosoluble para tomografía computada",null,0,0,{"$nulls":32},"ExIma"]
[null,"Extracción de cuerpos extraños guíado por ecotomografía",null,0,0,{"$nulls":32},"ExIma"]
[null,"Marcación de microcalcificaciones preoperatorias guíada por mamografías ",null,0,0,{"$nulls":32},"ExIma"]
[null,"Marcación de nódulo mamario preoperatorio guíada por ultrasonido ",null,0,0,{"$nulls":32},"ExIma"]
[null,"Nefrostomía bajo TAC con Anestesia General",null,0,0,{"$nulls":32},"ExIma"]
[null,"Nefrostomía percutánea guíada en TAC",null,0,0,{"$nulls":32},"ExIma"]
[null,"Punción Citológica bajo Ecografía",null,0,0,{"$nulls":32},"ExIma"]
[null,"Punción Citológica bajo TAC",null,0,0,{"$nulls":32},"ExIma"]
[null,"Punción citológica de tiroides por ultrasonido",null,0,0,{"$nulls":32},"ExIma"]
[null,"Radiofrecuencia bajo TAC",null,0,0,{"$nulls":32},"ExIma"]
[null,"Asistencia ventricular en UCI",null,0,0,{"$nulls":32},"ExIma"]
[null,"Biopsia de lesiones de partes blandas guíado por ecotomografía",null,0,0,{"$nulls":32},"ExIma"]
[null,"Biopsia de tiroides con aguja fina PAAF",null,0,0,{"$nulls":32},"ExIma"]
[null,"Biopsia Ósea con Anestesia General",null,0,0,{"$nulls":32},"ExIma"]
[null,"Biopsia Ósea sin Anestesia General",null,{"$f":"SUM(E864+H864)","v":0},{"$f":"SUM(F864:G864)","v":0},{"$nulls":32},"ExIma"]
[null,"Biopsia Percutanea bajo Ecografía con Anestesia General",null,0,0,{"$nulls":32},"ExIma"]
[null,"Biopsia Percutanea bajo TAC con Anestesia General",null,0,0,{"$nulls":32},"ExIma"]
[null," Biopsia de médula",null,0,0,{"$nulls":32},"ExIma"]
[null," Biopsia hepática",null,0,0,{"$nulls":32},"ExIma"]
[null," Biopsia muscular",null,0,0,{"$nulls":32},"ExIma"]
[null," Biopsia de nervio",null,0,0,{"$nulls":32},"ExIma"]
[null," Biopsia rápida en quirófano",null,0,0,{"$nulls":32},"ExIma"]
[null," Infiltraciones terapéuticas guíado por ecotomografía",null,0,0,{"$nulls":32},"ExIma"]
[null,"Artrocentesis (drenaje articular) diagnóstico y terapéutico guíado por ecotomografía",null,0,0,{"$nulls":32},"ExIma"]
[null,"Aspiración tendinitis calcificante del hombre guíado por ecotomografía",null,0,0,{"$nulls":32},"ExIma"]
[null,"Calculo de reserva Fraccional de Flujo",null,0,0,{"$nulls":32},"ExIma"]
[null,"Drenaje de colecciones guíado por ecotomografía",null,0,0,{"$nulls":32},"ExIma"]
[null,"Drenaje de colecciones guíado por tomografía computada",null,0,0,{"$nulls":32},"ExIma"]
[null,"Drenaje Percutaneo bajo TAC con Anestesia General",null,0,0,{"$nulls":32},"ExIma"]
[null,"Drenaje Percutaneo bajo TAC sin Anestesia General",null,0,0,{"$nulls":32},"ExIma"]
[null,"TOTAL",null,{"$f":"SUM(D819:D879)","v":0},{"$f":"SUM(E819:E879)","v":0},{"$f":"SUM(F819:F879)","v":0},{"$f":"SUM(G819:G879)","v":0},{"$f":"SUM(H819:H879)","v":0},{"$nulls":19},{"$f":"SUM(AB819:AB879)","v":0},0,0,0,0,0,0,0,0,0]
[null,"5.- ESTUDIOS NEFROUROLÓGICOS"]
["0501117","Cintigrafía renal con D.M.S.A.","MAI",0,0,{"$nulls":32},"ExIma",{"v":28480,"d":"28,480"},{"$f":"SUM(AM882*F882)","v":0}]
["0501118","Estudio dinámico renal con Tc 99 - DTPA","MAI",0,0,{"$nulls":32},"ExIma",{"v":42730,"d":"42,730"},{"$f":"SUM(AM883*F883)","v":0}]
["0501119","Estudio dinámico renal con Tc 99 - MAG 3","MAI",0,0,{"$nulls":32},"ExIma",{"v":74070,"d":"74,070"},{"$f":"SUM(AM884*F884)","v":0}]
["0501120","Cistografía isotópica indirecta","MAI",0,0,{"$nulls":32},"ExIma",{"v":28480,"d":"28,480"},{"$f":"SUM(AM885*F885)","v":0}]
["0501121","Cistografía isotópica directa (no incluye procedimiento)","MAI",0,0,{"$nulls":32},"ExIma",{"v":28480,"d":"28,480"},{"$f":"SUM(AM886*F886)","v":0}]
[null,"TOTAL",null,{"$f":"SUM(D882:D886)","v":0},{"$f":"SUM(E882:E886)","v":0},{"$f":"SUM(F882:F886)","v":0},{"$f":"SUM(G882:G886)","v":0},{"$f":"SUM(H882:H886)","v":0},{"$nulls":19},{"$f":"SUM(AB882:AB886)","v":0},0,0,{"$f":"SUM(AE882:AE886)","v":0},0,0,0,0,0,0,null,{"$f":"SUM(AM882:AM886)","v":{"v":202240,"d":"202,240"}},{"$f":"SUM(AN882:AN886)","v":0}]
["GRUPO 05 : MEDICINA NUCLEAR Y RADIOTERAPIA       "]
["A.PROCEDIMIENTOS DIAGNOSTICOS                             "]
[null,"1.- ESTUDIOS ENDOCRINOLÓGICOS (Estáticos)"]
["0501100","Captación I-131 a las 2 y/o 24 horas","MAI",0,0,{"$nulls":32},"ExIma",{"v":18980,"d":"18,980"},{"$f":"AM891*F891","v":0}]
["0501101","Cintigrafía tiroidea, cualquier radioisótopo","MAI",0,0,{"$nulls":32},"ExIma",{"v":18980,"d":"18,980"},0]
["0501102","Cintigrafía  glándulas paratiroides (no incluye MIBI)","MAI",0,0,{"$nulls":32},"ExIma",{"v":28480,"d":"28,480"},0]
[null,"TOTAL",null,{"$f":"SUM(D891:D893)","v":0},{"$f":"SUM(E891:E893)","v":0},{"$f":"SUM(F891:F893)","v":0},{"$f":"SUM(G891:G893)","v":0},{"$f":"SUM(H891:H893)","v":0},{"$nulls":19},{"$f":"SUM(AB891:AB893)","v":0},0,0,{"$f":"SUM(AE891:AE893)","v":0},0,0,0,0,0,0,0,{"v":66440,"d":"66,440"},0]
[null,"2.- ESTUDIOS OSTEOARTICULARES"]
["0501103","Cintigrafía ósea completa planar o médula ósea (a.c. 0501133, cuando corresponda)","MAI",0,0,{"$nulls":32},"ExIma",{"v":51290,"d":"51,290"},0]
["0501104","Cintigrafía ósea trifásica (incluye mediciones fase precoz y tardía)","MAI",0,0,{"$nulls":32},"ExIma",{"v":75980,"d":"75,980"},0]
[null,"TOTAL",null,{"$f":"SUM(D896:D897)","v":0},{"$f":"SUM(E896:E897)","v":0},{"$f":"SUM(F896:F897)","v":0},{"$f":"SUM(G896:G897)","v":0},{"$f":"SUM(H896:H897)","v":0},{"$nulls":19},{"$f":"SUM(AB896:AB897)","v":0},0,0,{"$f":"SUM(AE896:AE897)","v":0},0,0,0,0,0,0,0,{"v":127270,"d":"127,270"},0]
[null,"3.- ESTUDIOS CARDIOVASCULARES"]
["0501105","Spect cardíaco stress y reposo (no incluye honorarios médico cardiólogo)","MAI",0,0,{"$nulls":32},"ExIma",{"v":138070,"d":"138,070"},0]
["0501106","Ventriculografía cardíaca isotópica","MAI",0,0,{"$nulls":32},"ExIma",{"v":42730,"d":"42,730"},0]
["0501107","Pool sanguíneo, arteriografia isotópica c/u","MAI",0,0,{"$nulls":32},"ExIma",{"v":18980,"d":"18,980"},0]
["0501108","Linfocintigrafía isotópica (no incluye procedimiento)","MAI",0,0,{"$nulls":32},"ExIma",{"v":56980,"d":"56,980"},0]
["0501109","Pool sanguíneo spect","MAI",0,0,{"$nulls":32},"ExIma",{"v":56980,"d":"56,980"},0]
[null,"TOTAL",null,{"$f":"SUM(D900:D904)","v":0},{"$f":"SUM(E900:E904)","v":0},{"$f":"SUM(F900:F904)","v":0},{"$f":"SUM(G900:G904)","v":0},{"$f":"SUM(H900:H904)","v":0},{"$nulls":19},{"$f":"SUM(AB900:AB904)","v":0},0,0,0,0,0,0,0,0,0,0,{"v":313740,"d":"313,740"},0]
[null,"4.- ESTUDIOS DIGESTIVOS","MAI"]
["0501110","Cintigrafía glándulas salivales o dacriocintigrafía","MAI",0,0,{"$nulls":32},"ExIma",{"v":28480,"d":"28,480"},{"$f":"AM907*F907","v":0}]
["0501111","Estudio motilidad esofágica y/o reflujo gastroesofágico","MAI",0,0,{"$nulls":32},"ExIma",{"v":42730,"d":"42,730"},0]
["0501112","Vaciamiento gástrico líquido o sólido","MAI",0,0,{"$nulls":32},"ExIma",{"v":75980,"d":"75,980"},0]
["0501113","Cintigrafía vesícula y vía biliar","MAI",0,0,{"$nulls":32},"ExIma",{"v":85470,"d":"85,470"},0]
["0501114","Detección de sitio de sangramiento digestivo con glóbulos rojos marcados","MAI",0,0,{"$nulls":32},"ExIma",{"v":94970,"d":"94,970"},0]
["0501115","Detección divertículo Meckel","MAI",0,0,{"$nulls":32},"ExIma",{"v":28480,"d":"28,480"},0]
["0501116","Spect hepatoesplénico, evaluación hemangioma o hiperplasia (incluye mediciones fase precoz y tardía)","MAI",0,0,{"$nulls":32},"ExIma",{"v":85470,"d":"85,470"},0]
[null,"TOTAL",null,{"$f":"SUM(D907:D913)","v":0},{"$f":"SUM(E907:E913)","v":0},{"$f":"SUM(F907:F913)","v":0},{"$f":"SUM(G907:G913)","v":0},{"$f":"SUM(H907:H913)","v":0},{"$nulls":19},{"$f":"SUM(AB907:AB913)","v":0},0,0,{"$f":"SUM(AE907:AE913)","v":0},0,0,0,0,0,0,null,{"v":441580,"d":"441,580"},0]
[null,"6.- ESTUDIOS PULMONARES (dinámicos)"]
["0501122","Cintigrafía pulmonar perfusión o ventilación o difusión, c/u","MAI",0,0,{"$nulls":32},"ExIma",{"v":28480,"d":"28,480"},{"$f":"AM916*F916","v":0}]
["0501123","Cintigrafía y estudio aspiración pulmonar","MAI",0,0,{"$nulls":32},"ExIma",{"v":28480,"d":"28,480"},0]
[null,"TOTAL",null,{"$f":"SUM(D916:D917)","v":0},{"$f":"SUM(E916:E917)","v":0},{"$f":"SUM(F916:F917)","v":0},{"$f":"SUM(G916:G917)","v":0},{"$f":"SUM(H916:H917)","v":0},{"$nulls":19},{"$f":"SUM(AB916:AB917)","v":0},0,0,{"$f":"SUM(AE916:AE917)","v":0},0,0,0,0,0,0,null,{"v":56960,"d":"56,960"},0]
[null,"7.- ESTUDIOS SISTEMA NERVIOSO CENTRAL"]
["0501124","Spect cerebral de perfusión (no incluye radiofármaco)","MAI",0,0,{"$nulls":32},"ExIma",{"v":56980,"d":"56,980"},0]
["0501125","Estudio dinámico sistema nervioso (radiocisternografia, fístula L.C.R, radioventriculografía, control válvula derivatíva, sub-durografía isotópica), c/u (no incluye procedimiento).","MAI",0,0,{"$nulls":32},"ExIma",{"v":56980,"d":"56,980"},0]
[null,"TOTAL",null,{"$f":"SUM(D920:D921)","v":0},{"$f":"SUM(E920:E921)","v":0},{"$f":"SUM(F920:F921)","v":0},{"$f":"SUM(G920:G921)","v":0},{"$f":"SUM(H920:H921)","v":0},{"$nulls":19},{"$f":"SUM(AB920:AB921)","v":0},{"$f":"SUM(AC920:AC921)","v":0},0,0,0,0,0,0,0,0,0,{"v":113960,"d":"113,960"},0]
[null,"8.- ESTUDIOS DE INFECCIONES"]
["0501126","Cintigrafía evaluación infecciones (leucocitos, infecton, granulocitos u otros) (no incluye radiofármaco ni procedimiento).","MAI",0,0,{"$nulls":32},"ExIma",{"v":56980,"d":"56,980"},0]
["0501127","Cintigrafía con galio-67 planar infección (no incluye radioisótopo) (a.c. 0501133, cuando corresponda)","MAI",0,0,{"$nulls":32},"ExIma",{"v":56980,"d":"56,980"},0]
[null,"TOTAL",null,{"$f":"SUM(D924:D925)","v":0},{"$f":"SUM(E924:E925)","v":0},{"$f":"SUM(F924:F925)","v":0},{"$f":"SUM(G924:G925)","v":0},{"$f":"SUM(H924:H925)","v":0},{"$nulls":19},{"$f":"SUM(AB924:AB925)","v":0},0,0,{"$f":"SUM(AE924:AE925)","v":0},0,0,0,0,0,0,null,{"v":113960,"d":"113,960"},0]
[null,"9.- ESTUDIOS ONCOLÓGICOS"]
["0501128","Detección y/o marcación de ganglio centinela, no incluye, punción ni detección con gammaprobe","MAI",0,0,{"$nulls":32},"ExIma",{"v":56980,"d":"56,980"},0]
["0501129","Cintigrafía con galio-67 planar y Spect, para estudio de tumores (no incluye radioisótopo)","MAI",0,0,{"$nulls":32},"ExIma",{"v":142430,"d":"142,430"},0]
["0501130","Exploración sistémica con I-131 (incluye mediciones fase precoz y tardía)","MAI",0,0,{"$nulls":32},"ExIma",{"v":85470,"d":"85,470"},0]
["0501131","Estudio glándulas mamarias (mamocintigrafia) (no incluye MIBI)","MAI",0,0,{"$nulls":32},"ExIma",{"v":37970,"d":"37,970"},0]
["0501132","Estudio de tumores (anticuerpos monoclonales, octreoscan, DMSA pentavalente, prostacint u otros) (no incluye radioisótopo)","MAI",0,0,{"$nulls":32},"ExIma",{"v":113940,"d":"113,940"},0]
["0501133","Spect - Tomografía por emisión foton único, cualquier órgano (no incluye radioisótopo)","MAI",0,0,{"$nulls":32},"ExIma",{"v":42730,"d":"42,730"},0]
[null,"TOTAL",null,{"$f":"SUM(D928:D933)","v":0},{"$f":"SUM(E928:E933)","v":0},{"$f":"SUM(F928:F933)","v":0},{"$f":"SUM(G928:G933)","v":0},{"$f":"SUM(H928:H933)","v":0},{"$nulls":19},{"$f":"SUM(AB928:AB933)","v":0},0,0,{"$f":"SUM(AE928:AE933)","v":0},0,0,0,0,0,0,null,{"v":479520,"d":"479,520"},0]
[null,"10.- DENSITOMETRÍA OSEA"]
["0501134","Densitometría ósea a fotón doble, columna y cadera (unilateral o bilateral) o cuerpo entero","MAI",0,0,{"$nulls":32},"ExIma",{"v":28850,"d":"28,850"},0]
[null,"TOTAL",null,{"$f":"D936","v":0},{"$f":"E936","v":0},{"$f":"F936","v":0},{"$f":"G936","v":0},{"$f":"H936","v":0},{"$nulls":19},{"$f":"AB936","v":0},0,0,0,0,0,0,0,0,0,null,{"v":28850,"d":"28,850"},0]
[null,"B.PROCEDIMIENTOS TERAPEUTICOS.                      "]
[null,"I. RADIOISOTOPOS"]
["0502001","Dosis terapéuticas con I-131 hasta 30 mCi.","MAI",{"$f":"SUM(E940+H940)","v":0},{"$f":"SUM(F940:G940)","v":0},{"$nulls":32},"Proc",{"v":66460,"d":"66,460"},0]
["0502002","Dosis terapéuticas con I-131 entre 31 a 100 mCi.","MAI",0,0,{"$nulls":32},"Proc",{"v":128190,"d":"128,190"},0]
["0502003","Dosis terapéuticas con I-131 entre 101 a 200 mCi.","MAI",0,0,{"$nulls":32},"Proc",{"v":227920,"d":"227,920"},0]
["0502004","Dosis terapéuticas con I-131 entre 201 a 300 mCi.","MAI",0,0,{"$nulls":32},"Proc",{"v":327570,"d":"327,570"},0]
["0502005","Terapia paliativa del dolor con radioisótopos (no incluye radiofármaco)","MAI",0,0,{"$nulls":32},"Proc",{"v":28480,"d":"28,480"},0]
[null,"TOTAL",null,{"$f":"SUM(D940:D944)","v":0},{"$f":"SUM(E940:E944)","v":0},{"$f":"SUM(F940:F944)","v":0},{"$f":"SUM(G940:G944)","v":0},{"$f":"SUM(H940:H944)","v":0},{"$nulls":19},{"$f":"SUM(AB940:AB944)","v":0},{"$f":"SUM(AC940:AC944)","v":0},{"$f":"SUM(AD940:AD944)","v":0},{"$f":"SUM(AE940:AE944)","v":0},0,0,0,0,0,0,0,{"v":778620,"d":"778,620"},0]
[null,"II.RADIOTERAPIA                                                                                        "]
[null,"BRAQUITERAPIA"]
["0503001","Endocavitaria o intersticial (radium, cesio o iridium)","MAI",0,0,{"$nulls":32},"Proc",{"v":183360,"d":"183,360"},0]
["0503003","Superficial (estroncio)","MAI",0,0,{"$nulls":32},"Proc",{"v":63810,"d":"63,810"},0]
[null,"TOTAL",null,{"$f":"SUM(D948:D949)","v":0},{"$f":"SUM(E948:E949)","v":0},{"$f":"SUM(F948:F949)","v":0},{"$f":"SUM(G948:G949)","v":0},{"$f":"SUM(H948:H949)","v":0},{"$nulls":19},{"$f":"SUM(AB948:AB949)","v":0},0,0,{"$f":"SUM(AE948:AE949)","v":0},0,0,0,0,0,0,0,{"v":247170,"d":"247,170"},0]
[null,"RADIOTERAPIA CON ACELERADOR LINEAL DE ELECTRONES                                  "]
["0504001","Cáncer de esófago pre o postoperatorio","MAI",0,0,{"$nulls":32},"Proc",{"v":447220,"d":"447,220"},0]
["0504002","Cáncer de esófago sin intervención quir.","MAI",0,0,{"$nulls":32},"Proc",{"v":505440,"d":"505,440"},0]
["0504003","Cáncer de mama sin intervención quir.","MAI",0,0,{"$nulls":32},"Proc",{"v":563540,"d":"563,540"},0]
["0504004","Radioterapia, cáncer de mama, trat. Postoperatorio (tumorectomía; mastectomía parcial, total o radical)","MAI",0,0,{"$nulls":32},"Proc",{"v":505440,"d":"505,440"},0]
["0504005","Cáncer de órganos de abdomen y/o pelvis, excepto útero","MAI",0,0,{"$nulls":32},"Proc",{"v":563540,"d":"563,540"},0]
["0504006","Cáncer de órganos de cabeza y/o cuello","MAI",0,0,{"$nulls":32},"Proc",{"v":505440,"d":"505,440"},0]
["0504007","Cáncer de piel","MAI",0,0,{"$nulls":32},"Proc",{"v":447220,"d":"447,220"},0]
["0504008","Cáncer de pulmón o esófago torácico","MAI",0,0,{"$nulls":32},"Proc",{"v":505440,"d":"505,440"},0]
["0504009","Cáncer de testículo","MAI",0,0,{"$nulls":32},"Proc",{"v":447220,"d":"447,220"},0]
["0504010","Cáncer uterino (cuello y/o endometrio)","MAI",0,0,{"$nulls":32},"Proc",{"v":563540,"d":"563,540"},0]
["0504011","Leucemia tratamiento de","MAI",0,0,{"$nulls":32},"Proc",{"v":330820,"d":"330,820"},0]
["0504012","Linfoma maligno irradiación ganglionar total","MAI",0,0,{"$nulls":32},"Proc",{"v":894230,"d":"894,230"},0]
["0504013","Linfomas malignos, trat. parcial","MAI",0,0,{"$nulls":32},"Proc",{"v":447220,"d":"447,220"},0]
["0504014","Paliativo en cáncer metastásico (cualquier localización) (mínimo 2.500 rads. en cada zona anatómica simultánea)","MAI",0,0,{"$nulls":32},"Proc",{"v":272810,"d":"272,810"},0]
["0504015","Sarcoma óseo o de partes blandas","MAI",0,0,{"$nulls":32},"Proc",{"v":505440,"d":"505,440"},0]
["0504016","Tumores del sistema nervioso central","MAI",0,0,{"$nulls":32},"Proc",{"v":505440,"d":"505,440"},0]
[null,"TOTAL",null,{"$f":"SUM(D952:D967)","v":0},{"$f":"SUM(E952:E967)","v":0},{"$f":"SUM(F952:F967)","v":0},{"$f":"SUM(G952:G967)","v":0},{"$f":"SUM(H952:H967)","v":0},{"$nulls":19},{"$f":"SUM(AB952:AB967)","v":0},0,0,{"$f":"SUM(AE952:AE967)","v":0},0,0,0,0,0,0,null,{"v":8010000,"d":"8,010,000"},0]
[null,"TELECOBALTOTERAPIA                                        "]
["0505001","Cáncer de esófago pre o postoperatorio","MAI",0,0,{"$nulls":32},"Proc",{"v":355930,"d":"355,930"},0]
["0505002","Cáncer de esófago sin intervención quir.","MAI",0,0,{"$nulls":32},"Proc",{"v":402160,"d":"402,160"},0]
["0505003","Cáncer de mama, trat. postoperatorio (tumorectomía; mastectomía parcial, total o radical)","MAI",0,0,{"$nulls":32},"Proc",{"v":448420,"d":"448,420"},0]
["0505004","Cáncer de mama sin intervención quir.","MAI",0,0,{"$nulls":32},"Proc",{"v":402160,"d":"402,160"},0]
["0505005","Cáncer de órganos de abdomen y/o pelvis, excepto útero","MAI",0,0,{"$nulls":32},"Proc",{"v":448420,"d":"448,420"},0]
["0505006","Cáncer de órganos de cabeza y cuello","MAI",0,0,{"$nulls":32},"Proc",{"v":402160,"d":"402,160"},0]
["0505007","Cáncer de piel","MAI",0,0,{"$nulls":32},"Proc",{"v":355930,"d":"355,930"},0]
["0505008","Cáncer de pulmón o esófago torácico","MAI",0,0,{"$nulls":32},"Proc",{"v":402160,"d":"402,160"},0]
["0505009","Cáncer de testículo","MAI",0,0,{"$nulls":32},"Proc",{"v":355930,"d":"355,930"},0]
["0505010","Cáncer uterino (cuello y/o endometrio)","MAI",0,0,{"$nulls":32},"Proc",{"v":448420,"d":"448,420"},0]
["0505011","Leucemia, trat. de","MAI",0,0,{"$nulls":32},"Proc",{"v":263250,"d":"263,250"},0]
["0505012","Linfoma maligno irradiación ganglionar total","MAI",0,0,{"$nulls":32},"Proc",{"v":711660,"d":"711,660"},0]
["0505013","Linfomas malignos, trat. parcial","MAI",0,0,{"$nulls":32},"Proc",{"v":355930,"d":"355,930"},0]
["0505014","Paliativo en cáncer metastásico (cualquier localización) mínimo 2.500 rads en cada zona anatómica simultánea","MAI",0,0,{"$nulls":32},"Proc",{"v":217040,"d":"217,040"},0]
["0505015","Sarcoma óseo o de partes blandas","MAI",0,0,{"$nulls":32},"Proc",{"v":402160,"d":"402,160"},0]
["0505016","Tumores del sistema nervioso central","MAI",0,0,{"$nulls":32},"Proc",{"v":402160,"d":"402,160"},0]
[null,"TOTAL",null,{"$f":"SUM(D970:D985)","v":0},{"$f":"SUM(E970:E985)","v":0},{"$f":"SUM(F970:F985)","v":0},{"$f":"SUM(G970:G985)","v":0},{"$f":"SUM(H970:H985)","v":0},{"$nulls":19},{"$f":"SUM(AB970:AB985)","v":0},0,0,{"$f":"SUM(AE970:AE985)","v":0},0,0,0,0,0,0,0,{"v":6373890,"d":"6,373,890"},0]
[null,"KINESIOLOGIA Y FISIOTERAPIA "]
["0601001","Evaluación kinesiológica: muscular, articular, postural, neurológica y funcional (máximo 2 por tratamiento)","MLE",0,0,{"$nulls":32},"Proc"]
["0601003","Evaluación Biomecánica instrumental","MLE",0,0,{"$nulls":32},"Proc"]
["0601004","Piscina temperada (incluye ejercicios) (proc.aut.)","MLE",0,0,{"$nulls":32},"Proc"]
["0601005","Radiación infrarroja, horno, baño parafina, compresas húmedas, c/u (proc.aut.)","MLE",0,0,{"$nulls":32},"Proc"]
["0601006","Tanque de Hubbard con ejercicios (hiper o hipo-termal sobre 1.000 lts de capacidad) (proc.aut.)","MLE",0,0,{"$nulls":32},"Proc"]
["0601007","Turbión, tanque con remolino (hiper o hipotermal,baño de contraste) (proc.aut.)","MLE",0,0,{"$nulls":32},"Proc"]
["0601010","Terapia por radiación ultravioleta. (proc.aut.)","MLE",0,0,{"$nulls":32},"Proc"]
["0601008","Laserterapia (proc.aut.)","MLE",0,0,{"$nulls":32},"Proc"]
["0601009","Onda corta (ultratermia), microondas, c/u (proc.aut.)","MLE",0,0,{"$nulls":32},"Proc"]
["0601011","Terapia por ondas mecánicas (proc. aut.)","MLE",0,0,{"$nulls":32},"Proc"]
["0601012","Analgesia transcutánea (TENS) (proc.aut.)","MLE",0,0,{"$nulls":32},"Proc"]
["0601013","Estimulación eléctrica (interferencial, diadinámicas, exponenciales, galvánica, faradica, ultraexcitante) (proc.aut.)","MLE",0,0,{"$nulls":32},"Proc"]
["0601014"," Iontoforesis (proc.aut.)","MLE",0,0,{"$nulls":32},"Proc"]
["0601015","Retroalimentación neuromuscular (miofeedback) (proc.aut.)","MLE",0,0,{"$nulls":32},"Proc"]
["0601016","Compresión neumática (masaje compresivo) (proc.aut.)","MLE",0,0,{"$nulls":32},"Proc"]
["0601027","Tracción cervical y/o lumbar (mecánica o manual) (proc.aut.)","MLE",0,0,{"$nulls":32},"Proc"]
["0601029","Atención kinesiológica integral","MLE",0,0,{"$nulls":32},"Proc"]
["0601017"," Ejercicios respiratorios y procedimientos de kinesiterápia torácica (ventilación pulmonar localizada, estimulación de la tos, bloqueos torácicos, vibraciones, percusiones y tapoteos) (proc.aut.)","MLE",0,0,{"$nulls":32},"Proc"]
["0601028","Entrenamiento cardiorespiratorio funcional","MLE",0,0,{"$nulls":32},"Proc"]
["0601018","Prueba de esfuerzo o Entrenamiento ergométrico (porc.aut.)","MLE",{"$f":"SUM(E1007+H1007)","v":0},{"$f":"SUM(F1007:G1007)","v":0},{"$nulls":32},"Proc"]
["0601019","Entrenamiento funcional con ayudas técnicas (órtesis, ayudas de desplazamiento, etc.) (proc.aut.)","MLE",0,0,{"$nulls":32},"Proc"]
["0601020","Entrenamiento protésico extremidades (proc.aut.)","MLE",0,0,{"$nulls":32},"Proc"]
["0601021","Manipulación osteopática (liberación articular, manipulación vertebral) (proc.aut.)","MLE",0,0,{"$nulls":32},"Proc"]
["0601022","Masoterapia, por sesión (proc.aut.)","MLE",0,0,{"$nulls":32},"Proc"]
["0601023","Orientación y entrenamiento de personas con baja visión o con ceguera (proc.aut.)","MLE",0,0,{"$nulls":32},"Proc"]
["0601024","Reeducación motriz (ejercicios terapéuticos para recuperación muscular, capacidad de trabajo, coordinación, gimnasia ortopédica, reeducación funcional, de marcha) (individual y por sesión, mínimo 30 minutos) (proc.aut.)","MLE",0,0,{"$nulls":32},"Proc"]
["0601025","Técnicas de facilitación, técnicas de inhibición  (Kabat y/o Bobath) (proc.aut.)","MLE",0,0,{"$nulls":32},"Proc"]
["0601026","Técnicas de relajación (entrenamiento autógeno Schultz - Jacobson o similar) (proc.aut.)","MLE",0,0,{"$nulls":32},"Proc"]
["0601030","Maniobras permeabilización de la vía aérea (proc.aut.)","MLE",0,0,{"$nulls":32},"Proc"]
["0601031","Atención kinesiológica integral, al enfermo hosp. en UTI o Intermedio (máx. 1 diaria)","MLE",0,0,{"$nulls":32},"Proc"]
["0601171","Asistencia en IOT, VMNI, cambio de cánula de traqueostomía",null,0,0,{"$nulls":32},"Proc"]
["0601181","Entrenamiento ortostático en mesa basculante",null,0,0,{"$nulls":32},"Proc"]
["0102503","Evaluación de la deglución",null,0,0,{"$nulls":32},"Proc"]
["0102504","Rehabilitación de la deglución ",null,0,0,{"$nulls":32},"Proc"]
["0102501","Reeducación de la tos y respiración en pacientes con traqueostomía",null,0,0,{"$nulls":32},"Proc"]
["0102505","Evaluación de funciones cognitivas",null,0,0,{"$nulls":32},"Proc"]
["0102506","Rehabilitación de funciones cognitivas",null,0,0,{"$nulls":32},"Proc"]
[null,"Deep oscilación",null,0,0,{"$nulls":32},"Proc"]
[null,"Plataforma Vibratoria",null,0,0,{"$nulls":32},"Proc"]
[null,"Rehabilitación  virtual en BRU",null,0,0,{"$nulls":32},"Proc"]
[null,"Vocastim",null,0,0,{"$nulls":32},"Proc"]
[null,"Prueba de tolerancia ortostática",null,0,0,{"$nulls":32},"Proc"]
[null,"Rehabilitación vestibular",null,0,0,{"$nulls":32},"Proc"]
[null,"Asistencia bloqueo espasticidad",null,0,0,{"$nulls":32},"Proc"]
[null,"Punción seca",null,0,0,{"$nulls":32},"Proc"]
[null,"Neurodinamia",null,0,0,{"$nulls":32},"Proc"]
[null,"Entrenamiento ortésico de gran incapacitado",null,0,0,{"$nulls":32},"Proc"]
[null,"Evaluación  y rehabilitación en actividades de la vida diaria",null,0,0,{"$nulls":32},"Proc"]
[null,"Evaluación funcional",null,0,0,{"$nulls":32},"Proc"]
[null,"Habilitación y rehabilitación laboral",null,0,0,{"$nulls":32},"Proc"]
[null,"Habilitación y rehabilitación educacional",null,0,0,{"$nulls":32},"Proc"]
[null,"Integración sensorial",null,0,0,{"$nulls":32},"Proc"]
[null,"Evaluación de deglución",null,0,0,{"$nulls":32},"Proc"]
[null,"Manejo de trastorno de deglución",null,0,0,{"$nulls":32},"Proc"]
[null,"Infiltración intraneuromuscular (fenol y toxina botulínica)",null,0,0,{"$nulls":32},"Proc"]
[null,"Estimulación cognitiva grupal",null,0,0,{"$nulls":32},"Proc"]
[null,"Estimulación magnética",null,0,0,{"$nulls":32},"Proc"]
[null,"Atención integral en demencia",null,0,0,{"$nulls":32},"Proc"]
[null,"Entrenamiento ortésico de gran incapacitado (proc.aut) ",null,0,0,{"$nulls":32},"Proc"]
[null,"TOTAL",null,{"$f":"SUM(D988:D1046)","v":0},{"$f":"SUM(E988:E1046)","v":0},0,0,0,{"$nulls":19},0,{"$f":"SUM(AC988:AC1046)","v":0},0,0,0,0,0,0,0,0,0]
[null," GRUPO 07 : MEDICINA TRANSFUSIONAL "]
["0702001","Preparación de glóbulos rojos, plasma, plaquetas o crioprecipitados (incluye entrevista, selección del donante y la preparación del respectivo hemocomponente)","MAI",0,0,{"$nulls":32},"Proc",{"v":8700,"d":"8,700"},{"$f":"AM1049*F1049","v":0}]
["0702002","Obtención y preparación automatizada de plaquetas en donante único, con máquina separadora celular (proc. completo)","MAI",0,0,{"$nulls":32},"Proc",{"v":212100,"d":"212,100"},{"$f":"AM1050*F1050","v":0}]
["0702003","Set de  Exámenes por unidad de  Glóbulos   Rojos transfundida (incluye clasificación ABO y Rho, VDRL, HIV, virus hepatitis B antígeno de superficie, anticuerpos de hepatitis  C,   HTLV - I y II,   Chagas,  prueba  de compatibilidad  eritrocitaria)  ","MAI",0,0,{"$nulls":32},"Proc",{"v":11920,"d":"11,920"},{"$f":"AM1051*F1051","v":0}]
["0702004","Set de Exámenes por unidad transfundida de Plasma o de Plaquetas o de Crioprecipitados, c/u (incluye clasificación ABO y Rho, VDRL, HIV, virus hepatitis B antígeno de superficie, anticuerpos de hepatitis C, HTLV - I y II, Chagas)","MAI",0,0,{"$nulls":32},"Proc",{"v":9880,"d":"9,880"},{"$f":"AM1052*F1052","v":0}]
["0702005","Prueba de compatibilidad por unidad de globulos rojos (proc.aut.)","MAI",0,0,{"$nulls":32},"Proc",{"v":1560,"d":"1,560"},{"$f":"AM1053*F1053","v":0}]
["0702006","Transfusión en adulto (atención ambulatoria, atención cerrada siempre que la administración sea controlada por profesional especialista, tecnólogo médico o médico responsable) ","MAI",0,0,{"$nulls":32},"Proc",{"v":6160,"d":"6,160"},{"$f":"AM1054*F1054","v":0}]
["0702007","Transfusión en niño (atención ambulatoria, atención cerrada siempre que la administración sea controlada por profesional especialista, tecnólogo médico o médico responsable) ","MAI",0,0,{"$nulls":32},"Proc",{"v":7140,"d":"7,140"},0]
["0702008","Transfusión en adulto o niño en pabellón (con asistencia permanente del médico o tecnólogo médico responsable) (no corresponde su cobro cuando sea controlada por médico anestesista, por estar incluida en el valor de sus honorarios)","MAI",0,0,{"$nulls":32},"Proc",{"v":10530,"d":"10,530"},0]
["0702009","Exsanguíneo transfusión en recién nacido por vía umbilical (incluye proc. completo de extracción y administración, además del set de exámenes previos a la transfusión)","MAI",0,0,{"$nulls":32},"Proc",{"v":47750,"d":"47,750"},0]
["0702010","Exsanguíneo transfusión en adulto o niño (incluye proc. completo de extracción al receptor y administración al mismo, además del set de exámenes previos a la transfusión)","MAI",0,0,{"$nulls":32},"Proc",{"v":27510,"d":"27,510"},0]
["0702011","Autotransfusión-Predepósito (incluye proc. completo, además de  los exámenes previos) (corresponde cobro de una prestación para extracción de 2 a 4 unidades de sangre o hemocomponentes) ","MAI",0,0,{"$nulls":32},"Proc",{"v":40170,"d":"40,170"},0]
["0702012","Sangría (considera el cobro de una prestación por cada unidad de sangre extraída)","MAI",0,0,{"$nulls":32},"Proc",{"v":5720,"d":"5,720"},0]
["0702013","Hemaféresis  procedimiento manual (incluye proc. completo)","MAI",0,0,{"$nulls":32},"Proc",{"v":18260,"d":"18,260"},0]
["0702014","Hemaféresis procedimiento con máquina separadora celular  (incluye proc.  Completo)","MAI",0,0,{"$nulls":32},"Proc",{"v":196160,"d":"196,160"},0]
[null,"TOTAL",null,{"$f":"SUM(D1049:D1062)","v":0},{"$f":"SUM(E1049:E1062)","v":0},{"$f":"SUM(F1049:F1062)","v":0},{"$f":"SUM(G1049:G1062)","v":0},{"$f":"SUM(H1049:H1062)","v":0},{"$nulls":19},{"$f":"SUM(AB1049:AB1062)","v":0},0,0,{"$f":"SUM(AE1049:AE1062)","v":0},0,0,0,0,0,0,null,{"v":603560,"d":"603,560"},0]
[null,"GRUPO 08 : ANATOMIA PATOLOGICA                                     "]
["0801001","Citodiagnóstico corriente, exfoliativa (Papanicolau y similares) (por cada órgano)","MAI",0,0,{"$nulls":32},"Proc",{"v":5260,"d":"5,260"},0]
["0801002","Citología aspirativa (por punción); por cada órgano","MAI",0,0,{"$nulls":32},"Proc",{"v":7820,"d":"7,820"},0]
["0801003","Estudio histopatológico con microscopía electrónica (por cada órgano)","MAI",0,0,{"$nulls":32},"Proc",{"v":24570,"d":"24,570"},0]
["0801004","Estudio histopatológico con técnicas de inmunohistoquímica o inmunofluorescencia (por cada órgano)","MAI",0,0,{"$nulls":32},"Proc",{"v":21300,"d":"21,300"},0]
["0801005","Estudio histopatológico con técnicas histoquímicas especiales (incluye descalcificación) (por cada órgano)","MAI",0,0,{"$nulls":32},"Proc",{"v":16010,"d":"16,010"},0]
["0801006","Estudio histopatológico de biopsia  contemporánea (rápida) a intervenciones quirúrgicas (por cada órgano) (no incluye biopsia diferida)","MAI",0,0,{"$nulls":32},"Proc",{"v":21300,"d":"21,300"},0]
["0801007","Estudio histopatológico con tinción corriente de biopsia diferida con estudio seriado (mínimo 10 muestras) de un órgano o parte de él (no incluye estudio con técnica habitual de otros órganos incluidos en la muestra)","MAI",0,0,{"$nulls":32},"Proc",{"v":21300,"d":"21,300"},0]
["0801008","Estudio histopatológico corriente de biopsia diferida (por cada órgano)","MAI",0,0,{"$nulls":32},"Proc",{"v":10740,"d":"10,740"},0]
["0801009","Necropsia de adulto o niño, con estudio histopatológico corriente","MAI",{"$f":"SUM(E1073+H1073)","v":0},{"$f":"SUM(F1073:G1073)","v":0},{"$nulls":32},"Proc",{"v":58590,"d":"58,590"},0]
["0801010","Necropsia de feto o recién nacido, con estudio histopatológico corriente","MAI",0,0,{"$nulls":32},"Proc",{"v":46830,"d":"46,830"},0]
[null,"TOTAL",null,{"$f":"SUM(D1065:D1074)","v":0},{"$f":"SUM(E1065:E1074)","v":0},{"$f":"SUM(F1065:F1074)","v":0},{"$f":"SUM(G1065:G1074)","v":0},{"$f":"SUM(H1065:H1074)","v":0},{"$nulls":19},{"$f":"SUM(AB1065:AB1074)","v":0},0,0,{"$f":"SUM(AE1065:AE1074)","v":0},0,0,0,0,0,0,null,{"v":233720,"d":"233,720"},0]
[null,"PSIQUIATRIA Y PSICOLOGIA CLINICA     "]
["0901002","Desintoxicación o deshabituación en pacientes hospitalizados (incluye tratamiento de la intoxicación, del síndrome de privación y de las complicaciones médicas); por día ( máximo 15 )","MLE"]
[null,"TOTAL",null,{"$f":"D1077","v":0},{"$f":"E1077","v":0},{"$f":"F1077","v":0},{"$f":"G1077","v":0},{"$f":"H1077","v":0},{"$nulls":19},{"$f":"AB1077","v":0},0,0,{"$f":"AE1077","v":0},0,0,0,0,0,0,null,0,0]
[null,"OTRAS"]
["0901001","Control paciente psiquiátrico crónico;máx.2 controles al mes","MLE",0,0,{"$nulls":32},"Ctrl"]
["0901003","Electroshocks e insulino-terapia (efectuada y controlada por el médico psiquiatra, incluye trat. de las complicaciones médicas, c/s miorrelajantes); cada sesión (máx.6)","MLE",0,0,{"$nulls":32},"Proc"]
["0901004","Prueba aversiva con disulfirano o similares (cualquiera) (máx. 1)","MLE",0,0,{"$nulls":32},"Proc"]
["0901005","Atención psiquiátrica o psicoterapia de familia, individual, de relajación o de manejo (con familia u otros);(cada sesión mínimo 45')","MLE",0,0,{"$nulls":32},"Aten"]
["0901006","Terapia aversiva con fármacos, c/sesión (máx. 15)","MLE",0,0,{"$nulls":32},"Aten"]
["0901009","Evaluación psiquiátrica previa a terapia (1ra. consulta).","MLE",0,0,{"$nulls":32},"Aten"]
["0901010","Psicoterapia de pareja (por cada miembro de la pareja)","MLE",0,0,{"$nulls":32},"Aten"]
["0902001","Consulta Psicólogo clínico (sesiones 45')","MLE",0,0,{"$nulls":32},"Cons"]
["0902002","Sesión de Psicoterapia individual","MLE",0,0,{"$nulls":32},"Aten"]
["0902003","Sesión de psicoterapia de pareja (con ambos miembros)","MLE",0,0,{"$nulls":32},"Aten"]
["0902010","Test de Rorschach","MLE",0,0,{"$nulls":32},"Proc"]
["0902011","Test de relaciones objetales","MLE",0,0,{"$nulls":32},"Proc"]
["0902012","Test de Apercepción Temática, T.A.T., C.A.T.-H o C.A.T.-A.","MLE",0,0,{"$nulls":32},"Proc"]
["0902013","Test de Edwards","MLE",0,0,{"$nulls":32},"Proc"]
["0902014","Test de M.M.P.I.","MLE",0,0,{"$nulls":32},"Proc"]
["0902015","Test de Weschler, WAIS, WISC ó WPPSI","MLE",0,0,{"$nulls":32},"Proc"]
["0902016","Test de Dominó o Test de Raven","MLE",0,0,{"$nulls":32},"Proc"]
["0902017","Test de Bender","MLE",0,0,{"$nulls":32},"Proc"]
["0902018","Bender Bip","MLE",0,0,{"$nulls":32},"Proc"]
["0902019","Test de Goldstein","MLE",0,0,{"$nulls":32},"Proc"]
["0902020","Test de Luria-Nebraska","MLE",0,0,{"$nulls":32},"Proc"]
[null,"TOTAL",null,{"$f":"SUM(D1080:D1100)","v":0},{"$f":"SUM(E1080:E1100)","v":0},{"$f":"SUM(F1080:F1100)","v":0},{"$f":"SUM(G1080:G1100)","v":0},{"$f":"SUM(H1080:H1100)","v":0},{"$nulls":19},{"$f":"SUM(AB1080:AB1100)","v":0},0,0,{"$f":"SUM(AE1080:AE1100)","v":0},0,0,0,0,0,0,0]
[null,"GRUPO 09 : PSIQUIATRIA Y SALUD MENTAL     "]
["0903001","Consulta de psiquiatría","MAI",0,0,{"$nulls":32},"Cons",{"v":7600,"d":"7,600"},0]
["0903002","Consulta o control por psicólogo clínico","MAI",0,0,{"$nulls":32},"Aten",{"v":2980,"d":"2,980"},0]
["0903003","Consulta de salud mental por otros profesionales","MAI",0,0,{"$nulls":32},"Cons",{"v":2980,"d":"2,980"},0]
["0903004","Intervención psicosocial grupal (4 a 8 pacientes, familiares o cuidadores)","MAI",0,0,{"$nulls":32},"Aten",{"v":11850,"d":"11,850"},0]
["0903005","Psicoterapia de grupo (por psicólogo o psiquiatra) (4 a 8 pacientes)","MAI",0,0,{"$nulls":32},"Aten",{"v":13870,"d":"13,870"},0]
["0903006","Consultoría de salud mental por psiquiatra (sesión 4 hrs.) (mínimo 8 pacientes)","MAI",0,0,{"$nulls":32},"Aten",{"v":31480,"d":"31,480"},0]
["0903007","Programa de rehabilitación tipo 1 (mensual, grupo 6 a 10 pers.)","MAI",0,0,{"$nulls":32},"Aten",{"v":4330,"d":"4,330"},0]
["0903008","Programa de rehabilitación tipo 2 (mensual, grupo 5 a 7 pers.)","MAI",0,0,{"$nulls":32},"Aten",{"v":10170,"d":"10,170"},0]
[null,"TOTAL",null,{"$f":"SUM(D1103:D1110)","v":0},{"$f":"SUM(E1103:E1110)","v":0},{"$f":"SUM(F1103:F1110)","v":0},{"$f":"SUM(G1103:G1110)","v":0},{"$f":"SUM(H1103:H1110)","v":0},{"$nulls":19},{"$f":"SUM(AB1103:AB1110)","v":0},0,0,{"$f":"SUM(AE1103:AE1110)","v":0},0,0,0,0,0,0,0,{"v":85260,"d":"85,260"},0]
[" ","PROCEDIMIENTOS DE NEUROLOGÍA"]
[null,"PROCEDIMIENTOS DIAGNOSTICOS                                 "]
[1101004,"E.E.G. de 16 o más canales (incluye el cód. 11-01-006)","MAI",0,0,{"$nulls":32},"Proc",{"v":15710,"d":"15,710"},0]
[1101006,"Electroencefalograma (E.E.G.) standard y/o activado \"sin privación de sueño\" (incluye mono y bipolares, hiperventilación, c/s reactividad auditiva, visual, lumínica, por drogas u otras). Equipo de 8 canales","MAI",0,0,{"$nulls":32},"Proc",{"v":12560,"d":"12,560"},0]
[1101113,"Angiografía cerebral digital por cateterización (incluye proc. radiológico,  medio de contraste e insumos)","MAI",0,0,{"$nulls":32},"Proc",{"v":426120,"d":"426,120"},0]
[1101140,"Esclerosis Múltiple Remitente Recurrente,  Tratamiento médico farmacológico  Anual (incluye inmunomoduladores)","MAI",0,0,{"$nulls":32},"Proc",{"v":9564730,"d":"9,564,730"},0]
[1101141,"Esclerosis Múltiple Remitente Recurrente, Tratamiento rehabilitación","MAI",0,0,{"$nulls":32},"Proc",{"v":245530,"d":"245,530"},0]
[1101142,"Esclerosis Múltiple Remitente Recurrente,  Tratamiento Brote","MAI",0,0,{"$nulls":32},"Proc",{"v":1119610,"d":"1,119,610"},0]
[null,"TOTAL",null,{"$f":"SUM(D1114:D1119)","v":0},{"$f":"SUM(E1114:E1119)","v":0},{"$f":"SUM(F1114:F1119)","v":0},{"$f":"SUM(G1114:G1119)","v":0},{"$f":"SUM(H1114:H1119)","v":0},{"$nulls":19},{"$f":"SUM(AB1114:AB1119)","v":0},0,0,0,0,0,0,0,0,0,0,{"v":11384260,"d":"11,384,260"},0]
[null,"OTROS PROCEDIMIENTOS DIAGNOSTICOS   "]
[1101001,"Intraventricular por fontanela, cisternal o latero-cervical alta o de hematoma intracraneal","MLE",0,0,{"$nulls":32},"Proc"]
[1101002,"Intraventricular por fontanela, cisternal o latero-cervical alta o de hematoma subdural","MLE",0,0,{"$nulls":32},"Proc"]
[1101003,"Lumbar c/s manometria c/s queckensted   ","MLE",0,0,{"$nulls":32},"Proc"]
[1101005,"Electrocorticografia","MLE",0,0,{"$nulls":32},"Proc"]
[1101007,"Estereo-electroencefalografia (incluye uno o mas electrodos","MLE",0,0,{"$nulls":32},"Proc"]
[1101008,"Monitoreo e.e.g. (electrodos implantados) por sesion.","MLE",0,0,{"$nulls":32},"Proc"]
[1101040,"E.E.G. Post-privacion de sueno (incluye codigo 11-01-006). Equipo de 8 canales","MLE",0,0,{"$nulls":32},"Proc"]
[1101041,"E.E.G. Post-privacion de sueno (incluye codigo 11-01-004) equipo de 16 o mas canales","MLE",0,0,{"$nulls":32},"Proc"]
[1101042,"E.E.G. Digital (con activaciones) 20 canales","MLE",0,0,{"$nulls":32},"Proc"]
[1101043,"E.E.G. Digital (con activaciones) 32 canales","MLE",0,0,{"$nulls":32},"Proc"]
[1101046,"Electroencefalograma digital de 32 canales con \"mapeo\"","MLE",0,0,{"$nulls":32},"Proc"]
[1101044,"Monitoreo e.e.g. Continuo de 24 hrs.","MLE",0,0,{"$nulls":32},"Proc"]
[1101045,"Polisomnografia (estudio poligrafico del sueno),","MLE",0,0,{"$nulls":32},"Proc"]
[1101009,"Electromiografia de fibra unica","MLE",0,0,{"$nulls":32},"Proc"]
[1101010,"Electromiografias cualquier region, por ej.: musculos faciales, faringe, paravertebrales, vejiga y perone, test de miastenia (incluye el estudio clinico y muestreo suficiente para diagnosticar naturaleza del trastorno y estado evolutivo), c/u","MLE",0,0,{"$nulls":32},"Proc"]
[1101011,"Potenciales evocados en corteza ( por ej.: auditivo, ocular","MLE",0,0,{"$nulls":32},"Proc"]
[1101012,"Velocidad de conduccion (incluye reflejo h, onda f y otros)","MLE",0,0,{"$nulls":32},"Proc"]
[1101013,"Carotida-vertebral por cateterizacion de la subclavia, axilar, humeral o femoral (a.c 04-02-029)","MLE",0,0,{"$nulls":32},"Proc"]
[1101015,"Flebografia orbitaria ( a.c. 04-02-040 )","MLE",0,0,{"$nulls":32},"Proc"]
[1101018,"Yugulografia ( a.c. 04-02-040 )","MLE",0,0,{"$nulls":32},"Proc"]
[1101019,"Neumoencefalografia fraccionada, por puncion lumbar","MLE",{"$f":"SUM(E1142+H1142)","v":0},{"$f":"SUM(F1142:G1142)","v":0},{"$nulls":32},"Proc"]
[1101020,"Neumoencefalografia p/puncion suboccipital( a.c. 04-02-045 )","MLE",0,0,{"$nulls":32},"Proc"]
[1101025,"Por puncion lumbar, con medio de contraste gaseoso o hidrosoluble (A.C. 04-02-049 O 04-02-050 S/corresp.)","MLE",0,0,{"$nulls":32},"Proc"]
[1101026,"Infiltraciones de nervios perifericos intramuscular (de punto motor)","MLE",0,0,{"$nulls":32},"Proc"]
[1101027,"Infiltraciones de nervios perifericos troncular","MLE",0,0,{"$nulls":32},"Proc"]
[1101028,"Infiltraciones de ramas del trigemino o del facial","MLE",0,0,{"$nulls":32},"Proc"]
[1101029,"Infiltraciones del ganglio estrellado","MLE",0,0,{"$nulls":32},"Proc"]
[1101030,"Infiltraciones epidural, cervical, lumbar o similares, cada sesion","MLE",0,0,{"$nulls":32},"Proc"]
[1101031,"Infiltraciones intercostales (cualquier numero)","MLE",0,0,{"$nulls":32},"Proc"]
[1101032,"Rizotomia quimica por medio de inyeccion intratecal.","MLE",0,0,{"$nulls":32},"Proc"]
[1101033,"Infiltraciones suboccipital u otros nervios cervicales","MLE",0,0,{"$nulls":32},"Proc"]
[1101034,"Alcoholización o fenolización de nervios periféricos intramuscular","MLE",0,0,{"$nulls":32},"Proc"]
[1101035,"Alcoholización o fenolización de nervios periféricos intratecal","MLE",0,0,{"$nulls":32},"Proc"]
[1101036,"Alcoholización o fenolización de nervios periféricos troncular","MLE",0,0,{"$nulls":32},"Proc"]
[1104100,"Embolizacion de malformaciones vasculares y otras terapias endovasculares cerebrales( exceptua tratamiento endovascular del aneurisma)",null,{"$f":"SUM(E1156+H1156)","v":0},{"$f":"SUM(F1156:G1156)","v":0},{"$nulls":32},"Proc"]
[1103000,"Tratamiento endovascular de aneurismas",null,0,0,{"$nulls":32},"Proc"]
[1103100,"Tratamiento endovascular de aneurisma no roto de alta complejidad ( 6 o mas coils, , dos o más anurismas, utilizacion de stent + coils (uno o mas), embolizacion con coils asistida con balon)",null,0,0,{"$nulls":32},"Proc"]
[5099018,"Inyeccion toxina botulinica",null,0,0,{"$nulls":32},"Proc"]
[5099019,"Inyeccion interferon",null,0,0,{"$nulls":32},"Proc"]
[5099113,"Infiltración  perineural",null,0,0,{"$nulls":32},"Proc"]
[5099112,"Infiltración intramuscular (Fenol y Toxina Botulínica)",null,0,0,{"$nulls":32},"Proc"]
[" 5099096 "," Neurologia-puncion lumbar ",null,0,0]
[null," Implantación estimulador vagal epilepsia refractaria menores de 15 años",null,0,0,{"$nulls":32},"Proc"]
[null,"Test de impulso cefálico",null,0,0,{"$nulls":32},"Proc"]
[null,"Bloqueo neuromuscular con Toxina Butolínica",null,0,0,{"$nulls":32},"Proc"]
[null,"Bloqueo neuromuscular con anestésico (manejo del dolor)",null,0,0,{"$nulls":32},"Proc"]
[null,"Instalación cateter medición de presión líquido cefalo raquídeo",null,0,0,{"$nulls":32},"Proc"]
[null,"Trombolisis de urgencia infarto cerebral",null,0,0,{"$nulls":32},"Proc"]
[null,"Angiografía medular",null,0,0,{"$nulls":32},"Proc"]
[null,"Embolización de Malformaciones arteriovenosas medulares",null,0,0,{"$nulls":32},"Proc"]
[null,"Tratamiento endovascular infarto cerebral (ACV)",null,0,0,{"$nulls":32},"Proc"]
[null,"Stent carotideo estenosis  carotidea cervical",null,0,0,{"$nulls":32},"Proc"]
[null,"TOTAL",null,{"$f":"SUM(D1122:D1173)","v":0},{"$f":"SUM(E1122:E1173)","v":0},0,0,0,{"$nulls":19},{"$f":"SUM(AB1122:AB1173)","v":0},0,0,0,0,0,0,0,0,0,0]
[null,"II.INTERVENCIONES QUIRURGICAS. NEUROCIRUGIA  "]
[1103001,"Aneurisma cirsoideo de cuero cabelludo, trat. quir.","MAI",{"$f":"SUM(J1176:O1176)","v":0},{"$nulls":4},{"$f":"+J1176+K1176","v":0},{"$nulls":6},{"$f":"SUM(Q1176:R1176)","v":0},null,null,{"$f":"SUM(T1176:U1176)","v":0},null,null,{"$f":"SUM(W1176:X1176)","v":0},null,null,{"$f":"SUM(Z1176:AA1176)","v":0},{"$nulls":12},"Cmay",{"v":158730,"d":"158,730"},{"$f":"AM1176*I1176","v":0},{"$f":"IF(D1176>=P1176 + S1176+ V1176 + Y1176,\"\",\"La suma no puede ser mayor al total\")","v":""}]
[1103002,"Sinus pericrani, trat. quir.","MAI",{"$f":"SUM(J1177:O1177)","v":0},{"$nulls":4},{"$f":"+J1177+K1177","v":0},{"$nulls":6},{"$f":"SUM(Q1177:R1177)","v":0},null,null,{"$f":"SUM(T1177:U1177)","v":0},null,null,{"$f":"SUM(W1177:X1177)","v":0},null,null,{"$f":"SUM(Z1177:AA1177)","v":0},{"$nulls":12},"Cmay",{"v":158730,"d":"158,730"},{"$f":"AM1177*I1177","v":0},{"$f":"IF(D1177>=P1177 + S1177+ V1177 + Y1177,\"\",\"La suma no puede ser mayor al total\")","v":""}]
[1103003,"Hundimiento simple, reparación de","MAI",0,{"$nulls":4},0,{"$nulls":6},0,null,null,0,null,null,0,null,null,0,{"$nulls":12},"Cmay",{"v":198060,"d":"198,060"},0,""]
[1103004,"Craneoplastía con autoinjerto","MAI",0,{"$nulls":4},0,{"$nulls":6},0,null,null,0,null,null,0,null,null,0,{"$nulls":12},"Cmay",{"v":379890,"d":"379,890"},0,""]
[1103005,"Craneoplastía con prótesis (no incluye valor de la prótesis)","MAI",0,{"$nulls":4},0,{"$nulls":6},0,null,null,0,null,null,0,null,null,0,{"$nulls":12},"Cmay",{"v":215950,"d":"215,950"},0,""]
[1103006,"Tumores de calota, extirp. de","MAI",0,{"$nulls":4},0,{"$nulls":6},0,null,null,0,null,null,0,null,null,0,{"$nulls":12},"Cmay",{"v":216230,"d":"216,230"},0,""]
[1103007,"Osteomielitis, limpieza quirúrgica","MAI",0,{"$nulls":4},0,{"$nulls":6},0,null,null,0,null,null,0,null,null,0,{"$nulls":12},"Cmay",{"v":198340,"d":"198,340"},0,""]
[1103008,"Craniectomías descompresivas","MAI",0,{"$nulls":4},0,{"$nulls":6},0,null,null,0,null,null,0,null,null,0,{"$nulls":12},"Cmay",{"v":243350,"d":"243,350"},0,""]
[1103009,"Reparación de fractura crecedora","MAI",0,{"$nulls":4},0,{"$nulls":6},0,null,null,0,null,null,0,null,null,0,{"$nulls":12},"Cmay",{"v":333750,"d":"333,750"},0,""]
[1103010,"Craneotomías lineales","MAI",0,{"$nulls":4},0,{"$nulls":6},0,null,null,0,null,null,0,null,null,0,{"$nulls":12},"Cmay",{"v":396550,"d":"396,550"},0,""]
[1103011,"Craniectomías c/s remodelación ósea","MAI",0,{"$nulls":4},0,{"$nulls":6},0,null,null,0,null,null,0,null,null,0,{"$nulls":12},"Cmay",{"v":608860,"d":"608,860"},0,""]
[1103012,"Honorarios del 1er. cirujano responsable y sus ayudantes","MAI",0,{"$nulls":4},0,{"$nulls":6},0,null,null,0,null,null,0,null,null,0,{"$nulls":12},"Cmay",{"v":654950,"d":"654,950"},0,""]
[1103013,"Honorarios c/u de los otros 1ros. cirujanos y ayudantes","MAI",0,{"$nulls":4},0,{"$nulls":6},0,null,null,0,null,null,0,null,null,0,{"$nulls":12},"Cmay",{"v":294140,"d":"294,140"},0,""]
[1103014,"Hematoma o absceso extradural, vaciamiento de","MAI",0,{"$nulls":4},0,{"$nulls":6},0,null,null,0,null,null,0,null,null,0,{"$nulls":12},"Cmay",{"v":370370,"d":"370,370"},0,""]
[1103015,"Reparación de fístula de LCR","MAI",0,{"$nulls":4},0,{"$nulls":6},0,null,null,0,null,null,0,null,null,0,{"$nulls":12},"Cmay",{"v":413640,"d":"413,640"},0,""]
[1103016,"Hematoma, empiema o colección subdural, vaciamiento de","MAI",0,{"$nulls":4},0,{"$nulls":6},0,null,null,0,null,null,0,null,null,0,{"$nulls":12},"Cmay",{"v":370370,"d":"370,370"},0,""]
[1103017,"Quistes aracnoidales encefálicos, trat. quir. (suprasellares, temporales, cerebelosos, etc.)","MAI",0,{"$nulls":4},0,{"$nulls":6},0,null,null,0,null,null,0,null,null,0,{"$nulls":12},"Cmay",{"v":414990,"d":"414,990"},0,""]
[1103018,"Ventriculostomía o instalación de derivativa ventricular externa o instalación de captor para medición de pic o punción biopsia o reservorio para administración de medicamentos","MAI",0,{"$nulls":4},0,{"$nulls":6},0,null,null,0,null,null,0,null,null,0,{"$nulls":12},"Cmay",{"v":198340,"d":"198,340"},0,""]
[1103019,"Absceso cerebral, trat. quir.","MAI",0,{"$nulls":4},0,{"$nulls":6},0,null,null,0,null,null,0,null,null,0,{"$nulls":12},"Cmay",{"v":517400,"d":"517,400"},0,""]
[1103020,"Herida por bala craneoencefálica y/o extirpación de cuerpo extraño","MAI",0,{"$nulls":4},0,{"$nulls":6},0,null,null,0,null,null,0,null,null,0,{"$nulls":12},"Cmay",{"v":327330,"d":"327,330"},0,""]
[1103021,"Hundimiento expuesto, repar. de","MAI",0,{"$nulls":4},0,{"$nulls":6},0,null,null,0,null,null,0,null,null,0,{"$nulls":12},"Cmay",{"v":261210,"d":"261,210"},0,""]
[1103022,"Lobectomías por contusión cerebral","MAI",0,{"$nulls":4},0,{"$nulls":6},0,null,null,0,null,null,0,null,null,0,{"$nulls":12},"Cmay",{"v":462310,"d":"462,310"},0,""]
[1103023,"Hematoma intracerebral, vaciamiento de","MAI",0,{"$nulls":4},0,{"$nulls":6},0,null,null,0,null,null,0,null,null,0,{"$nulls":12},"Cmay",{"v":436340,"d":"436,340"},0,""]
[1103024,"De base de cráneo","MAI",0,{"$nulls":4},0,{"$nulls":6},0,null,null,0,null,null,0,null,null,0,{"$nulls":12},"Cmay",{"v":894700,"d":"894,700"},0,""]
[1103025,"Intraorbitarios","MAI",0,{"$nulls":4},0,{"$nulls":6},0,null,null,0,null,null,0,null,null,0,{"$nulls":12},"Cmay",{"v":894700,"d":"894,700"},0,""]
[1103026,"Encefálicos y de hipófisis","MAI",0,{"$nulls":4},0,{"$nulls":6},0,null,null,0,null,null,0,null,null,0,{"$nulls":12},"Cmay",{"v":894700,"d":"894,700"},0,""]
[1103027,"Aneurismas, malformaciones arteriovenosas encefálicas u orbitarias, fístulas durales","MAI",0,{"$nulls":4},0,{"$nulls":6},0,null,null,0,null,null,0,null,null,0,{"$nulls":12},"Cmay",{"v":967970,"d":"967,970"},0,""]
[1103028,"Fístula carótido cavernosa tratamiento endovascular","MAI",0,{"$nulls":4},0,{"$nulls":6},0,null,null,0,null,null,0,null,null,0,{"$nulls":12},"Cmay",{"v":341730,"d":"341,730"},0,""]
[1103029,"Fístula carótido cavernosa, trat. quir.","MAI",0,{"$nulls":4},0,{"$nulls":6},0,null,null,0,null,null,0,null,null,0,{"$nulls":12},"Cmay",{"v":464920,"d":"464,920"},0,""]
[1103030,"Anastomosis y revascularización cerebral endodurosinangiosis","MAI",0,{"$nulls":4},0,{"$nulls":6},0,null,null,0,null,null,0,null,null,0,{"$nulls":12},"Cmay",{"v":370370,"d":"370,370"},0,""]
[1103031,"Anastomosis y revascularización cerebral extra-intracraneana (cirugía de carótida: ver Cirugía Vascular Periférica)","MAI",0,{"$nulls":4},0,{"$nulls":6},0,null,null,0,null,null,0,null,null,0,{"$nulls":12},"Cmay",{"v":694080,"d":"694,080"},0,""]
[1103032,"Instalación de derivativas de LCR (no incluye valor de la válvula)","MAI",0,{"$nulls":4},0,{"$nulls":6},0,null,null,0,null,null,0,null,null,0,{"$nulls":12},"Cmay",{"v":306580,"d":"306,580"},0,""]
[1103132,"Instalación de derivativas de LCR (incluye valor de la válvula)","MAI",0,{"$nulls":4},0,{"$nulls":6},0,null,null,0,null,null,0,null,null,0,{"$nulls":12},"Cmay",{"v":741500,"d":"741,500"},0,""]
[1103033,"Revisión o exteriorización de derivativa","MAI",0,{"$nulls":4},0,{"$nulls":6},0,null,null,0,null,null,0,null,null,0,{"$nulls":12},"Cmay",{"v":159020,"d":"159,020"},0,""]
[1103034,"Ventriculocisternostomía","MAI",0,{"$nulls":4},0,{"$nulls":6},0,null,null,0,null,null,0,null,null,0,{"$nulls":12},"Cmay",{"v":287220,"d":"287,220"},0,""]
[1103035,"Fenestración, septostomía o coagulación plexos coroídeos (trat. endoscópico)","MAI",0,{"$nulls":4},0,{"$nulls":6},0,null,null,0,null,null,0,null,null,0,{"$nulls":12},"Cmay",{"v":337620,"d":"337,620"},0,""]
[1103036,"Cirugía descompresiva de fosa posterior u occipito-vertebral en Arnol Chiari, siringomielia","MAI",0,{"$nulls":4},0,{"$nulls":6},0,null,null,0,null,null,0,null,null,0,{"$nulls":12},"Cmay",{"v":467560,"d":"467,560"},0,""]
[1103037,"Meningo y meningoencefalocele occipital, repar. de","MAI",0,{"$nulls":4},0,{"$nulls":6},0,null,null,0,null,null,0,null,null,0,{"$nulls":12},"Cmay",{"v":656770,"d":"656,770"},0,""]
[1103038,"Cirugía descompresiva neurovascular","MAI",0,{"$nulls":4},0,{"$nulls":6},0,null,null,0,null,null,0,null,null,0,{"$nulls":12},"Cmay",{"v":523660,"d":"523,660"},0,""]
[1103039,"Neurotomías","MAI",0,{"$nulls":4},0,{"$nulls":6},0,null,null,0,null,null,0,null,null,0,{"$nulls":12},"Cmay",{"v":188920,"d":"188,920"},0,""]
[1103040,"Neurolisis o microcompresión percutánea","MAI",0,{"$nulls":4},0,{"$nulls":6},0,null,null,0,null,null,0,null,null,0,{"$nulls":12},"Cmay",{"v":229990,"d":"229,990"},0,""]
[1103041,"Cirugía de la epilepsia (cualquier técnica)","MAI",0,{"$nulls":4},0,{"$nulls":6},0,null,null,0,null,null,0,null,null,0,{"$nulls":12},"Cmay",{"v":467560,"d":"467,560"},0,""]
[1103042,"Biopsia estereotáxica cerebral con marco de estereotaxia o neuronavegador","MAI",0,{"$nulls":4},0,{"$nulls":6},0,null,null,0,null,null,0,null,null,0,{"$nulls":12},"Cmay",{"v":509130,"d":"509,130"},0,""]
[1103043,"Coagulación de núcleos o vías encefálicas","MAI",0,{"$nulls":4},0,{"$nulls":6},0,null,null,0,null,null,0,null,null,0,{"$nulls":12},"Cmay",{"v":606600,"d":"606,600"},0,""]
[1103044,"Implantación de isótopos (braquiterapia) (no incluye valor del radiofármaco)","MAI",0,{"$nulls":4},0,{"$nulls":6},0,null,null,0,null,null,0,null,null,0,{"$nulls":12},"Cmay",{"v":509130,"d":"509,130"},0,""]
[1103045,"Implantación de estimuladores intracraneanos","MAI",0,{"$nulls":4},0,{"$nulls":6},0,null,null,0,null,null,0,null,null,0,{"$nulls":12},"Cmay",{"v":441530,"d":"441,530"},0,""]
[1103046,"Instalación de estimuladores medulares","MAI",0,{"$nulls":4},0,{"$nulls":6},0,null,null,0,null,null,0,null,null,0,{"$nulls":12},"Cmay",{"v":309180,"d":"309,180"},0,""]
[1103047,"Disrafias espinales: meningocele, mielomeningocele, diastematomielia, lipoma, lipomeningocele, médula anclada, etc.","MAI",0,{"$nulls":4},0,{"$nulls":6},0,null,null,0,null,null,0,null,null,0,{"$nulls":12},"Cmay",{"v":656770,"d":"656,770"},0,""]
[1103048,"Infiltracion facetaria columna y radicular","MAI",0,{"$nulls":4},0,{"$nulls":6},0,null,null,0,null,null,0,null,null,0,{"$nulls":12},"Cmay",{"v":188920,"d":"188,920"},0,""]
[1103049,"Hernia núcleo pulposo, estenorraquis, aracnoiditis, fibrosis perirradicular cervical, dorsal o lumbar, trat. quir.","MAI",0,{"$nulls":4},0,{"$nulls":6},0,null,null,0,null,null,0,null,null,0,{"$nulls":12},"Cmay",{"v":564510,"d":"564,510"},0,""]
[1103050,"Laminectomía descompresiva","MAI",0,{"$nulls":4},0,{"$nulls":6},0,null,null,0,null,null,0,null,null,0,{"$nulls":12},"Cmay",{"v":433910,"d":"433,910"},0,""]
[1103069,"Fijación de columna (cervical – dorsal – lumbar) cualquier vía abordaje, c/s osteosíntesis","MAI",0,{"$nulls":4},0,{"$nulls":6},0,null,null,0,null,null,0,null,null,0,{"$nulls":12},"Cmay",{"v":426950,"d":"426,950"},0,""]
[1103051,"Heridas raquimedulares, trat. quir.","MAI",0,{"$nulls":4},0,{"$nulls":6},0,null,null,0,null,null,0,null,null,0,{"$nulls":12},"Cmay",{"v":336890,"d":"336,890"},0,""]
[1103052,"Tumor vertebral, trat. quir.","MAI",0,{"$nulls":4},0,{"$nulls":6},0,null,null,0,null,null,0,null,null,0,{"$nulls":12},"Cmay",{"v":370370,"d":"370,370"},0,""]
[1103053,"Tumor o quiste medular o intrarraquídeo, trat. quir.","MAI",0,{"$nulls":4},0,{"$nulls":6},0,null,null,0,null,null,0,null,null,0,{"$nulls":12},"Cmay",{"v":476860,"d":"476,860"},0,""]
[1103054,"Malformación arteriovenosa o fístula dural medular, trat. quir.","MAI",0,{"$nulls":4},0,{"$nulls":6},0,null,null,0,null,null,0,null,null,0,{"$nulls":12},"Cmay",{"v":541290,"d":"541,290"},0,""]
[1103055,"Cordotomía percutánea","MAI",0,{"$nulls":4},0,{"$nulls":6},0,null,null,0,null,null,0,null,null,0,{"$nulls":12},"Cmay",{"v":239340,"d":"239,340"},0,""]
[1103056,"Mielotomía, DREZtomía","MAI",0,{"$nulls":4},0,{"$nulls":6},0,null,null,0,null,null,0,null,null,0,{"$nulls":12},"Cmay",{"v":394050,"d":"394,050"},0,""]
[1103057,"Rizotomía (cualquier técnica)","MAI",0,{"$nulls":4},0,{"$nulls":6},0,null,null,0,null,null,0,null,null,0,{"$nulls":12},"Cmay",{"v":309360,"d":"309,360"},0,""]
[1103058,"Tumor de nervio periférico, extirp. de","MAI",0,{"$nulls":4},0,{"$nulls":6},0,null,null,0,null,null,0,null,null,0,{"$nulls":12},"Cmay",{"v":164540,"d":"164,540"},0,""]
[1103059,"Reparación de plexos c/s neurotización con técnica microquirúrgica o injertos interfasciculares","MAI",0,{"$nulls":4},0,{"$nulls":6},0,null,null,0,null,null,0,null,null,0,{"$nulls":12},"Cmay",{"v":453470,"d":"453,470"},0,""]
[1103060,"Sección de nervio, reparación con injerto","MAI",0,{"$nulls":4},0,{"$nulls":6},0,null,null,0,null,null,0,null,null,0,{"$nulls":12},"Cmay",{"v":282000,"d":"282,000"},0,""]
[1103061,"Sección de nervio, reparación sin injerto","MAI",0,{"$nulls":4},0,{"$nulls":6},0,null,null,0,null,null,0,null,null,0,{"$nulls":12},"Cmay",{"v":219790,"d":"219,790"},0,""]
[1103068,"Neurectomía, cualquier localización, cada zona quirúrgica","MAI",0,{"$nulls":4},0,{"$nulls":6},0,null,null,0,null,null,0,null,null,0,{"$nulls":12},"Cmay",{"v":154710,"d":"154,710"},0,""]
[1103062,"Neurolisis con técnica microquirúrgica","MAI",0,{"$nulls":4},0,{"$nulls":6},0,null,null,0,null,null,0,null,null,0,{"$nulls":12},"Cmay",{"v":282000,"d":"282,000"},0,""]
[1103063,"Neurolisis externa","MAI",{"$f":"SUM(J1241:O1241)","v":0},{"$nulls":4},{"$f":"+J1241+K1241","v":0},{"$nulls":6},{"$f":"SUM(Q1241:R1241)","v":0},null,null,{"$f":"SUM(T1241:U1241)","v":0},null,null,{"$f":"SUM(W1241:X1241)","v":0},null,null,{"$f":"SUM(Z1241:AA1241)","v":0},{"$nulls":12},"Cmay",{"v":152020,"d":"152,020"},{"$f":"AM1241*I1241","v":0},{"$f":"IF(D1241>=P1241 + S1241+ V1241 + Y1241,\"\",\"La suma no puede ser mayor al total\")","v":""}]
[1103064,"Síndrome del escaleno, trat. quir.","MAI",{"$f":"SUM(J1242:O1242)","v":0},{"$nulls":4},0,{"$nulls":6},{"$f":"SUM(Q1242:R1242)","v":0},null,null,{"$f":"SUM(T1242:U1242)","v":0},null,null,{"$f":"SUM(W1242:X1242)","v":0},null,null,{"$f":"SUM(Z1242:AA1242)","v":0},{"$nulls":12},"Cmay",{"v":213000,"d":"213,000"},{"$f":"AM1242*I1242","v":0},""]
[1103065,"Síndrome de costilla cervical, trat. quir.","MAI",{"$f":"SUM(J1243:O1243)","v":0},{"$nulls":4},0,{"$nulls":6},{"$f":"SUM(Q1243:R1243)","v":0},null,null,{"$f":"SUM(T1243:U1243)","v":0},null,null,{"$f":"SUM(W1243:X1243)","v":0},null,null,{"$f":"SUM(Z1243:AA1243)","v":0},{"$nulls":12},"Cmay",{"v":312280,"d":"312,280"},{"$f":"AM1243*I1243","v":0},""]
[1103066,"Síndrome del túnel del carpo o del tarso u otro, trat. quir.","MAI",{"$f":"SUM(J1244:O1244)","v":0},{"$nulls":4},0,{"$nulls":6},{"$f":"SUM(Q1244:R1244)","v":0},null,null,{"$f":"SUM(T1244:U1244)","v":0},null,null,{"$f":"SUM(W1244:X1244)","v":0},null,null,{"$f":"SUM(Z1244:AA1244)","v":0},{"$nulls":12},"Cmay",{"v":164540,"d":"164,540"},{"$f":"AM1244*I1244","v":0},""]
[1103067,"Transposición cubital, repar. de","MAI",{"$f":"SUM(J1245:O1245)","v":0},{"$nulls":4},0,{"$nulls":6},{"$f":"SUM(Q1245:R1245)","v":0},null,null,{"$f":"SUM(T1245:U1245)","v":0},null,null,{"$f":"SUM(W1245:X1245)","v":0},null,null,{"$f":"SUM(Z1245:AA1245)","v":0},{"$nulls":12},"Cmay",{"v":183230,"d":"183,230"},{"$f":"AM1245*I1245","v":0},""]
[null,"TOTAL",null,{"$f":"SUM(D1176:D1245)","v":0},{"$nulls":4},{"$f":"SUM(I1176:I1245)","v":0},{"$f":"SUM(J1176:J1245)","v":0},0,0,0,0,0,0,0,0,0,0,0,0,0,0,0,0,0,0,0,0,0,0,0,0,0,0,0,null,{"v":27615770,"d":"27,615,770"},0]
[" ","PROCEDIMIENTOS DE OFTALMOLOGÍA"]
[1201001,"Campimetria de proyeccion, c/ojo (proc.aut.)","MLE",{"$f":"SUM(E1248+H1248)","v":0},{"$f":"SUM(F1248:G1248)","v":0},{"$nulls":32},"Proc"]
[1201042,"Campimetria computarizada, c/ojo","MLE",0,0,{"$nulls":32},"Proc"]
[1201002,"coordimetria, test de hess u otro, c/ojo","MLE",0,0,{"$nulls":32},"Proc"]
[1201003,"cuantificacion de lagrimacion (test de   schirmer),  uno o                  ","MLE",0,0,{"$nulls":32},"Proc"]
[1201004,"curva de tension aplanatica (por cada dia), c/ojo                                ","MLE",0,0,{"$nulls":32},"Proc"]
[1201005,"diploscopia cuantitativa, ambos ojos                                                      ","MLE",0,0,{"$nulls":32},"Proc"]
[1201006,"electromiografia musculos oculares adultos, c/ojo","MLE",0,0,{"$nulls":32},"Proc"]
[1201007,"electromiografia musculos oculares ninos, c/ojo","MLE",0,0,{"$nulls":32},"Proc"]
[1201008,"electrooculografia, ambos ojos","MLE",0,0,{"$nulls":32},"Proc"]
[1201009,"exploracion sensoriomotora: estrabismo, estudio completo ,               ","MLE",0,0,{"$nulls":32},"Proc"]
[1201010,"perimetria estatica (con campimetria de  proyeccion) ,","MLE",0,0,{"$nulls":32},"Proc"]
[1201011,"pruebas de provocacion para glaucoma (prueba de oscuridad","MLE",0,0,{"$nulls":32},"Proc"]
[1201012,"retinografia, ambos ojos                                                                           ","MLE",0,0,{"$nulls":32},"Proc"]
[1201013,"tonografia electronica, c/ojo","MLE",0,0,{"$nulls":32},"Proc"]
[1201014,"tonometria ocular, cualquier tecnica, c/ojo                                            ","MLE",0,0,{"$nulls":32},"Proc"]
[1201015,"tratamiento ortoptico y/ o pleoptico (por sesion) ,                               ","MLE",0,0,{"$nulls":32},"Proc"]
[1201016,"Angiografia de retina o de iris, (con fluoresceina o","MLE",0,0,{"$nulls":32},"Proc"]
[1201017,"Angioscopia retinal y/o iris (con fluoresceina o similar),","MLE",0,0,{"$nulls":32},"Proc"]
[1201018," Electrorretinografia, c/ojo","MLE",0,0,{"$nulls":32},"Proc"]
[1201019," Exploracion vitreorretinal, ambos ojos                                                       ","MLE",0,0,{"$nulls":32},"Proc"]
[1201020,"Ecobiometria con calculo de lente intraocular, ambos ojos.","MLE",0,0,{"$nulls":32},"Proc"]
[1201023,"potencial visual evocado en adultos, ambos ojos","MLE",0,0,{"$nulls":32},"Proc"]
[1201024,"potencial visual evocado en ninos, ambos ojos","MLE",0,0,{"$nulls":32},"Proc"]
[1201027,"Examen Optométrico c/s Prescripción de Lentes   ","MLE",0,0,{"$nulls":32},"Proc"]
[1201043,"topografia corneal computarizada, c/ojo","MLE",0,0,{"$nulls":32},"Proc"]
[1201028,"Flebografia orbitaria (a.c. 04-02-040)","MLE",{"$f":"SUM(E1273+H1273)","v":0},{"$f":"SUM(F1273:G1273)","v":0},{"$nulls":32},"Proc"]
[1201029,"Cuerpo extrano conjuntival y/o corneal en adultos                                 ","MLE",0,0,{"$nulls":32},"Proc"]
[1201030,"Cuerpo extrano conjuntival y/o corneal en ninos","MLE",0,0,{"$nulls":32},"Proc"]
[1201031,"Via lagrimal,cateterismo o sondaje en adultos","MLE",0,0,{"$nulls":32},"Proc"]
[1201032,"Via lagrimal, cateterismo o sondaje en lactantes","MLE",0,0,{"$nulls":32},"Proc"]
[1201033,"Via lagrimal, cateterismo o sondaje en ninos","MLE",0,0,{"$nulls":32},"Proc"]
[1201034,"Tocacion corneal c/yodo y/o eter u otros, en ninos o adultos","MLE",0,0,{"$nulls":32},"Proc"]
[1201035,"Criocoagulacion conjuntival, corneal o palpebral en adultos","MLE",0,0,{"$nulls":32},"Proc"]
[1201036,"Criocoagulacion conjuntival, corneal o palpebral en ninos","MLE",0,0,{"$nulls":32},"Proc"]
[1201037,"Glaucoma, ciclodiatermia y/o ciclocrioterapia","MLE",0,0,{"$nulls":32},"Proc"]
[1201038,"Inyeccion retrobulbar","MLE",0,0,{"$nulls":32},"Proc"]
[1201039,"Pestanas, extirp. Por electrocoagulacion (cualquier numero)","MLE",0,0,{"$nulls":32},"Proc"]
[1201040,"Puntos lagrimales; electrotermocoagulacion","MLE",0,0,{"$nulls":32},"Proc"]
[1201041,"Sondaje vía lagrimal en niños (bajo anestesia general)","MLE",0,0,{"$nulls":32},"Proc"]
[1201042,"Campimetría computarizada, c/ojo (excluye UAPO)                            ","MLE",0,0,{"$nulls":32},"Proc"]
[1201042,"Campimetría computarizada, c/ojo (en UAPO)                                  ","MLE",0,0,{"$nulls":32},"Proc"]
[5099012,"Tomografia coherencia optica",null,0,0,{"$nulls":32},"Proc"]
[5099013,"Inyeccion intravitrea  avastin",null,0,0,{"$nulls":32},"Proc"]
[5099014,"Toma agudeza visual (ambos ojos)",null,0,0,{"$nulls":32},"Proc"]
[5099015,"Autorefractometria",null,0,0,{"$nulls":32},"Proc"]
[5099016,"Lensometria",null,0,0,{"$nulls":32},"Proc"]
[5099049,"Tomografia de coherencia optica",null,0,0,{"$nulls":32},"Proc"]
[5099050,"Campimetria de goldman",null,0,0,{"$nulls":32},"Proc"]
[5099051,"Test de ishihara",null,0,0,{"$nulls":32},"Proc"]
[5099052,"Campo visual",null,0,0,{"$nulls":32},"Proc"]
[5099001,"Paquimetría ultrasónica",null,0,0,{"$nulls":32},"Proc"]
[5099002,"Paquimetría optica",null,0,0,{"$nulls":32},"Proc"]
[null,"Tensión ocular",null,0,0,{"$nulls":32},"Proc"]
[null,"Biomicroscopía ocular",null,0,0,{"$nulls":32},"Proc"]
[null,"Examen de visión cromática",null,0,0,{"$nulls":32},"Proc"]
[null,"TOTAL ",null,{"$f":"SUM(D1248:D1302)","v":0},0,0,0,0,{"$nulls":19},0,0,0,0,0,0,0,0,0,0,0]
[null,"GRUPO 12 : CIRUGIA OFTALMOLOGICA          "]
[1202001,"Intubación lagrimal","MAI",{"$f":"SUM(J1305:O1305)","v":0},{"$nulls":4},{"$f":"+J1305+K1305","v":0},{"$nulls":28},"CMen",{"v":35020,"d":"35,020"},{"$f":"AM1305*I1305","v":0}]
[1202002,"Puntos lagrimales, plastía de","MAI",{"$f":"SUM(J1306:O1306)","v":0},{"$nulls":4},0,{"$nulls":28},"CMen",{"v":31220,"d":"31,220"},{"$f":"AM1306*I1306","v":0}]
[1202003,"Reconstitución de canalículos","MAI",0,{"$nulls":4},0,{"$nulls":28},"CMen",{"v":72720,"d":"72,720"},0]
[1202004,"Absceso, vaciamiento y/o drenaje de","MAI",0,{"$nulls":4},0,{"$nulls":28},"CMen",{"v":16520,"d":"16,520"},0]
[1202005,"Dacriocistorrinostomía","MAI",0,{"$nulls":4},0,{"$nulls":28},"CMen",{"v":96360,"d":"96,360"},0]
[1202006,"Extirpación de lagrimal","MAI",0,{"$nulls":4},0,{"$nulls":28},"CMen",{"v":43530,"d":"43,530"},0]
[1202007,"Reconstitución vía lagrimal en ausencia del saco","MAI",0,{"$nulls":4},0,{"$nulls":6},{"$f":"SUM(Q1311:R1311)","v":0},null,null,{"$f":"SUM(T1311:U1311)","v":0},null,null,{"$f":"SUM(W1311:X1311)","v":0},null,null,{"$f":"SUM(Z1311:AA1311)","v":0},{"$nulls":12},"Cmay",{"v":138100,"d":"138,100"},0]
[1202008,"Tumor de glándula lagrimal, trat. quir. completo","MAI",0,{"$nulls":4},0,{"$nulls":6},0,null,null,0,null,null,0,null,null,0,{"$nulls":12},"Cmay",{"v":135970,"d":"135,970"},0]
[1202009,"Tumor maligno  del saco, trat. quir. completo","MAI",0,{"$nulls":4},0,{"$nulls":6},0,null,null,0,null,null,0,null,null,0,{"$nulls":12},"Cmay",{"v":109820,"d":"109,820"},0]
[1202010,"Absceso lagrimal, trat. quir.","MAI",0,{"$nulls":4},0,{"$nulls":28},"CMen",{"v":16520,"d":"16,520"},0]
[1202011,"Biopsia de párpado y/o anexos (proc. aut.)","MAI",0,{"$nulls":4},0,{"$nulls":28},"CMen",{"v":22750,"d":"22,750"},0]
[1202012,"Blefarochalasis, plastía de","MAI",0,{"$nulls":4},0,{"$nulls":28},"CMen",{"v":42580,"d":"42,580"},0]
[1202013,"Blefarofimosis, plastía de","MAI",0,{"$nulls":4},0,{"$nulls":6},0,null,null,0,null,null,0,null,null,0,{"$nulls":12},"Cmay",{"v":87460,"d":"87,460"},0]
[1202014,"Blefarorrafia con blefarotomía posterior","MAI",0,{"$nulls":4},0,{"$nulls":28},"CMen",{"v":26010,"d":"26,010"},0]
[1202015,"Cantoplastía","MAI",0,{"$nulls":4},0,{"$nulls":28},"CMen",{"v":34270,"d":"34,270"},0]
[1202016,"Chalazión y otros tumores benignos (uno o más en el mismo ojo), trat. quir. Completo","MAI",0,{"$nulls":4},0,{"$nulls":28},"CMen",{"v":28160,"d":"28,160"},0]
[1202017,"Plastía de Coloboma","MAI",0,{"$nulls":4},0,{"$nulls":6},0,null,null,0,null,null,0,null,null,0,{"$nulls":12},"Cmay",{"v":91850,"d":"91,850"},0]
[1202018,"Plastía de Ectropión","MAI",0,{"$nulls":4},0,{"$nulls":28},"CMen",{"v":55510,"d":"55,510"},0]
[1202019,"Plastía de Entropión","MAI",0,{"$nulls":4},0,{"$nulls":28},"CMen",{"v":55510,"d":"55,510"},0]
[1202020,"Plastía de Epicanto","MAI",0,{"$nulls":4},0,{"$nulls":28},"CMen",{"v":55510,"d":"55,510"},0]
[1202021,"Ptosis, trat. quir.","MAI",0,{"$nulls":4},0,{"$nulls":6},0,null,null,0,null,null,0,null,null,0,{"$nulls":12},"Cmay",{"v":88460,"d":"88,460"},0]
[1202022,"Quiste dermoide de la cola de la ceja, resec. plástica","MAI",0,{"$nulls":4},0,{"$nulls":28},"CMen",{"v":28780,"d":"28,780"},0]
[1202023,"Tumor maligno, trat. quir. completo","MAI",0,{"$nulls":4},0,{"$nulls":6},0,null,null,0,null,null,0,null,null,0,{"$nulls":12},"Cmay",{"v":78600,"d":"78,600"},0,{"$f":"IF(D1327>=P1327 + S1327+ V1327 + Y1327,\"\",\"La suma no puede ser mayor al total\")","v":""}]
[1202024,"Xantelasma, trat. quir.","MAI",0,{"$nulls":4},0,{"$nulls":28},"CMen",{"v":23560,"d":"23,560"},0]
[1202071,"Herida o dehiscencia de sutura de párpado, reparación","MAI",0,{"$nulls":4},0,{"$nulls":28},"CMen",{"v":33230,"d":"33,230"},0]
[1202025,"Herida o dehiscencia, sutura de (proc. aut.)","MAI",0,{"$nulls":4},0,{"$nulls":28},"CMen",{"v":47770,"d":"47,770"},0]
[1202026,"Pterigión y/o pseudopterigión o su recidiva, extirpación","MAI",0,{"$nulls":4},0,{"$nulls":28},"CMen",{"v":54860,"d":"54,860"},0]
[1202027,"Simbléfaron, resección de adherencias y plastía de","MAI",0,{"$nulls":4},0,{"$nulls":6},0,null,null,0,null,null,0,null,null,0,{"$nulls":12},"Cmay",{"v":54020,"d":"54,020"},0,{"$f":"IF(D1332>=P1332 + S1332+ V1332 + Y1332,\"\",\"La suma no puede ser mayor al total\")","v":""}]
[1202028,"Tumor benigno, extirp. de","MAI",0,{"$nulls":4},0,{"$nulls":28},"CMen",{"v":33330,"d":"33,330"},0]
[1202029,"Absceso párpado, trat. quir.","MAI",0,{"$nulls":4},0,{"$nulls":28},"CMen",{"v":31790,"d":"31,790"},0]
[1202030,"Corrección de cavidad anoftálmica trat. completo","MAI",0,{"$nulls":4},0,{"$nulls":6},0,null,null,0,null,null,0,null,null,0,{"$nulls":12},"Cmay",{"v":141790,"d":"141,790"},0,{"$f":"IF(D1335>=P1335 + S1335+ V1335 + Y1335,\"\",\"La suma no puede ser mayor al total\")","v":""}]
[1202031,"Cuerpo extraño orbitario (con orbitotomía)","MAI",0,{"$nulls":4},0,{"$nulls":6},0,null,null,0,null,null,0,null,null,0,{"$nulls":12},"Cmay",{"v":157970,"d":"157,970"},0,{"$f":"IF(D1336>=P1336 + S1336+ V1336 + Y1336,\"\",\"La suma no puede ser mayor al total\")","v":""}]
[1202032,"Exanteración orbitaria o tumor orbitario, trat. quirúrgico completo","MAI",0,{"$nulls":4},0,{"$nulls":6},0,null,null,0,null,null,0,null,null,0,{"$nulls":12},"Cmay",{"v":296750,"d":"296,750"},0,""]
[1202033,"Orbitotomía anterior","MAI",0,{"$nulls":4},0,{"$nulls":6},0,null,null,0,null,null,0,null,null,0,{"$nulls":12},"Cmay",{"v":68330,"d":"68,330"},0,""]
[1202034,"Orbitotomía lateral descompresiva","MAI",0,{"$nulls":4},0,{"$nulls":6},0,null,null,0,null,null,0,null,null,0,{"$nulls":12},"Cmay",{"v":100700,"d":"100,700"},0,""]
[1202072,"Reconstrucción de piso orbitario","MAI",0,{"$nulls":4},0,{"$nulls":6},0,null,null,0,null,null,0,null,null,0,{"$nulls":12},"Cmay",{"v":94010,"d":"94,010"},0,""]
[1202035,"Biopsia de globo ocular (proc. aut.)","MAI",0,{"$nulls":4},0,{"$nulls":6},0,null,null,0,null,null,0,null,null,0,{"$nulls":12},"Cmay",{"v":50950,"d":"50,950"},0,""]
[1202036,"Enucleación o implante de prótesis ocular (proc. aut.)","MAI",0,{"$nulls":4},0,{"$nulls":6},0,null,null,0,null,null,0,null,null,0,{"$nulls":12},"Cmay",{"v":118720,"d":"118,720"},0,""]
[1202037,"Enucleación con implante","MAI",0,{"$nulls":4},0,{"$nulls":6},0,null,null,0,null,null,0,null,null,0,{"$nulls":12},"Cmay",{"v":161040,"d":"161,040"},0,""]
[1202038,"Estrabismo, trat. quir. completo (uno o ambos ojos)","MAI",0,{"$nulls":4},0,{"$nulls":6},0,null,null,0,null,null,0,null,null,0,{"$nulls":12},"Cmay",{"v":166360,"d":"166,360"},0,""]
[1202039,"Exanteración ocular (proc. aut.)","MAI",0,{"$nulls":4},0,{"$nulls":6},0,null,null,0,null,null,0,null,null,0,{"$nulls":12},"Cmay",{"v":118720,"d":"118,720"},0,""]
[1202040,"Lesión traumática, sutura de (proc. aut.)","MAI",0,{"$nulls":4},0,{"$nulls":6},0,null,null,0,null,null,0,null,null,0,{"$nulls":12},"Cmay",{"v":60770,"d":"60,770"},0,""]
[1202041,"Cirugía refractiva, queratotomía radial o similar con bisturí de diamante","MAI",0,{"$nulls":4},0,{"$nulls":6},0,null,null,0,null,null,0,null,null,0,{"$nulls":12},"Cmay",{"v":86460,"d":"86,460"},0,""]
[1202042,"Crioterapia y recesión conjuntival","MAI",0,{"$nulls":4},0,{"$nulls":28},"CMen",{"v":37350,"d":"37,350"},0]
[1202044,"Cuerpo extraño, extracción quir. de","MAI",0,{"$nulls":4},0,{"$nulls":28},"CMen",{"v":24710,"d":"24,710"},0]
[1202045,"Glaucoma, trat. quir. por cualquier técnica","MAI",0,{"$nulls":4},0,{"$nulls":6},0,null,null,0,null,null,0,null,null,0,{"$nulls":12},"Cmay",{"v":175910,"d":"175,910"},0,{"$f":"IF(D1350>=P1350 + S1350+ V1350 + Y1350,\"\",\"La suma no puede ser mayor al total\")","v":""}]
[1202046,"Herida penetrante corneal o corneo-escleral o dehiscencia de sutura","MAI",0,{"$nulls":4},0,{"$nulls":6},0,null,null,0,null,null,0,null,null,0,{"$nulls":12},"Cmay",{"v":89680,"d":"89,680"},0,""]
[1202047,"Queratectomía laminar","MAI",0,{"$nulls":4},0,{"$nulls":6},0,null,null,0,null,null,0,null,null,0,{"$nulls":12},"Cmay",{"v":97250,"d":"97,250"},0,""]
[1202048,"Queratoplastía. Injerto lamelar o penetrante trat. quir. Completo","MAI",0,{"$nulls":4},0,{"$nulls":6},0,null,null,0,null,null,0,null,null,0,{"$nulls":12},"Cmay",{"v":204040,"d":"204,040"},0,""]
[1202049,"Queratoprótesis, implantación de (no incluye el valor de la prótesis)","MAI",0,{"$nulls":4},0,{"$nulls":6},0,null,null,0,null,null,0,null,null,0,{"$nulls":12},"Cmay",{"v":234300,"d":"234,300"},0,""]
[1202050,"Recubrimiento conjuntival","MAI",0,{"$nulls":4},0,{"$nulls":6},0,null,null,0,null,null,0,null,null,0,{"$nulls":12},"Cmay",{"v":108300,"d":"108,300"},0,""]
[1202051,"Rehabilitación superficie ocular (con injerto de mucosa)","MAI",0,{"$nulls":4},0,{"$nulls":6},0,null,null,0,null,null,0,null,null,0,{"$nulls":12},"Cmay",{"v":108300,"d":"108,300"},0,""]
[1202070,"Sinequiotomía (proc. aut.)","MAI",0,{"$nulls":4},0,{"$nulls":6},0,null,null,0,null,null,0,null,null,0,{"$nulls":12},"Cmay",{"v":62140,"d":"62,140"},0,""]
[1202073,"Operación triple (injerto, facoéresis e implante de lente intraocular) (no incluye valor de la prótesis)","MAI",0,{"$nulls":4},0,{"$nulls":6},0,null,null,0,null,null,0,null,null,0,{"$nulls":12},"Cmay",{"v":335810,"d":"335,810"},0,""]
[1202173,"Operación triple (injerto, facoéresis e implante de lente intraocular) (incluye valor de la prótesis)","MAI",0,{"$nulls":4},0,{"$nulls":6},0,null,null,0,null,null,0,null,null,0,{"$nulls":12},"Cmay",{"v":457470,"d":"457,470"},0,""]
[1202053,"Iridectomía periférica y/u óptica, (proc. aut.)","MAI",0,{"$nulls":4},0,{"$nulls":6},0,null,null,0,null,null,0,null,null,0,{"$nulls":12},"Cmay",{"v":78600,"d":"78,600"},0,""]
[1202054,"Tumor ocular, trat. quir.","MAI",0,{"$nulls":4},0,{"$nulls":6},0,null,null,0,null,null,0,null,null,0,{"$nulls":12},"Cmay",{"v":142410,"d":"142,410"},0,""]
[1202074,"Hernia de iris y/o fístulas, reparación de","MAI",0,{"$nulls":4},0,{"$nulls":6},0,null,null,0,null,null,0,null,null,0,{"$nulls":12},"Cmay",{"v":96570,"d":"96,570"},0,""]
[1202055,"Desgarro sin desprendimiento, diatermo y/o crío y/o fotocoagulación","MAI",0,{"$nulls":4},0,{"$nulls":28},"CMen",{"v":86160,"d":"86,160"},0]
[1202056,"Desprendimiento retinal, cirugía convencional (exoimplantes)","MAI",0,{"$nulls":4},0,{"$nulls":6},0,null,null,0,null,null,0,null,null,0,{"$nulls":12},"Cmay",{"v":193320,"d":"193,320"},0,{"$f":"IF(D1364>=P1364 + S1364+ V1364 + Y1364,\"\",\"La suma no puede ser mayor al total\")","v":""}]
[1202058,"Tumor, diatermo y/o crío y/o fotocoagulación de","MAI",0,{"$nulls":4},0,{"$nulls":28},"CMen",{"v":78600,"d":"78,600"},0]
[1202059,"Vasculopatía retinal (excepto retinopatía proliferativa) diatermo y/o crío y/o fotocoagulación","MAI",0,{"$nulls":4},0,{"$nulls":28},"CMen",{"v":106410,"d":"106,410"},0]
[1202060,"Vitrectomía c/retinotomía (c/s inyección de gas o silicona)","MAI",0,{"$nulls":4},0,{"$nulls":6},0,null,null,0,null,null,0,null,null,0,{"$nulls":12},"Cmay",{"v":321320,"d":"321,320"},0,{"$f":"IF(D1367>=P1367 + S1367+ V1367 + Y1367,\"\",\"La suma no puede ser mayor al total\")","v":""}]
[1202061,"Vitrectomía con inyección de gas o silicona","MAI",0,{"$nulls":4},0,{"$nulls":6},0,null,null,0,null,null,0,null,null,0,{"$nulls":12},"Cmay",{"v":287510,"d":"287,510"},0,""]
[1202062,"Vitrectomía con vitreófago (proc. aut)","MAI",0,{"$nulls":4},{"$f":"+J1369+K1369","v":0},{"$nulls":6},0,null,null,0,null,null,0,null,null,0,{"$nulls":12},"Cmay",{"v":191810,"d":"191,810"},0,""]
[1202075,"Retinopexia neumática","MAI",{"$f":"SUM(J1370:O1370)","v":0},{"$nulls":4},0,{"$nulls":6},{"$f":"SUM(Q1370:R1370)","v":0},null,null,{"$f":"SUM(T1370:U1370)","v":0},null,null,{"$f":"SUM(W1370:X1370)","v":0},null,null,{"$f":"SUM(Z1370:AA1370)","v":0},{"$nulls":12},"Cmay",{"v":155630,"d":"155,630"},{"$f":"AM1370*I1370","v":0},""]
[1202077,"Desprendimiento coroídeo o hemorragia coroídea, trat. quir.","MAI",0,{"$nulls":4},0,{"$nulls":6},0,null,null,0,null,null,0,null,null,0,{"$nulls":12},"Cmay",{"v":81700,"d":"81,700"},0,""]
[1202063,"Facoéresis intracapsular o catarata secundaria o discisión y aspiración de masas","MAI",0,{"$nulls":4},0,{"$nulls":6},0,null,null,0,null,null,0,null,null,0,{"$nulls":12},"Cmay",{"v":150070,"d":"150,070"},0,""]
[1202064,"Facoéresis extracapsular con implante de lente intraocular (no incluye el valor de la prótesis)","MAI",0,{"$nulls":4},0,{"$nulls":6},0,null,null,0,null,null,0,null,null,0,{"$nulls":12},"Cmay",{"v":461080,"d":"461,080"},0,""]
[1202164,"Facoéresis extracapsular con implante de lente intraocular (incluye el valor de la prótesis) ","MAI",0,{"$nulls":4},0,{"$nulls":6},0,null,null,0,null,null,0,null,null,0,{"$nulls":12},"Cmay",{"v":582730,"d":"582,730"},0,""]
[1202065,"Implante secundario de lente intraocular","MAI",0,{"$nulls":4},0,{"$nulls":6},0,null,null,0,null,null,0,null,null,0,{"$nulls":12},"Cmay",{"v":266810,"d":"266,810"},0,""]
[1202066,"Aspiración esferular c/s capsulotomía","MAI",0,{"$nulls":4},0,{"$nulls":6},0,null,null,0,null,null,0,null,null,0,{"$nulls":12},"Cmay",{"v":75370,"d":"75,370"},0,""]
[1202076,"Extracción o corrección de desplazamiento de lente intraocular","MAI",0,{"$nulls":4},0,{"$nulls":6},0,null,null,0,null,null,0,null,null,0,{"$nulls":12},"Cmay",{"v":161040,"d":"161,040"},0,""]
[1202057,"Retinopatía proliferativa, (diabética, hipertensiva, Eales y otras) panfotocoagulación (trat. completo)","MAI",0,{"$nulls":4},0,{"$nulls":28},"CMen",{"v":150920,"d":"150,920"},0]
[1202067,"Discisión de cápsula posterior","MAI",0,{"$nulls":4},0,{"$nulls":28},"CMen",{"v":168900,"d":"168,900"},0]
[1202068,"Iridotomía","MAI",0,{"$nulls":4},0,{"$nulls":28},"CMen",{"v":168900,"d":"168,900"},0]
[1202069,"Trabeculoplastía o iridoplastía","MAI",0,{"$nulls":4},0,{"$nulls":28},"CMen",{"v":168900,"d":"168,900"},0]
[1202078,"Cirugía fotorrefractiva o fototerapéutica de córnea, cualquier técnica","MAI",0,{"$nulls":4},0,{"$nulls":6},0,null,null,0,null,null,0,null,null,0,{"$nulls":12},"Cmay",{"v":154770,"d":"154,770"},0,{"$f":"IF(D1382>=P1382 + S1382+ V1382 + Y1382,\"\",\"La suma no puede ser mayor al total\")","v":""}]
[null,"TOTAL",null,{"$f":"SUM(D1305:D1382)","v":0},{"$nulls":4},{"$f":"SUM(I1305:I1382)","v":0},{"$f":"SUM(J1305:J1382)","v":0},0,0,0,0,0,0,0,0,0,0,0,0,0,0,0,0,0,0,0,0,0,0,0,0,0,0,0,0,{"v":9557150,"d":"9,557,150"},0]
[null,"PROCEDIMIENTOS DE OTORRINOLARINGOLOGÍA "]
[1301001,"Electrogustometria","MLE",{"$f":"SUM(E1385+H1385)","v":0},{"$f":"SUM(F1385:G1385)","v":0},{"$nulls":32},"Proc"]
[1301002,"Rinomanometria c/s vasocontrictor","MLE",0,0,{"$nulls":32},"Proc"]
[1301003,"Nasofaringolaringofibroscopia","MLE",0,0,{"$nulls":32},"Proc"]
[1301004,"Rinoscopia posterior, con nasofaringoscopia c/s toma","MLE",0,0,{"$nulls":32},"Proc"]
[1301005,"Sinusoscopia de cada seno maxilar por puncion, c/s biopsia,","MLE",0,0,{"$nulls":32},"Proc"]
[1301006,"Laringoscopia y/o traqueoscopia directa c/s toma de muestra, c/s biopsia con microscopio","MLE",0,0,{"$nulls":32},"Proc"]
[1301007,"Laringoscopia y/o traqueoscopia directa c/s toma de muestra, c/s biopsia sin microscopio","MLE",0,0,{"$nulls":32},"Proc"]
[1301021,"Audiometría adultos","MLE",0,0,{"$nulls":32},"Proc"]
[1301008,"Audiometría niños","MLE",0,0,{"$nulls":32},"Proc"]
[1301009,"Impedanciometría","MLE",0,0,{"$nulls":32},"Proc"]
[1301010,"Calibración de audífonos o implantes","MLE",0,0,{"$nulls":32},"Proc"]
[1301011,"Potenciales evocados auditivos","MLE",0,0,{"$nulls":32},"Proc"]
[1301012,"Cócleovestibular con electronistagmografía","MLE",0,0,{"$nulls":32},"Proc"]
[1301015,"Electronistagmografía o Videoelectronistagmografía c/s nistag.de posición","MLE",0,0,{"$nulls":32},"Proc"]
[1301016,"Función tubaria","MLE",0,0,{"$nulls":32},"Proc"]
[1301017,"Prueba calórica o prueba calórica mínima (proc.aut.)","MLE",0,0,{"$nulls":32},"Proc"]
[1301019,"Test de glicerol (con 3 audiometrías)","MLE",0,0,{"$nulls":32},"Proc"]
[1301020,"Examen funcional de VIII par","MLE",{"$f":"SUM(E1402+H1402)","v":0},{"$f":"SUM(F1402:G1402)","v":0},{"$nulls":32},"Proc"]
[1301024,"Senos perinasales, puncion evacuadora c/s toma de muestras,","MLE",0,0,{"$nulls":32},"Proc"]
[1301025,"Taponamiento nasal anterior (proc. aut.)","MLE",0,0,{"$nulls":32},"Proc"]
[1301026,"Taponamiento nasal posterior","MLE",0,0,{"$nulls":32},"Proc"]
[1301027,"Vaciamiento cavid. Perinasales (proetz y sim.) (10 sesiones)","MLE",0,0,{"$nulls":32},"Proc"]
[1301028,"Cauterización uni o bilateral de vasos en fosa nasal anterior","MLE",0,0,{"$nulls":32},"Proc"]
[1301029,"Cuerpo extraño en fosas nasales, extraccion en adultos        ","MLE",0,0,{"$nulls":32},"Proc"]
[1301030,"Cuerpo extraño en fosas nasales, extraccion en niños        ","MLE",0,0,{"$nulls":32},"Proc"]
[1301035,"Cuerpo extraño en laringe y/o traquea, extraccion de (incluyela endoscopia con tubo rigido): En adultos","MLE",0,0,{"$nulls":32},"Proc"]
[1301036,"Cuerpo extraño en laringe y/o traquea, extraccion de (incluyela endoscopia con tubo rigido): En ninos","MLE",0,0,{"$nulls":32},"Proc"]
[1301037,"Dilatacion esofagica por sesion","MLE",0,0,{"$nulls":32},"Proc"]
[1301038,"Dilatacion esofagica por sesion en ninos","MLE",0,0,{"$nulls":32},"Proc"]
[1301039,"Dilatacion esofagica por sesion en adultos","MLE",0,0,{"$nulls":32},"Proc"]
[1301040,"Lesiones del oido externo y/o medio, curacion bajo micros","MLE",0,0,{"$nulls":32},"Proc"]
[1301041,"Trompa de eustaquio, insuflacion instrumental (proc. Aut.)","MLE",0,0,{"$nulls":32},"Proc"]
[1301042,"Trompa de eustaquio, insuflacion instrumental (proc. Aut.) en adultos                                                                             ","MLE",0,0,{"$nulls":32},"Proc"]
[1301043,"Trompa de eustaquio, insuflacion instrumental (proc. Aut.) en ninos                                                                                     ","MLE",0,0,{"$nulls":32},"Proc"]
[1301044,"Biopsia oido (proc. Aut.)","MLE",0,0,{"$nulls":32},"Proc"]
[1303001,"Evaluacion de la voz (incluye respiracion, tonicidad     ","MLE",0,0,{"$nulls":32},"Proc"]
[1303002,"Evaluacion del habla (incluye articulacion, prosodia,     ","MLE",0,0,{"$nulls":32},"Proc"]
[1303003,"Evaluacion del lenguaje (incluye voz, habla y aspecto   ","MLE",0,0,{"$nulls":32},"Proc"]
[1303004,"Rehabilitacion de la voz (maximo 15 sesiones anuales)  (cada sesion minimo 30'') (Fonoaudiológo)","MLE",0,0,{"$nulls":32},"Proc"]
[1303005,"Rehabilitacion del habla y/o del lenguaje (maximo 30 sesiones anuales) (cada sesion minimo 30'') (Fonoaudiológo)","MLE",0,0,{"$nulls":32},"Proc"]
[5099091,"Audiometria campo libre                                      ",null,0,0,{"$nulls":32},"Proc"]
[5099092,"Retiro de taponaje anterior",null,0,0,{"$nulls":32},"Proc"]
[5099093,"Retiro de yeso",null,0,0,{"$nulls":32},"Proc"]
[5099094,"Cambio de canula traqueostomia (enfermera Otorrino)",null,0,0,{"$nulls":32},"Proc"]
[5099095,"Estroboscopia",null,0,0,{"$nulls":32},"Proc"]
[null,"Emisiones otoacústicas",null,0,0,{"$nulls":32},"Proc"]
[null,"Electrococleografía ",null,0,0,{"$nulls":32},"Proc"]
[null,"Análisis audifono",null,0,0,{"$nulls":32},"Proc"]
[null,"VEMP (potencial miogénico vestibular)",null,0,0,{"$nulls":32},"Proc"]
[null,"Maniobras de reposición de particulas",null,0,0,{"$nulls":32},"Proc"]
[null,"Prueba calórica mínima",null,0,0,{"$nulls":32},"Proc"]
[null,"Rehabilitación vestibular",null,0,0,{"$nulls":32},"Proc"]
[null,"Nasofibroscopía",null,0,0,{"$nulls":32},"Proc"]
[null,"Laringoscopía",null,0,0,{"$nulls":32},"Proc"]
[null,"Rinometría acústica",null,0,0,{"$nulls":32},"Proc"]
[null,"Maniobras de reposición vestibular ",null,0,0,{"$nulls":32},"Proc"]
[null,"Potenciales miogenicos vestibulares",null,0,0,{"$nulls":32},"Proc"]
[null,"Terapia de rehabilitación de la voz en paciente laringectomizado",null,0,0,{"$nulls":32},"Proc"]
[null,"Habituación vestibular",null,0,0,{"$nulls":32},"Proc"]
[null,"Timpanometría de banda ancha",null,0,0,{"$nulls":32},"Proc"]
[null,"Estudio funcional de equilibrio en plataforma",null,0,0,{"$nulls":32},"Proc"]
[null,"Video oculonistgamografía en sillón rotatorio",null,0,0,{"$nulls":32},"Proc"]
[null,"Estimulación repetitiva",null,0,0,{"$nulls":32},"Proc"]
[null,"TOTAL",null,{"$f":"SUM(D1385:D1447)","v":0},{"$f":"SUM(E1385:E1447)","v":0},0,0,0,{"$nulls":19},{"$f":"SUM(AB1385:AB1447)","v":0},{"$f":"SUM(AC1385:AC1447)","v":0},{"$f":"SUM(AD1385:AD1447)","v":0},0,0,0,0,0,0,0]
[null,"GRUPO 13 : CIRUGIA OTORRINOLARINGOLOGICA       "]
[1302001,"Absceso y/o hematomas, trat. quir.","MAI",{"$f":"SUM(J1450:O1450)","v":0},{"$nulls":4},{"$f":"+J1450+K1450","v":0},{"$nulls":28},"CMen",{"v":14010,"d":"14,010"},{"$f":"AM1450*I1450","v":0}]
[1302002,"Cuerpo extraño en conducto auditivo externo, extracción de, por vía retroauricular","MAI",{"$f":"SUM(J1451:O1451)","v":0},{"$nulls":4},0,{"$nulls":28},"CMen",{"v":35950,"d":"35,950"},{"$f":"AM1451*I1451","v":0}]
[1302003,"Fístula preauricular complicada, trat. quir.","MAI",{"$f":"SUM(J1452:O1452)","v":0},{"$nulls":4},0,{"$nulls":28},"CMen",{"v":130390,"d":"130,390"},0]
[1302004,"Tumor benigno, trat. quir.","MAI",0,{"$nulls":4},0,{"$nulls":28},"CMen",{"v":26560,"d":"26,560"},0]
[1302005,"Tumor maligno, trat. quir.","MAI",0,{"$nulls":4},0,{"$nulls":28},"CMen",{"v":135950,"d":"135,950"},0]
[1302006,"Estapedectomía","MAI",0,{"$nulls":4},0,{"$nulls":6},{"$f":"SUM(Q1455:R1455)","v":0},null,null,{"$f":"SUM(T1455:U1455)","v":0},null,null,{"$f":"SUM(W1455:X1455)","v":0},null,null,{"$f":"SUM(Z1455:AA1455)","v":0},{"$nulls":12},"Cmay",{"v":190980,"d":"190,980"},0,{"$f":"IF(D1455>=P1455 + S1455+ V1455 + Y1455,\"\",\"La suma no puede ser mayor al total\")","v":""}]
[1302007,"Mastoidectomía c/s sección cuerda del tímpano","MAI",0,{"$nulls":4},0,{"$nulls":6},0,null,null,0,null,null,0,null,null,0,{"$nulls":12},"Cmay",{"v":204000,"d":"204,000"},0,""]
[1302008,"Mucositis timpánica o mixiosis uni o bilateral, trat. quir.","MAI",0,{"$nulls":4},0,{"$nulls":28},"CMen",{"v":105340,"d":"105,340"},0]
[1302009,"Operación radical de oído","MAI",0,{"$nulls":4},0,{"$nulls":6},0,null,null,0,null,null,0,null,null,0,{"$nulls":12},"Cmay",{"v":183230,"d":"183,230"},0,{"$f":"IF(D1458>=P1458 + S1458+ V1458 + Y1458,\"\",\"La suma no puede ser mayor al total\")","v":""}]
[1302010,"Petrositis, trat. quir.","MAI",0,{"$nulls":4},0,{"$nulls":6},0,null,null,0,null,null,0,null,null,0,{"$nulls":12},"Cmay",{"v":188450,"d":"188,450"},0,""]
[1302011,"Reconstitución funcional de oído radicalizado","MAI",0,{"$nulls":4},0,{"$nulls":6},0,null,null,0,null,null,0,null,null,0,{"$nulls":12},"Cmay",{"v":245820,"d":"245,820"},0,""]
[1302012,"Timpanoplastía funcional (cualquier tipo) c/s mastoidectomía","MAI",0,{"$nulls":4},0,{"$nulls":6},0,null,null,0,null,null,0,null,null,0,{"$nulls":12},"Cmay",{"v":183230,"d":"183,230"},0,""]
[1302013,"Agenesia o estenosis, reconstitución plástica","MAI",0,{"$nulls":4},0,{"$nulls":6},0,null,null,0,null,null,0,null,null,0,{"$nulls":12},"Cmay",{"v":227940,"d":"227,940"},0,""]
[1302014,"Exostosis, resección retro o endoaural","MAI",0,{"$nulls":4},0,{"$nulls":6},0,null,null,0,null,null,0,null,null,0,{"$nulls":12},"Cmay",{"v":172840,"d":"172,840"},0,""]
[1302015,"Neurectomía de Jacobson","MAI",0,{"$nulls":4},0,{"$nulls":6},0,null,null,0,null,null,0,null,null,0,{"$nulls":12},"Cmay",{"v":164540,"d":"164,540"},0,""]
[1302016,"Reconstitución de conducto auditivo externo, c/s tímpanoplastía (incluye revisión de cadena osicular)","MAI",0,{"$nulls":4},0,{"$nulls":6},0,null,null,0,null,null,0,null,null,0,{"$nulls":12},"Cmay",{"v":204000,"d":"204,000"},0,""]
[1302017,"Tratamiento quirúrgico de tumor glómico timpánico","MAI",0,{"$nulls":4},0,{"$nulls":6},0,null,null,0,null,null,0,null,null,0,{"$nulls":12},"Cmay",{"v":227940,"d":"227,940"},0,""]
[1302018,"Laberintectomía","MAI",0,{"$nulls":4},0,{"$nulls":6},0,null,null,0,null,null,0,null,null,0,{"$nulls":12},"Cmay",{"v":183230,"d":"183,230"},0,""]
[1302019,"Neurinoma del acústico, trat. quir. vía translaberíntica y/o fosa media","MAI",0,{"$nulls":4},0,{"$nulls":6},0,null,null,0,null,null,0,null,null,0,{"$nulls":12},"Cmay",{"v":299820,"d":"299,820"},0,""]
[1302020,"Descompresión intraósea c/s plastía","MAI",0,{"$nulls":4},0,{"$nulls":6},0,null,null,0,null,null,0,null,null,0,{"$nulls":12},"Cmay",{"v":170730,"d":"170,730"},0,""]
[1302021,"Lesiones a nivel del conducto auditivo interno, trat. quir.","MAI",0,{"$nulls":4},0,{"$nulls":6},0,null,null,0,null,null,0,null,null,0,{"$nulls":12},"Cmay",{"v":271560,"d":"271,560"},0,""]
[1302022,"Biopsia buco-faríngea (proc. aut.)","MAI",0,{"$nulls":4},0,{"$nulls":28},"CMen",{"v":20990,"d":"20,990"},0]
[1302023,"Sección simple y/o resección frenillo sublingual","MAI",0,{"$nulls":4},0,{"$nulls":28},"CMen",{"v":14010,"d":"14,010"},0]
[1302024,"Drenaje de absceso o flegmón de piso de boca","MAI",0,{"$nulls":4},0,{"$nulls":28},"CMen",{"v":19200,"d":"19,200"},0]
[1302025,"Drenaje de absceso o flegmón periamigdaliano","MAI",0,{"$nulls":4},0,{"$nulls":28},"CMen",{"v":28600,"d":"28,600"},0]
[1302026,"Sección simple y/o resección frenillo sublingual retrofaríngeo o faringolaríngeo","MAI",0,{"$nulls":4},0,{"$nulls":28},"CMen",{"v":30400,"d":"30,400"},0]
[1302027,"Drenaje de absceso o flegmón de vestíbulo bucal","MAI",0,{"$nulls":4},0,{"$nulls":28},"CMen",{"v":14010,"d":"14,010"},0]
[1302028,"Adenoidectomía (proc. aut.)","MAI",0,{"$nulls":4},0,{"$nulls":6},0,null,null,0,null,null,0,null,null,0,{"$nulls":12},"Cmay",{"v":118920,"d":"118,920"},0,{"$f":"IF(D1477>=P1477 + S1477+ V1477 + Y1477,\"\",\"La suma no puede ser mayor al total\")","v":""}]
[1302029,"Amigdalectomía c/s adenoidectomía, uni o bilateral","MAI",0,{"$nulls":4},0,{"$nulls":6},0,null,null,0,null,null,0,null,null,0,{"$nulls":12},"Cmay",{"v":133300,"d":"133,300"},0,""]
[1302030,"Cálculos salivales, trat. quir.","MAI",0,{"$nulls":4},0,{"$nulls":28},"CMen",{"v":19200,"d":"19,200"},0]
[1302031,"Tumor benigno de la mucosa bucal,  extirp. c/s  biopsia bucofaríngea","MAI",0,{"$nulls":4},0,{"$nulls":28},"CMen",{"v":19200,"d":"19,200"},0]
[1302032,"Tumor maligno de las amígdalas, trat. quir.","MAI",0,{"$nulls":4},0,{"$nulls":6},0,null,null,0,null,null,0,null,null,0,{"$nulls":12},"Cmay",{"v":164540,"d":"164,540"},0,{"$f":"IF(D1481>=P1481 + S1481+ V1481 + Y1481,\"\",\"La suma no puede ser mayor al total\")","v":""}]
[1302033,"Extirpacion de  tumor benigno de la base de la lengua                                                                                      ","MAI",0,{"$nulls":4},0,{"$nulls":6},0,null,null,0,null,null,0,null,null,0,{"$nulls":12},"Cmay",{"v":146540,"d":"146,540"},0,""]
[1302034,"Extirpación tumor maligno de base de lengua","MAI",0,{"$nulls":4},0,{"$nulls":6},0,null,null,0,null,null,0,null,null,0,{"$nulls":12},"Cmay",{"v":326480,"d":"326,480"},0,""]
[1302035,"Faringoplastía (cualq. técn.), c/s desplazamiento de colgajos","MAI",0,{"$nulls":4},0,{"$nulls":6},0,null,null,0,null,null,0,null,null,0,{"$nulls":12},"Cmay",{"v":232280,"d":"232,280"},0,""]
[1302036,"Fibroangioma del rinofarinx, trat. quir.","MAI",0,{"$nulls":4},0,{"$nulls":6},0,null,null,0,null,null,0,null,null,0,{"$nulls":12},"Cmay",{"v":321250,"d":"321,250"},0,""]
[1302037,"Glosectomía total","MAI",0,{"$nulls":4},0,{"$nulls":6},0,null,null,0,null,null,0,null,null,0,{"$nulls":12},"Cmay",{"v":336880,"d":"336,880"},0,""]
[1302038,"Abscesos y hematoma del tabique nasal, trat. quir.","MAI",0,{"$nulls":4},0,{"$nulls":28},"CMen",{"v":27740,"d":"27,740"},0]
[1302039,"Arteria esfenopalatina, cauterización por vía nasal","MAI",0,{"$nulls":4},0,{"$nulls":28},"CMen",{"v":130390,"d":"130,390"},0]
[1302040,"Arteria maxilar interna, ligadura de (por vía transmaxilar)","MAI",0,{"$nulls":4},0,{"$nulls":6},0,null,null,0,null,null,0,null,null,0,{"$nulls":12},"Cmay",{"v":152020,"d":"152,020"},0,{"$f":"IF(D1489>=P1489 + S1489+ V1489 + Y1489,\"\",\"La suma no puede ser mayor al total\")","v":""}]
[1302041,"Arterias etmoidales anteriores, ligadura de","MAI",0,{"$nulls":4},0,{"$nulls":28},"CMen",{"v":111780,"d":"111,780"},0]
[1302042,"Turbinectomía o electrocauterización de cornetes","MAI",0,{"$nulls":4},0,{"$nulls":28},"CMen",{"v":37730,"d":"37,730"},0]
[1302043,"Conducto y/o seno lagrimal, obstrucción del, trat. quir. por vía nasal","MAI",0,{"$nulls":4},0,{"$nulls":6},0,null,null,0,null,null,0,null,null,0,{"$nulls":12},"Cmay",{"v":143100,"d":"143,100"},0,{"$f":"IF(D1492>=P1492 + S1492+ V1492 + Y1492,\"\",\"La suma no puede ser mayor al total\")","v":""}]
[1302044,"Etmoidectomía endo o exonasal","MAI",0,{"$nulls":4},0,{"$nulls":6},0,null,null,0,null,null,0,null,null,0,{"$nulls":12},"Cmay",{"v":164540,"d":"164,540"},0,""]
[1302045,"Fístula buco-sinusal, trat. quir.","MAI",0,{"$nulls":4},0,{"$nulls":6},0,null,null,0,null,null,0,null,null,0,{"$nulls":12},"Cmay",{"v":137580,"d":"137,580"},0,""]
[1302046,"Fract. Nasal reciente, cerrada o expuesta, reducc. c/s yeso","MAI",0,{"$nulls":4},0,{"$nulls":28},"CMen",{"v":26180,"d":"26,180"},0]
[1302047,"Nervio vidiano, sección del (por cualquier vía)","MAI",0,{"$nulls":4},0,{"$nulls":6},0,null,null,0,null,null,0,null,null,0,{"$nulls":12},"Cmay",{"v":170730,"d":"170,730"},0,{"$f":"IF(D1496>=P1496 + S1496+ V1496 + Y1496,\"\",\"La suma no puede ser mayor al total\")","v":""}]
[1302048,"Perforación del tabique, trat. quir.","MAI",0,{"$nulls":4},0,{"$nulls":28},"CMen",{"v":111780,"d":"111,780"},0]
[1302049,"Tratamiento quirúrgico pólipo nasal","MAI",0,{"$nulls":4},0,{"$nulls":28},"CMen",{"v":32450,"d":"32,450"},0]
[1302050,"Rinitis atrófica, trat. por inclusión submucosa, con cualquier material, uni o bilateral","MAI",0,{"$nulls":4},0,{"$nulls":6},0,null,null,0,null,null,0,null,null,0,{"$nulls":12},"Cmay",{"v":118920,"d":"118,920"},0,{"$f":"IF(D1499>=P1499 + S1499+ V1499 + Y1499,\"\",\"La suma no puede ser mayor al total\")","v":""}]
[1302051,"Rinofima, trat. quir.","MAI",0,{"$nulls":4},0,{"$nulls":6},0,null,null,0,null,null,0,null,null,0,{"$nulls":12},"Cmay",{"v":155110,"d":"155,110"},0,""]
[1302052,"Rinoplastía y/o septoplastía, cualquier técnica","MAI",0,{"$nulls":4},0,{"$nulls":6},0,null,null,0,null,null,0,null,null,0,{"$nulls":12},"Cmay",{"v":175880,"d":"175,880"},0,""]
[1302053,"Seno esfenoidal, abertura (vía transetmoidal o transeptal)","MAI",0,{"$nulls":4},0,{"$nulls":6},0,null,null,0,null,null,0,null,null,0,{"$nulls":12},"Cmay",{"v":170730,"d":"170,730"},0,""]
[1302054,"Seno frontal, trat. quir. c/s vaciamiento etmoidal","MAI",0,{"$nulls":4},0,{"$nulls":6},0,null,null,0,null,null,0,null,null,0,{"$nulls":12},"Cmay",{"v":143100,"d":"143,100"},0,""]
[1302055,"Seno maxilar, antrostomía c/s etmoidectomía ( operación  de Cadwell Luc y sim.)","MAI",0,{"$nulls":4},0,{"$nulls":6},0,null,null,0,null,null,0,null,null,0,{"$nulls":12},"Cmay",{"v":152020,"d":"152,020"},0,""]
[1302056,"Sinequia nasal, trat. quir.","MAI",0,{"$nulls":4},0,{"$nulls":28},"CMen",{"v":20990,"d":"20,990"},0]
[1302057,"Tumor nasal, extirp. por rinotomía lateral","MAI",0,{"$nulls":4},0,{"$nulls":6},0,null,null,0,null,null,0,null,null,0,{"$nulls":12},"Cmay",{"v":143100,"d":"143,100"},0,{"$f":"IF(D1506>=P1506 + S1506+ V1506 + Y1506,\"\",\"La suma no puede ser mayor al total\")","v":""}]
[1302058,"Vaciamiento etmoidal por vía nasal c/s polipectomía","MAI",0,{"$nulls":4},0,{"$nulls":6},0,null,null,0,null,null,0,null,null,0,{"$nulls":12},"Cmay",{"v":118920,"d":"118,920"},0,""]
[1302059,"Aritenoidectomía vía endoscópica","MAI",0,{"$nulls":4},0,{"$nulls":28},"CMen",{"v":111780,"d":"111,780"},0]
[1302060,"Aritenoidectomía vía externa","MAI",0,{"$nulls":4},0,{"$nulls":6},0,null,null,0,null,null,0,null,null,0,{"$nulls":12},"Cmay",{"v":152020,"d":"152,020"},0,{"$f":"IF(D1509>=P1509 + S1509+ V1509 + Y1509,\"\",\"La suma no puede ser mayor al total\")","v":""}]
[1302061,"Decorticación de cuerdas vocales c/microscopio","MAI",0,{"$nulls":4},0,{"$nulls":6},0,null,null,0,null,null,0,null,null,0,{"$nulls":12},"Cmay",{"v":133310,"d":"133,310"},0,""]
[1302062,"Cuerdas vocales, tumores benignos, trat. quir.- Por laringotomía","MAI",0,{"$nulls":4},0,{"$nulls":28},"CMen",{"v":110790,"d":"110,790"},0]
[1302063,"Cuerdas vocales, tumores benignos, trat. quir.- Por vía endoscópica","MAI",0,{"$nulls":4},0,{"$nulls":28},"CMen",{"v":110790,"d":"110,790"},0]
[1302064,"Cordectomía laríngea o sinequia cuerdas vocales por vía ext.","MAI",0,{"$nulls":4},0,{"$nulls":6},0,null,null,0,null,null,0,null,null,0,{"$nulls":12},"Cmay",{"v":143100,"d":"143,100"},0,{"$f":"IF(D1513>=P1513 + S1513+ V1513 + Y1513,\"\",\"La suma no puede ser mayor al total\")","v":""}]
[1302065,"Estenosis laringotraqueales y/o faríngeas, trat. quir.","MAI",0,{"$nulls":4},{"$f":"+J1514+K1514","v":0},{"$nulls":6},0,null,null,0,null,null,0,null,null,0,{"$nulls":12},"Cmay",{"v":275530,"d":"275,530"},0,""]
[1302066,"Laringectomía parcial o subtotal (cualquier técnica)","MAI",0,{"$nulls":4},0,{"$nulls":6},{"$f":"SUM(Q1515:R1515)","v":0},null,null,0,null,null,0,null,null,0,{"$nulls":12},"Cmay",{"v":305060,"d":"305,060"},{"$f":"AM1515*I1515","v":0},""]
[1302067,"Laringectomía total más faringectomía parcial","MAI",{"$f":"SUM(J1516:O1516)","v":0},{"$nulls":4},0,{"$nulls":6},0,null,null,{"$f":"SUM(T1516:U1516)","v":0},null,null,{"$f":"SUM(W1516:X1516)","v":0},null,null,{"$f":"SUM(Z1516:AA1516)","v":0},{"$nulls":12},"Cmay",{"v":411960,"d":"411,960"},0,""]
[1302068,"Laringectomía total más faringectomía total y/o esofagectomía cervical","MAI",0,{"$nulls":4},0,{"$nulls":6},0,null,null,0,null,null,0,null,null,0,{"$nulls":12},"Cmay",{"v":622280,"d":"622,280"},0,""]
[1302069,"Laringocele, trat. quir.","MAI",0,{"$nulls":4},0,{"$nulls":6},0,null,null,0,null,null,0,null,null,0,{"$nulls":12},"Cmay",{"v":137580,"d":"137,580"},0,""]
[1302070,"Papilomas laríngeos, trat. quir. (por sesión)","MAI",0,{"$nulls":4},0,{"$nulls":28},"CMen",{"v":43380,"d":"43,380"},0]
[1302071,"Parálisis de cuerdas vocales, trat. quir. cualquier técnica","MAI",0,{"$nulls":4},0,{"$nulls":6},0,null,null,0,null,null,0,null,null,0,{"$nulls":12},"Cmay",{"v":143100,"d":"143,100"},0,{"$f":"IF(D1520>=P1520 + S1520+ V1520 + Y1520,\"\",\"La suma no puede ser mayor al total\")","v":""}]
[1302072,"Traqueostomía (proc. aut.)","MAI",0,{"$nulls":4},0,{"$nulls":6},0,null,null,0,null,null,0,null,null,0,{"$nulls":12},"Cmay",{"v":137580,"d":"137,580"},0,""]
[null,"TOTAL ARANCEL MAI",null,{"$f":"SUM(D1450:D1521)","v":0},{"$nulls":4},{"$f":"SUM(I1450:I1521)","v":0},0,0,0,0,0,0,0,0,0,0,0,0,0,0,0,{"$f":"SUM(Y1450:Y1521)","v":0},0,0,0,0,0,0,0,0,0,0,0,0,0,{"v":10795360,"d":"10,795,360"},0]
[null,"Implante Coclear",null,0,{"$nulls":4},{"$f":"+J1523+K1523","v":0},{"$nulls":6},0,null,null,0,null,null,0,null,null,0,{"$nulls":12},"Cmay",null,{"$f":"AM1523*F1523","v":0},{"$f":"IF(D1523>=P1523 + S1523+ V1523 + Y1523,\"\",\"La suma no puede ser mayor al total\")","v":""}]
[null,"TOTAL ARANCEL MLE Y NO ARANCELADO",null,{"$f":"D1523","v":0},{"$nulls":4},{"$f":"I1523","v":0},0,0,0,0,0,0,0,0,0,0,0,0,0,0,0,0,0,0,0,0,0,0,0,0,0,0,0,0]
[null,"TOTAL PRODUCCION",null,{"$f":"D1522+D1524","v":0},{"$nulls":4},{"$f":"I1522+I1524","v":0},0,0,0,0,0,0,0,0,0,0,0,0,0,0,0,0,0,0,0,0,0,0,0,0,0,0,0,0,null,{"v":10795360,"d":"10,795,360"},0]
[null,"GRUPO 14 : PROCEDIMIENTO DE CABEZA Y CUELLO     "]
[1401001,"Punción aspirativa con aguja fina de nódulo tiroideo","MAI",{"$f":"SUM(E1527+H1527)","v":0},{"$f":"SUM(F1527:G1527)","v":0},{"$nulls":32},"Proc",{"v":10040,"d":"10,040"},{"$f":"AM1527*F1527","v":0}]
[null,"TOTAL",null,{"$f":"D1527","v":0},{"$f":"E1527","v":0},{"$f":"F1527","v":0},{"$f":"G1527","v":0},{"$f":"H1527","v":0},{"$nulls":19},{"$f":"AB1527","v":0},{"$f":"AC1527","v":0},0,0,0,0,0,0,0,0,null,{"v":10040,"d":"10,040"},0]
[null,"CIRUGIA DE CABEZA Y CUELLO"]
[1402001,"Tiroidectomía bilateral total","MAI",{"$f":"SUM(J1530:O1530)","v":0},{"$nulls":4},{"$f":"+J1530+K1530","v":0},{"$nulls":6},{"$f":"SUM(Q1530:R1530)","v":0},null,null,{"$f":"SUM(T1530:U1530)","v":0},null,null,{"$f":"SUM(W1530:X1530)","v":0},null,null,{"$f":"SUM(Z1530:AA1530)","v":0},{"$nulls":12},"Cmay",{"v":281970,"d":"281,970"},{"$f":"AM1530*I1530","v":0},{"$f":"IF(D1530>=P1530 + S1530+ V1530 + Y1530,\"\",\"La suma no puede ser mayor al total\")","v":""}]
[1402002,"Tiroidectomía bilateral subtotal","MAI",{"$f":"SUM(J1531:O1531)","v":0},{"$nulls":4},0,{"$nulls":6},{"$f":"SUM(Q1531:R1531)","v":0},null,null,{"$f":"SUM(T1531:U1531)","v":0},null,null,{"$f":"SUM(W1531:X1531)","v":0},null,null,{"$f":"SUM(Z1531:AA1531)","v":0},{"$nulls":12},"Cmay",{"v":224810,"d":"224,810"},{"$f":"AM1531*I1531","v":0},""]
[1402003,"Bocio intratorácico, trat. quir. por esternotomía","MAI",0,{"$nulls":4},0,{"$nulls":6},{"$f":"SUM(Q1532:R1532)","v":0},null,null,{"$f":"SUM(T1532:U1532)","v":0},null,null,{"$f":"SUM(W1532:X1532)","v":0},null,null,{"$f":"SUM(Z1532:AA1532)","v":0},{"$nulls":12},"Cmay",{"v":338060,"d":"338,060"},0,""]
[1402004,"Extirpación de Tiroides lingual","MAI",0,{"$nulls":4},0,{"$nulls":6},0,null,null,0,null,null,0,null,null,0,{"$nulls":12},"Cmay",{"v":316080,"d":"316,080"},0,""]
[1402005,"Lobectomía con o sin istmectomía o resección parcial","MAI",0,{"$nulls":4},0,{"$nulls":6},0,null,null,0,null,null,0,null,null,0,{"$nulls":12},"Cmay",{"v":196730,"d":"196,730"},0,""]
[1402006,"Tiroidectomía total ampliada (incluye extirpación de estructuras anatómicas vecinas)","MAI",0,{"$nulls":4},0,{"$nulls":6},0,null,null,0,null,null,0,null,null,0,{"$nulls":12},"Cmay",{"v":490190,"d":"490,190"},0,""]
[1402007,"Adenoma y/o hiperplasia, trat. quir.- Autoinjerto de paratiroides (operación asociada a algunas de las prestaciones posteriores)","MAI",0,{"$nulls":4},0,{"$nulls":6},0,null,null,0,null,null,0,null,null,0,{"$nulls":12},"Cmay",{"v":198920,"d":"198,920"},0,""]
[1402008,"Adenoma y/o hiperplasia, trat. quir.- Explor. cervical mas esternotomía por hiperparatiroidismo","MAI",0,{"$nulls":4},0,{"$nulls":6},0,null,null,0,null,null,0,null,null,0,{"$nulls":12},"Cmay",{"v":316080,"d":"316,080"},0,""]
[1402009,"Adenoma y/o hiperplasia, trat. quir.- Exploración cervical por hiperparatiroidismo","MAI",0,{"$nulls":4},0,{"$nulls":6},0,null,null,0,null,null,0,null,null,0,{"$nulls":12},"Cmay",{"v":215970,"d":"215,970"},0,""]
[1402010,"Adenoma y/o hiperplasia, trat. quir.- Reintervención por hiperparatiroidismo","MAI",0,{"$nulls":4},0,{"$nulls":6},0,null,null,0,null,null,0,null,null,0,{"$nulls":12},"Cmay",{"v":288030,"d":"288,030"},0,""]
[1402011,"Parotidectomía suprafacial con disección y preservación del nervio facial","MAI",0,{"$nulls":4},0,{"$nulls":6},0,null,null,0,null,null,0,null,null,0,{"$nulls":12},"Cmay",{"v":152020,"d":"152,020"},0,""]
[1402012,"Parotidectomía total, con disección y preservación del nervio facial.","MAI",0,{"$nulls":4},0,{"$nulls":6},0,null,null,0,null,null,0,null,null,0,{"$nulls":12},"Cmay",{"v":223210,"d":"223,210"},0,""]
[1402013,"Parotidectomía total ampliada (incluye músculos, ganglios, articulaciones y rama vertical de la mandíbula)","MAI",0,{"$nulls":4},0,{"$nulls":6},0,null,null,0,null,null,0,null,null,0,{"$nulls":12},"Cmay",{"v":466820,"d":"466,820"},0,""]
[1402014,"Totalización de parotidectomía previa o parotidectomía del lóbulo profundo","MAI",0,{"$nulls":4},0,{"$nulls":6},0,null,null,0,null,null,0,null,null,0,{"$nulls":12},"Cmay",{"v":258930,"d":"258,930"},0,""]
[1402015,"Sub-mandibulectomía ampliada (incluye piso de la boca, mandíbula, músculos, ganglios y articulaciones)","MAI",0,{"$nulls":4},0,{"$nulls":6},0,null,null,0,null,null,0,null,null,0,{"$nulls":12},"Cmay",{"v":445370,"d":"445,370"},0,""]
[1402016,"Extirpación de glándula salival submandibular","MAI",0,{"$nulls":4},0,{"$nulls":6},0,null,null,0,null,null,0,null,null,0,{"$nulls":12},"Cmay",{"v":152020,"d":"152,020"},0,""]
[1402017,"Extirpación glándula sublingual(una o ambas)","MAI",0,{"$nulls":4},0,{"$nulls":6},0,null,null,0,null,null,0,null,null,0,{"$nulls":12},"Cmay",{"v":118920,"d":"118,920"},0,""]
[1402018,"Extirpación ampliada glándula sublingual (incluye piso de boca, arco mandibular, músculos, ganglios y articulaciones)","MAI",0,{"$nulls":4},0,{"$nulls":6},0,null,null,0,null,null,0,null,null,0,{"$nulls":12},"Cmay",{"v":445370,"d":"445,370"},0,""]
[1402019,"Absceso parotídeo, sub-maxilar y/o cervical profundo, trat. quir.","MAI",0,{"$nulls":4},0,{"$nulls":28},"CMen",{"v":124000,"d":"124,000"},0]
[1402020,"Conductos salivales de excreción, reimplantación oro-faríngea","MAI",0,{"$nulls":4},0,{"$nulls":6},0,null,null,0,null,null,0,null,null,0,{"$nulls":12},"Cmay",{"v":137580,"d":"137,580"},0,{"$f":"IF(D1549>=P1549 + S1549+ V1549 + Y1549,\"\",\"La suma no puede ser mayor al total\")","v":""}]
[1402021,"Cierre de fístula salival: reparación del conducto de excreción","MAI",0,{"$nulls":4},0,{"$nulls":28},"CMen",{"v":124000,"d":"124,000"},0]
[1402022,"Mucocele o quiste labial, trat. quir.","MAI",0,{"$nulls":4},0,{"$nulls":28},"CMen",{"v":65300,"d":"65,300"},0]
[1402023,"Tortícolis congénita, trat. quir.","MAI",0,{"$nulls":4},0,{"$nulls":6},0,null,null,0,null,null,0,null,null,0,{"$nulls":12},"Cmay",{"v":146540,"d":"146,540"},0,{"$f":"IF(D1552>=P1552 + S1552+ V1552 + Y1552,\"\",\"La suma no puede ser mayor al total\")","v":""}]
[1402024,"Quistes y/o fístulas del conducto tirogloso, y/o branquial, y/o higroma, y/o fístula preauricular complicada, y/u otros quistes y/o tumores benignos, trat. quir.","MAI",0,{"$nulls":4},0,{"$nulls":6},0,null,null,0,null,null,0,null,null,0,{"$nulls":12},"Cmay",{"v":146540,"d":"146,540"},0,{"$f":"IF(D1553>=P1553 + S1553+ V1553 + Y1553,\"\",\"La suma no puede ser mayor al total\")","v":""}]
[1402025,"Tumores del cuerpo carotídeo, trat. quir. (incl. proc. vascular)","MAI",0,{"$nulls":4},0,{"$nulls":6},0,null,null,0,null,null,0,null,null,0,{"$nulls":12},"Cmay",{"v":198850,"d":"198,850"},0,{"$f":"IF(D1554>=P1554 + S1554+ V1554 + Y1554,\"\",\"La suma no puede ser mayor al total\")","v":""}]
[1402026,"Biopsia quir., mucosa oronasofaríngea (proc. aut.)","MAI",0,{"$nulls":4},0,{"$nulls":28},"CMen",{"v":20990,"d":"20,990"},0]
[1402027,"Biopsia quir., piel  y mucosa cara (proc. aut.)","MAI",0,{"$nulls":4},0,{"$nulls":28},"CMen",{"v":25670,"d":"25,670"},0]
[1402028,"Resección cutánea ampliada (incluye musculatura, ganglios y huesos subyacentes; desplazamiento de colgajos)","MAI",0,{"$nulls":4},0,{"$nulls":6},0,null,null,0,null,null,0,null,null,0,{"$nulls":12},"Cmay",{"v":152020,"d":"152,020"},0,{"$f":"IF(D1557>=P1557 + S1557+ V1557 + Y1557,\"\",\"La suma no puede ser mayor al total\")","v":""}]
[1402029,"Resección cutánea simple (sutura primaria)","MAI",0,{"$nulls":4},0,{"$nulls":28},"CMen",{"v":35950,"d":"35,950"},0]
[1402030,"Tumor maligno de labio superior o inferior, resección total del labio y cirugía reparadora","MAI",0,{"$nulls":4},0,{"$nulls":6},0,null,null,0,null,null,0,null,null,0,{"$nulls":12},"Cmay",{"v":175880,"d":"175,880"},0,{"$f":"IF(D1559>=P1559 + S1559+ V1559 + Y1559,\"\",\"La suma no puede ser mayor al total\")","v":""}]
[1402031,"Tumor maligno de labio superior o inferior, resección parcial del labio y cirugía reparadora","MAI",0,{"$nulls":4},0,{"$nulls":6},0,null,null,0,null,null,0,null,null,0,{"$nulls":12},"Cmay",{"v":152020,"d":"152,020"},0,""]
[1402032,"Resección parcial y cirugía reparadora","MAI",0,{"$nulls":4},0,{"$nulls":6},0,null,null,0,null,null,0,null,null,0,{"$nulls":12},"Cmay",{"v":137580,"d":"137,580"},0,""]
[1402033,"Resección total y cirugía reparadora","MAI",0,{"$nulls":4},0,{"$nulls":6},0,null,null,0,null,null,0,null,null,0,{"$nulls":12},"Cmay",{"v":152020,"d":"152,020"},0,""]
[1402034,"Resección fronto-naso-etmoidiana","MAI",0,{"$nulls":4},0,{"$nulls":6},0,null,null,0,null,null,0,null,null,0,{"$nulls":12},"Cmay",{"v":216700,"d":"216,700"},0,""]
[1402035,"Exanteración orbitaria ampliada (incluye etmoides, hueso frontal, base de cráneo anterior y región máxilo-malar)","MAI",0,{"$nulls":4},0,{"$nulls":6},0,null,null,0,null,null,0,null,null,0,{"$nulls":12},"Cmay",{"v":555860,"d":"555,860"},0,""]
[1402036,"Extirpacion total ampliada del hueso temporal","MAI",0,{"$nulls":4},0,{"$nulls":6},0,null,null,0,null,null,0,null,null,0,{"$nulls":12},"Cmay",{"v":527440,"d":"527,440"},0,""]
[1402037,"Maxilectomia parcial y reparación protésica","MAI",0,{"$nulls":4},0,{"$nulls":6},0,null,null,0,null,null,0,null,null,0,{"$nulls":12},"Cmay",{"v":188450,"d":"188,450"},0,""]
[1402038,"Parcial (incluye paladar óseo; reparación con colgajo)","MAI",0,{"$nulls":4},0,{"$nulls":6},0,null,null,0,null,null,0,null,null,0,{"$nulls":12},"Cmay",{"v":230110,"d":"230,110"},0,""]
[1402039,"Radical ampliada (incluye exanteración orbitaria y de fosa craneal anterior o media)","MAI",0,{"$nulls":4},0,{"$nulls":6},0,null,null,0,null,null,0,null,null,0,{"$nulls":12},"Cmay",{"v":555860,"d":"555,860"},0,""]
[1402040,"Radical clásica (incluye exanteración orbitaria y reparación con colgajo)","MAI",0,{"$nulls":4},0,{"$nulls":6},0,null,null,0,null,null,0,null,null,0,{"$nulls":12},"Cmay",{"v":505470,"d":"505,470"},0,""]
[1402041,"Radical clásica (incluye exanteración orbitaria y reparación protésica)","MAI",0,{"$nulls":4},0,{"$nulls":6},0,null,null,0,null,null,0,null,null,0,{"$nulls":12},"Cmay",{"v":453470,"d":"453,470"},0,""]
[1402042,"Glosectomía parcial, reparación primaria","MAI",0,{"$nulls":4},0,{"$nulls":6},0,null,null,0,null,null,0,null,null,0,{"$nulls":12},"Cmay",{"v":123950,"d":"123,950"},0,""]
[1402043,"Resección amplia de tumor maligno y disección ganglionar cervical","MAI",0,{"$nulls":4},0,{"$nulls":6},0,null,null,0,null,null,0,null,null,0,{"$nulls":12},"Cmay",{"v":429870,"d":"429,870"},0,""]
[1402044,"Hemimandibulectomía","MAI",0,{"$nulls":4},0,{"$nulls":6},0,null,null,0,null,null,0,null,null,0,{"$nulls":12},"Cmay",{"v":221670,"d":"221,670"},0,""]
[1402045,"Mandibulectomía total","MAI",0,{"$nulls":4},0,{"$nulls":6},0,null,null,0,null,null,0,null,null,0,{"$nulls":12},"Cmay",{"v":372200,"d":"372,200"},0,""]
[1402046,"Operación \"comando\" (incluye extirp. del tumor, hemimandibulectomía y disección ganglionar radical de cuello)","MAI",0,{"$nulls":4},0,{"$nulls":6},0,null,null,0,null,null,0,null,null,0,{"$nulls":12},"Cmay",{"v":611900,"d":"611,900"},0,""]
[1402047,"Resección parcial de mandibula","MAI",0,{"$nulls":4},0,{"$nulls":6},0,null,null,0,null,null,0,null,null,0,{"$nulls":12},"Cmay",{"v":143100,"d":"143,100"},0,""]
[1402048,"Resección tridimensional intra-oral o faríngea ampliada","MAI",0,{"$nulls":4},0,{"$nulls":6},0,null,null,0,null,null,0,null,null,0,{"$nulls":12},"Cmay",{"v":517100,"d":"517,100"},0,""]
[1402050,"Faringectomía parcial","MAI",0,{"$nulls":4},0,{"$nulls":6},0,null,null,0,null,null,0,null,null,0,{"$nulls":12},"Cmay",{"v":152020,"d":"152,020"},0,""]
[1402051,"Genioplastía","MAI",0,{"$nulls":4},0,{"$nulls":6},0,null,null,0,null,null,0,null,null,0,{"$nulls":12},"Cmay",{"v":146540,"d":"146,540"},0,""]
[1402052,"Osteotomias segmentarias del maxilar o mandíbula","MAI",0,{"$nulls":4},0,{"$nulls":6},0,null,null,0,null,null,0,null,null,0,{"$nulls":12},"Cmay",{"v":152020,"d":"152,020"},0,""]
[1402053,"Osteotomias totales del maxilar o mandibula (tipo Le Fort I o sagital de rama)","MAI",0,{"$nulls":4},0,{"$nulls":6},0,null,null,0,null,null,0,null,null,0,{"$nulls":12},"Cmay",{"v":235180,"d":"235,180"},0,""]
[1402054,"Reducción cerrada de fracturas maxilofaciales","MAI",0,{"$nulls":4},0,{"$nulls":28},"CMen",{"v":65250,"d":"65,250"},0]
[1402055,"Reduccion abierta de fracturas maxilofaciales y estabilizacion con elementos de osteosintesis,","MAI",0,{"$nulls":4},0,{"$nulls":6},0,null,null,0,null,null,0,null,null,0,{"$nulls":12},"Cmay",{"v":161800,"d":"161,800"},0,""]
[1402056,"Reducción abierta de fracturas maxilofaciales con osteosintesis única,","MAI",0,{"$nulls":4},0,{"$nulls":28},"CMen",{"v":135950,"d":"135,950"},0]
[1402057,"Reconstrucciones complejas de la cara simultáneas con proc. neuroquirúrgico (craneotomías más abordajes y trat. facial), tiempo facial","MAI",0,{"$nulls":4},0,{"$nulls":6},0,null,null,0,null,null,0,null,null,0,{"$nulls":12},"Cmay",{"v":453470,"d":"453,470"},0,""]
[1402058,"Reconstrucciones de partes duras y blandas de la cara, mediante abordajes múltiples y hemicoronal o coronal","MAI",0,{"$nulls":4},0,{"$nulls":6},0,null,null,0,null,null,0,null,null,0,{"$nulls":12},"Cmay",{"v":284570,"d":"284,570"},0,""]
[1402059,"Remoción de arcos dentarios o ligaduras de alambre ","MAI",0,{"$nulls":4},0,{"$nulls":28},"CMen",{"v":45460,"d":"45,460"},0]
[1402060,"Reducción simple fractura maxilo facial (proc. aut.)","MAI",0,{"$nulls":4},0,{"$nulls":28},"CMen",{"v":39050,"d":"39,050"},0]
[null,"TOTAL",null,{"$f":"SUM(D1530:D1588)","v":0},{"$nulls":4},{"$f":"SUM(I1530:I1588)","v":0},0,0,0,0,0,0,0,0,0,0,0,0,0,0,0,0,0,0,0,0,0,0,0,0,0,0,0,0,0,{"v":14448900,"d":"14,448,900"},0]
[null,"GRUPO 15 : CIRUGIA PLASTICA Y REPARADORA     ",null,{"$f":"AM1590*F1590","v":0}]
[null,"CIRUGIA PLASTICA Y REPARADORA                               "]
[1502001,"Heridas de la cara Complicadas: 1 o varias de más de 5 cms. y/o ubicadas en bordes de párpados, labios o ala nasal y/o que comprometen músculos, conductos, vasos o nervios","MAI",{"$f":"SUM(J1592:O1592)","v":0},{"$nulls":4},{"$f":"+J1592+K1592","v":0},{"$nulls":28},"CMen",{"v":107860,"d":"107,860"},{"$f":"AM1592*I1592","v":0}]
[1502002,"Heridas de la cara- Simples: 1 o varias de hasta 5 cms. que sólo comprometen piel","MAI",{"$f":"SUM(J1593:O1593)","v":0},{"$nulls":4},0,{"$nulls":28},"CMen",{"v":30400,"d":"30,400"},{"$f":"AM1593*I1593","v":0}]
[1502003,"Implante de silicona facial (cualquier zona o zonas)","MAI",{"$f":"SUM(J1594:O1594)","v":0},{"$nulls":4},0,{"$nulls":28},"CMen",{"v":84460,"d":"84,460"},0]
[1502004,"Resección plástica de hasta 2 cicatrices (cualquier localización o tamaño)","MAI",0,{"$nulls":4},0,{"$nulls":28},"CMen",{"v":101430,"d":"101,430"},0]
[1502005,"Cicatrices (cualquier localización o tamaño), resecc. plástica de (proc. aut.)- 3 y más","MAI",0,{"$nulls":4},0,{"$nulls":28},"CMen",{"v":118240,"d":"118,240"},0]
[1502006,"Resección plástica de 3 o más cicatrices (cualquier localización o tamaño) ","MAI",0,{"$nulls":4},0,{"$nulls":28},"CMen",{"v":31270,"d":"31,270"},0]
[1502007,"Injertos piel parcial y/o mucosa- Hasta 5% superficie corporal receptora","MAI",0,{"$nulls":4},0,{"$nulls":28},"CMen",{"v":50680,"d":"50,680"},0]
[1502008,"Injertos hasta 10% superficie corporal receptora","MAI",0,{"$nulls":4},0,{"$nulls":6},{"$f":"SUM(Q1599:R1599)","v":0},null,null,{"$f":"SUM(T1599:U1599)","v":0},null,null,{"$f":"SUM(W1599:X1599)","v":0},null,null,{"$f":"SUM(Z1599:AA1599)","v":0},{"$nulls":12},"Cmay",{"v":89000,"d":"89,000"},0,{"$f":"IF(D1599>=P1599 + S1599+ V1599 + Y1599,\"\",\"La suma no puede ser mayor al total\")","v":""}]
[1502009,"Injertos piel parcial y/o mucosa- Por cada 10% (o su fracción) adicional hasta 50%","MAI",0,{"$nulls":4},0,{"$nulls":6},0,null,null,0,null,null,0,null,null,0,{"$nulls":12},"Cmay",{"v":59000,"d":"59,000"},0,""]
[1502010,"Injertos piel parcial y/o mucosa- 51% y más de superficie corporal receptora","MAI",0,{"$nulls":4},0,{"$nulls":6},0,null,null,0,null,null,0,null,null,0,{"$nulls":12},"Cmay",{"v":344540,"d":"344,540"},0,""]
[1502011,"Piel total, cualquier tamaño (incluye tratamiento zona dadora y receptora)","MAI",0,{"$nulls":4},0,{"$nulls":6},0,null,null,0,null,null,0,null,null,0,{"$nulls":12},"Cmay",{"v":154340,"d":"154,340"},0,""]
[1502012,"Toma de injertos- Cartílago (auricular, costal o similares) c/u","MAI",0,{"$nulls":4},0,{"$nulls":28},"CMen",{"v":107860,"d":"107,860"},0]
[1502013,"Toma de injertos- Oseo (costal, ilíaco, tibial o similares) c/u","MAI",0,{"$nulls":4},0,{"$nulls":6},0,null,null,0,null,null,0,null,null,0,{"$nulls":12},"Cmay",{"v":138150,"d":"138,150"},0,{"$f":"IF(D1604>=P1604 + S1604+ V1604 + Y1604,\"\",\"La suma no puede ser mayor al total\")","v":""}]
[1502014,"Plastías en Z- Hasta 3","MAI",0,{"$nulls":4},0,{"$nulls":28},"CMen",{"v":107860,"d":"107,860"},0]
[1502015,"Plastías en Z- 4 y más","MAI",0,{"$nulls":4},0,{"$nulls":6},0,null,null,0,null,null,0,null,null,0,{"$nulls":12},"Cmay",{"v":137580,"d":"137,580"},0,{"$f":"IF(D1606>=P1606 + S1606+ V1606 + Y1606,\"\",\"La suma no puede ser mayor al total\")","v":""}]
[1502016,"Colgajos complejos (Abbe, Mustarda, Converse, Juri, Bakamjian o similar)","MAI",0,{"$nulls":4},0,{"$nulls":6},0,null,null,0,null,null,0,null,null,0,{"$nulls":12},"Cmay",{"v":183230,"d":"183,230"},0,""]
[1502017,"Colgajos libres con microanastomosis (incluye toma del colgajo y las suturas neurovasculares)","MAI",0,{"$nulls":4},0,{"$nulls":6},0,null,null,0,null,null,0,null,null,0,{"$nulls":12},"Cmay",{"v":487620,"d":"487,620"},0,""]
[1502018,"Colgajos musculares o musculocutáneos","MAI",0,{"$nulls":4},0,{"$nulls":6},0,null,null,0,null,null,0,null,null,0,{"$nulls":12},"Cmay",{"v":250780,"d":"250,780"},0,""]
[1502019,"Colgajos osteomusculocutáneos","MAI",0,{"$nulls":4},0,{"$nulls":6},0,null,null,0,null,null,0,null,null,0,{"$nulls":12},"Cmay",{"v":372560,"d":"372,560"},0,""]
[1502020,"Colgajos simples dos o más","MAI",0,{"$nulls":4},0,{"$nulls":6},0,null,null,0,null,null,0,null,null,0,{"$nulls":12},"Cmay",{"v":152020,"d":"152,020"},0,""]
[1502021,"Colgajo simple único","MAI",0,{"$nulls":4},0,{"$nulls":6},0,null,null,0,null,null,0,null,null,0,{"$nulls":12},"Cmay",{"v":104620,"d":"104,620"},0,""]
[1502022,"Parálisis facial, trasplantes musculares","MAI",0,{"$nulls":4},0,{"$nulls":6},0,null,null,0,null,null,0,null,null,0,{"$nulls":12},"Cmay",{"v":207120,"d":"207,120"},0,""]
[1502023,"Ridectomía- Cérvico-facial, un lado","MAI",0,{"$nulls":4},0,{"$nulls":6},0,null,null,0,null,null,0,null,null,0,{"$nulls":12},"Cmay",{"v":165480,"d":"165,480"},0,""]
[1502024,"Ridectomía- Frontal","MAI",0,{"$nulls":4},0,{"$nulls":6},0,null,null,0,null,null,0,null,null,0,{"$nulls":12},"Cmay",{"v":143100,"d":"143,100"},0,""]
[1502025,"Aladas o en asa, corrección plástica","MAI",0,{"$nulls":4},0,{"$nulls":28},"CMen",{"v":130580,"d":"130,580"},0]
[1502026,"Lóbulo auricular partido, corrección plástica (proc. aut)","MAI",0,{"$nulls":4},0,{"$nulls":28},"CMen",{"v":31270,"d":"31,270"},0]
[1502027,"Malformación congénita compleja, cada plastía o plastías en tiempos diferentes","MAI",0,{"$nulls":4},0,{"$nulls":6},0,null,null,0,null,null,0,null,null,0,{"$nulls":12},"Cmay",{"v":143100,"d":"143,100"},0,{"$f":"IF(D1618>=P1618 + S1618+ V1618 + Y1618,\"\",\"La suma no puede ser mayor al total\")","v":""}]
[1502028,"Corrección nasal parcial (alares, alargamiento columela o similar)","MAI",0,{"$nulls":4},0,{"$nulls":6},0,null,null,0,null,null,0,null,null,0,{"$nulls":12},"Cmay",{"v":137580,"d":"137,580"},0,""]
[1502029,"Blefaroplastía uno o ambos párpados:- Inferiores","MAI",0,{"$nulls":4},0,{"$nulls":6},0,null,null,0,null,null,0,null,null,0,{"$nulls":12},"Cmay",{"v":143100,"d":"143,100"},0,""]
[1502030,"Blefaroplastía uno o ambos párpados:- Superiores","MAI",0,{"$nulls":4},0,{"$nulls":6},0,null,null,0,null,null,0,null,null,0,{"$nulls":12},"Cmay",{"v":144590,"d":"144,590"},0,""]
[1502031,"Corrección quirúrgica secundaria de queiloplastía","MAI",0,{"$nulls":4},0,{"$nulls":6},0,null,null,0,null,null,0,null,null,0,{"$nulls":12},"Cmay",{"v":143100,"d":"143,100"},0,""]
[1502032,"Queiloplastía primaria, un lado (proc. quir. completo por cualquier técnica)","MAI",0,{"$nulls":4},0,{"$nulls":6},0,null,null,0,null,null,0,null,null,0,{"$nulls":12},"Cmay",{"v":143100,"d":"143,100"},0,""]
[1502033,"Cierre de paladar duro y/o cierre de comunicación oro-nasal","MAI",0,{"$nulls":4},0,{"$nulls":6},0,null,null,0,null,null,0,null,null,0,{"$nulls":12},"Cmay",{"v":143100,"d":"143,100"},0,""]
[1502034,"Cierre mucoso vestíbulo oral","MAI",0,{"$nulls":4},0,{"$nulls":6},0,null,null,0,null,null,0,null,null,0,{"$nulls":12},"Cmay",{"v":143100,"d":"143,100"},0,""]
[1502035,"Plastía de velo (cualquier técnica)","MAI",0,{"$nulls":4},0,{"$nulls":6},0,null,null,0,null,null,0,null,null,0,{"$nulls":12},"Cmay",{"v":143100,"d":"143,100"},0,""]
[1502036,"Cierre de macrostomía, un lado","MAI",0,{"$nulls":4},0,{"$nulls":6},0,null,null,0,null,null,0,null,null,0,{"$nulls":12},"Cmay",{"v":137580,"d":"137,580"},0,""]
[1502037,"Tratamiento quirurgico de anomalías cráneo faciales","MAI",0,{"$nulls":4},0,{"$nulls":6},0,null,null,0,null,null,0,null,null,0,{"$nulls":12},"Cmay",{"v":256020,"d":"256,020"},0,""]
[1502038,"Reconst. Osteopl.reborde alveolar- Bilateral en un tiempo","MAI",0,{"$nulls":4},0,{"$nulls":6},0,null,null,0,null,null,0,null,null,0,{"$nulls":12},"Cmay",{"v":207120,"d":"207,120"},0,""]
[1502039,"Reconst. Osteopl.reborde alveolar - Unilateral","MAI",0,{"$nulls":4},0,{"$nulls":6},0,null,null,0,null,null,0,null,null,0,{"$nulls":12},"Cmay",{"v":151390,"d":"151,390"},0,""]
[1502040,"Distoplasias orbitarias: movilización unilateral o vertical tiempo facial","MAI",0,{"$nulls":4},0,{"$nulls":6},0,null,null,0,null,null,0,null,null,0,{"$nulls":12},"Cmay",{"v":475500,"d":"475,500"},0,""]
[1502041,"Expansión o reconstrucción de un micro-orbitismo","MAI",0,{"$nulls":4},0,{"$nulls":6},0,null,null,0,null,null,0,null,null,0,{"$nulls":12},"Cmay",{"v":475500,"d":"475,500"},0,""]
[1502042,"Síndrome de Apert Crouzon o similar: avance fronto-órbito-maxilar vía intracraneana, tiempo facial","MAI",0,{"$nulls":4},0,{"$nulls":6},0,null,null,0,null,null,0,null,null,0,{"$nulls":12},"Cmay",{"v":555860,"d":"555,860"},0,""]
[1502043,"Síndrome de Apert Crouzon o similar: osteotomía tipo Le Fort III o similar","MAI",0,{"$nulls":4},0,{"$nulls":6},0,null,null,0,null,null,0,null,null,0,{"$nulls":12},"Cmay",{"v":555860,"d":"555,860"},0,""]
[1502044,"Corrección telecanto","MAI",0,{"$nulls":4},0,{"$nulls":6},0,null,null,0,null,null,0,null,null,0,{"$nulls":12},"Cmay",{"v":165480,"d":"165,480"},0,""]
[1502045,"Movilización orbitaria extracraneana","MAI",0,{"$nulls":4},0,{"$nulls":6},0,null,null,0,null,null,0,null,null,0,{"$nulls":12},"Cmay",{"v":475500,"d":"475,500"},0,""]
[1502046,"Movilización orbitaria intracraneana, tiempo facial","MAI",0,{"$nulls":4},0,{"$nulls":6},0,null,null,0,null,null,0,null,null,0,{"$nulls":12},"Cmay",{"v":580710,"d":"580,710"},0,""]
[1502047,"Ginecomastía, corrección plástica","MAI",0,{"$nulls":4},0,{"$nulls":6},0,null,null,0,null,null,0,null,null,0,{"$nulls":12},"Cmay",{"v":138150,"d":"138,150"},0,""]
[1502048,"Mamoplastía de aumento","MAI",0,{"$nulls":4},0,{"$nulls":6},0,null,null,0,null,null,0,null,null,0,{"$nulls":12},"Cmay",{"v":146540,"d":"146,540"},0,""]
[1502049,"Mamoplastía de reducción","MAI",0,{"$nulls":4},0,{"$nulls":6},0,null,null,0,null,null,0,null,null,0,{"$nulls":12},"Cmay",{"v":178190,"d":"178,190"},0,""]
[1502050,"Mastopexia c/s implante de prótesis (no incluye valor de la prótesis)","MAI",0,{"$nulls":4},0,{"$nulls":6},0,null,null,0,null,null,0,null,null,0,{"$nulls":12},"Cmay",{"v":147080,"d":"147,080"},0,""]
[1502051,"Reconstrucción areola y/o pezón c/s plastía (proc. aut.)","MAI",0,{"$nulls":4},0,{"$nulls":6},0,null,null,0,null,null,0,null,null,0,{"$nulls":12},"Cmay",{"v":114990,"d":"114,990"},0,""]
[1502052,"Reconstrucción mamaria","MAI",0,{"$nulls":4},0,{"$nulls":6},0,null,null,0,null,null,0,null,null,0,{"$nulls":12},"Cmay",{"v":209190,"d":"209,190"},0,""]
[1502053,"Abdominoplastia","MAI",0,{"$nulls":4},0,{"$nulls":6},0,null,null,0,null,null,0,null,null,0,{"$nulls":12},"Cmay",{"v":203440,"d":"203,440"},0,""]
[1502054,"Con resección ósea c/s colgajo de rotación","MAI",0,{"$nulls":4},0,{"$nulls":6},0,null,null,0,null,null,0,null,null,0,{"$nulls":12},"Cmay",{"v":159630,"d":"159,630"},0,""]
[1502055,"Con resección ósea y colgajos musculares o musculocutáneos","MAI",0,{"$nulls":4},0,{"$nulls":6},0,null,null,0,null,null,0,null,null,0,{"$nulls":12},"Cmay",{"v":256020,"d":"256,020"},0,""]
[1502056,"Sindactilia, trat. quir. cada espacio- con injerto","MAI",0,{"$nulls":4},0,{"$nulls":6},0,null,null,0,null,null,0,null,null,0,{"$nulls":12},"Cmay",{"v":114990,"d":"114,990"},0,""]
[1502057,"Sindactilia, trat. quir. cada espacio- Sin injerto","MAI",0,{"$nulls":4},0,{"$nulls":28},"CMen",{"v":50680,"d":"50,680"},0]
[1502058,"Polidactilia, extirpación y plastía un lado","MAI",0,{"$nulls":4},0,{"$nulls":6},0,null,null,0,null,null,0,null,null,0,{"$nulls":12},"Cmay",{"v":114990,"d":"114,990"},0,{"$f":"IF(D1649>=P1649 + S1649+ V1649 + Y1649,\"\",\"La suma no puede ser mayor al total\")","v":""}]
[1502059,"Lipectomía glútea, un lado","MAI",0,{"$nulls":4},0,{"$nulls":6},0,null,null,0,null,null,0,null,null,0,{"$nulls":12},"Cmay",{"v":123950,"d":"123,950"},0,""]
[1502060,"Lipectomía trocánterea, un lado","MAI",0,{"$nulls":4},0,{"$nulls":6},0,null,null,0,null,null,0,null,null,0,{"$nulls":12},"Cmay",{"v":123950,"d":"123,950"},0,""]
[1502061,"Escarotomía- Hasta 10 % superficie corporal","MAI",0,{"$nulls":4},0,{"$nulls":28},"CMen",{"v":30940,"d":"30,940"},0]
[1502062,"Escarotomía- Por cada 10 % adicional (o su fracción)","MAI",0,{"$nulls":4},0,{"$nulls":28},"CMen",{"v":20990,"d":"20,990"},0]
[1502063,"Escarectomía- Hasta 1 % superficie corporal","MAI",0,{"$nulls":4},0,{"$nulls":28},"CMen",{"v":44240,"d":"44,240"},0]
[1502064,"Escarectomía- Hasta 5 % superficie corporal","MAI",0,{"$nulls":4},0,{"$nulls":28},"CMen",{"v":66280,"d":"66,280"},0]
[1502065,"Escarectomía- Hasta 10% superficie corporal","MAI",0,{"$nulls":4},{"$f":"+J1656+K1656","v":0},{"$nulls":6},0,null,null,0,null,null,0,null,null,0,{"$nulls":12},"Cmay",{"v":118920,"d":"118,920"},0,{"$f":"IF(D1656>=P1656 + S1656+ V1656 + Y1656,\"\",\"La suma no puede ser mayor al total\")","v":""}]
[1502066,"Escarectomía- Por cada 10% adicional (o su fracción)","MAI",0,{"$nulls":4},0,{"$nulls":6},0,null,null,0,null,null,0,null,null,0,{"$nulls":12},"Cmay",{"v":71990,"d":"71,990"},{"$f":"AM1657*I1657","v":0},""]
[null,"TOTAL",null,{"$f":"SUM(D1592:D1657)","v":0},{"$nulls":4},{"$f":"SUM(I1592:I1657)","v":0},0,0,0,0,0,0,0,0,0,0,0,0,0,0,0,0,0,0,0,0,0,0,0,0,0,0,0,0,null,{"v":11646590,"d":"11,646,590"},0]
[null,"DERMATOLOGIA Y TEGUMENTOS"]
[1601110,"Curetaje de lesiones virales o similares hasta 10 lesiones                          ","MLE",{"$f":"SUM(E1660+H1660)","v":0},{"$f":"SUM(F1660:G1660)","v":0},{"$nulls":32},"Proc"]
[1601111,"Aplicación de inmunomodulares, quimicos y similares hasta 10 lesiones","MLE",{"$f":"SUM(E1661+H1661)","v":0},{"$f":"SUM(F1661:G1661)","v":0},{"$nulls":32},"Proc"]
[1601112,"Fototerapia UVB, UVA localizada, por sesion ","MLE",0,0,{"$nulls":32},"Proc"]
[1601113,"Fototerapia UVB, banda angosta y UVA por sesion  en cabina","MLE",0,0,{"$nulls":32},"Proc"]
[1601115,"Implantes subcutaneos                                                                              ","MLE",0,0,{"$nulls":32},"Proc"]
[1601116,"Crioterapia hasta 5 lesiones","MLE",0,0,{"$nulls":32},"Proc"]
[1601117,"Crioterapia 6 a 10 lesiones","MLE",0,0,{"$nulls":32},"Proc"]
[1601118,"Tumor maligno por criocirugia (por cada lesion)","MLE",0,0,{"$nulls":32},"Proc"]
[1601119,"Inyeccion intracutanea en areas hasta 9 cms2","MLE",0,0,{"$nulls":32},"Proc"]
[1601120,"Tratamiento abrasivo cutaneo mecanico","MLE",0,0,{"$nulls":32},"Proc"]
[1601121,"Tratamiento abrasivo cutaneo  quimico","MLE",0,0,{"$nulls":32},"Proc"]
[1601122,"Tricograma","MLE",0,0,{"$nulls":32},"Proc"]
[1601124,"Tratamiento por laser, IPL o similar por area hasta 16 cm2","MLE",0,0,{"$nulls":32},"Proc"]
[1601125,"Terapia fotodinamica ( no incluye medicamento)","MLE",0,0,{"$nulls":32},"Proc"]
[1601126,"Dermatoscopia digital con registro graficos hasta 5 lesiones ","MLE",0,0,{"$nulls":32},"Proc"]
[" 5099053 ","Curetaje de lesiones y similares hasta 10 lesiones ",null,0,0,{"$nulls":32},"Proc"]
[null,"TOTAL",null,{"$f":"SUM(D1660:D1675)","v":0},{"$f":"SUM(E1660:E1675)","v":0},0,0,0,{"$nulls":19},{"$f":"SUM(AB1660:AB1675)","v":0},{"$f":"SUM(AC1660:AC1675)","v":0},0,0,0,0,0,0,0,0]
[null,"GRUPO 16 : DERMATOLOGIA Y TEGUMENTOS       "]
[null,"INTERVENCIONES QUIRURGICAS DE TEGUMENTOS                    "]
[1602201,"Biopsia de piel y/o mucosa por curetaje o sección tangencial c/s electro x 1 sesion        ","MAI",{"$f":"SUM(J1679:O1679)","v":0},{"$nulls":4},{"$f":"+J1679+K1679","v":0},{"$nulls":28},"CMen",{"v":34110,"d":"34,110"},{"$f":"AM1679*I1679","v":0}]
[1602202,"Extirpacion de, reparacion o biopsia total o parcial, de lesiones benignas cutáneas por excision cabeza, cuello, genitales, hasta 3 lesiones                                                                  ","MAI",{"$f":"SUM(J1680:O1680)","v":0},{"$nulls":4},0,{"$nulls":28},"CMen",{"v":60190,"d":"60,190"},{"$f":"AM1680*I1680","v":0}]
[1602203,"Extirpacion de, reparacion o biopsia total o parcial, de lesiones benignas cutáneas por excision resto de cuerpo hasta 3 lesiones                                                                              ","MAI",{"$f":"SUM(J1681:O1681)","v":0},{"$nulls":4},0,{"$nulls":28},"CMen",{"v":40130,"d":"40,130"},0]
[1602204,"Extirpacion de, reparacion o biopsia total o parcial, de lesiones benignas cutáneas por excision cabeza, cuello, genitales, desde 4 hasta 6 lesiones                                              ","MAI",0,{"$nulls":4},0,{"$nulls":28},"CMen",{"v":120390,"d":"120,390"},0]
[1602205,"Extirpacion de, reparacion o biopsia total o parcial, de lesiones benignas cutáneas por excision resto de cuerpo desde 4 hasta 6 lesiones                                                             ","MAI",0,{"$nulls":4},0,{"$nulls":28},"CMen",{"v":80250,"d":"80,250"},0]
[1602206,"Extirpacion de lesiones benignas por sec tangencial ,curetaje,y/o fulguracion hasta 15 lesiones   ","MAI",0,{"$nulls":4},0,{"$nulls":28},"CMen",{"v":40130,"d":"40,130"},0]
[1602207,"Tratamiento por electro de hemangiomas o telangectasias hasta 15 lesiones","MAI",0,{"$nulls":4},0,{"$nulls":28},"CMen",{"v":40130,"d":"40,130"},0]
[1602211,"Tumor maligno por excision total o parcial, con o sin sutura, por cada lesion cabeza, cuello, genitales","MAI",0,{"$nulls":4},0,{"$nulls":28},"CMen",{"v":125410,"d":"125,410"},0]
[1602212,"Tumor maligno por excision total o parcial, con o sin sutura, por cada lesion resto del cuerpo","MAI",0,{"$nulls":4},0,{"$nulls":28},"CMen",{"v":100320,"d":"100,320"},0]
[1602213,"Ampliacion de margenes quirurgicos de tumor maligno extirpado previamente cabeza, cuello, genitales o melanoma cualquier ubicación","MAI",0,{"$nulls":4},0,{"$nulls":28},"CMen",{"v":100320,"d":"100,320"},0]
[1602214,"Ampliacion de margenes quirurgicos de tumor maligno extirpado previamente resto del cuerpo","MAI",0,{"$nulls":4},0,{"$nulls":28},"CMen",{"v":75240,"d":"75,240"},0]
[1602215,"Tumores vasculares profundos cara, cuero cabelludo, cuello, genitales","MAI",0,{"$nulls":4},0,{"$nulls":28},"CMen",{"v":125410,"d":"125,410"},0]
[1602216,"Tumores vasculares profundos resto del cuerpo","MAI",0,{"$nulls":4},0,{"$nulls":28},"CMen",{"v":100320,"d":"100,320"},0]
[1602221,"Herida cortante o contusa complicada, reparacion y sutura (una o multiples de mas de 5 cms de largo total y/o que comprometa músculos y/o conductos y/o vasos o  similares ","MAI",0,{"$nulls":4},0,{"$nulls":28},"CMen",{"v":57290,"d":"57,290"},0]
[1602222,"Herida cortante o contusa NO complicada, reparacion y sutura (una o multiples de mas de 5 cms de largo total y/o que comprometa solo piel)                                                                             ","MAI",0,{"$nulls":4},0,{"$nulls":28},"CMen",{"v":15430,"d":"15,430"},0]
[1602223,"Extirpacion de lesión benigna subepidemica, incluye tumor solido, quiste epidemico y lipoma por lesion cara, cuello cabelludo. Cuello, genitales.","MAI",0,{"$nulls":4},0,{"$nulls":28},"CMen",{"v":75240,"d":"75,240"},0]
[1602224,"Extirpacion de lesión benigna subepidemica, incluye tumor solido, quiste epidemico y lipoma por lesion  resto del cuerpo                                                                                                                  ","MAI",0,{"$nulls":4},0,{"$nulls":28},"CMen",{"v":62690,"d":"62,690"},0]
[1602225,"Vaciamiento y curetaje quirurgico de lesiones quistica o abscesos                              ","MAI",0,{"$nulls":4},0,{"$nulls":28},"CMen",{"v":40130,"d":"40,130"},0]
[1602231,"Onisectomia total o parcial simple                                                                                      ","MAI",0,{"$nulls":4},0,{"$nulls":28},"CMen",{"v":16040,"d":"16,040"},0]
[1602232,"Cirugia reparadora ungueal por proceso inflamatorio                                                                 ","MAI",0,{"$nulls":4},0,{"$nulls":28},"CMen",{"v":50170,"d":"50,170"},0]
[1602233,"Correccion quirurgica de defecto congenito o por tumor ungueal","MAI",0,{"$nulls":4},0,{"$nulls":28},"CMen",{"v":80250,"d":"80,250"},0]
[1602240,"Curacion por medico, quemadura o similar menor al 5% superficie corporal en pabellon       ","MAI",0,{"$nulls":4},0,{"$nulls":28},"CMen",{"v":11140,"d":"11,140"},0]
[1602241,"Curacion por medico, quemadura o similar  5 a 10% superficie corporal en pabellon        ","MAI",0,{"$nulls":4},0,{"$nulls":28},"CMen",{"v":20060,"d":"20,060"},0]
[1602242,"Curacion por medico, quemadura o similar  mayor  al 10% superficie corporal en pabellon","MAI",0,{"$nulls":4},0,{"$nulls":6},{"$f":"SUM(Q1702:R1702)","v":0},null,null,{"$f":"SUM(T1702:U1702)","v":0},null,null,{"$f":"SUM(W1702:X1702)","v":0},null,null,{"$f":"SUM(Z1702:AA1702)","v":0},{"$nulls":12},"Cmay",{"v":36110,"d":"36,110"},0,{"$f":"IF(D1702>=P1702 + S1702+ V1702 + Y1702,\"\",\"La suma no puede ser mayor al total\")","v":""}]
[null,"TOTAL",null,{"$f":"SUM(D1679:D1702)","v":0},{"$nulls":4},{"$f":"SUM(I1679:I1702)","v":0},0,0,0,0,0,0,0,0,0,0,0,0,0,0,0,0,0,0,0,0,0,0,0,0,0,0,0,0,null,{"v":1506900,"d":"1,506,900"},0]
["GRUPO 17: PROCEDIM.CARDIOLOGIA, NEUMOLOG., CARDIOVASC. Y TORAX    "]
[1701002,"Electrocardiograma esofagico","MLE",{"$f":"SUM(E1705+H1705)","v":0},{"$f":"SUM(F1705:G1705)","v":0},{"$nulls":32},"Proc"]
[1701004,"Electrocardiograma de esfuerzo en adultos o ninos","MLE",0,0,{"$nulls":32},"Proc"]
[1701005,"Mapeo epicardico durante intervencion quirurgica","MLE",0,0,{"$nulls":32},"Proc"]
[1701055,"Ecocardiagrama doppler color transesofagico","MLE",0,0,{"$nulls":32},"Proc"]
[1701009,"Monitoreo continuo de presion arterial                                                                         ","MLE",0,0,{"$nulls":32},"Proc"]
[1701013,"Cateterismo en recien nacido por arteria umbilical","MLE",0,0,{"$nulls":32},"Proc"]
[1701014,"Instalacion de cateter swan-ganz o similar, en adultos o ninos","MLE",0,0,{"$nulls":32},"Proc"]
[1701015,"Doppler con ergometria (por sesion)","MLE",0,0,{"$nulls":32},"Proc"]
[1701016,"Doppler simple de vasos perifericos (por sesion)","MLE",0,0,{"$nulls":32},"Proc"]
[1701017,"Pletismografia en reposo, esfuerzo c/u (por sesion)","MLE",0,0,{"$nulls":32},"Proc"]
[1701018,"Registro ecoarterial o ecovenoso periferico c/u (por sesion)","MLE",0,0,{"$nulls":32},"Proc"]
[1701025,"Cavografia (a.c. 04-02-035)","MLE",0,0,{"$nulls":32},"Proc"]
[1701026,"Flebografia de cada extremidad (a.c.04-02-038)","MLE",0,0,{"$nulls":32},"Proc"]
[1701027,"Flebografia yugular, suprarrenal, portografia transhepaticas, lumbar, espermatica o similar c/u (a.c. 04-02-041)","MLE",0,0,{"$nulls":32},"Proc"]
[1701030,"Punción evacuadora de pericardio, c/s toma de muestra c/s inyección de medicamento","MLE",0,0,{"$nulls":32},"Proc"]
[1701031,"Angioplastia intraluminal coronaria proc.cardiológico (a.c.04-02-022)","MLE",0,0,{"$nulls":32},"Proc"]
[1701032,"Angioplastia intraluminal periférica proc.cardiológico (a.c.04-02-023)","MLE",0,0,{"$nulls":32},"Proc"]
[1701034,"Cardioversion","MLE",0,0,{"$nulls":32},"Proc"]
[1701036,"Desfibrilacion","MLE",0,0,{"$nulls":32},"Proc"]
[1701037,"Puncion subclavia o yugular con colocacion de cateter","MLE",0,0,{"$nulls":32},"Proc"]
[1701039,"Trombolisis arterial periferica","MLE",0,0,{"$nulls":32},"Proc"]
[1701040,"Trombolisis intracoronaria","MLE",0,0,{"$nulls":32},"Proc"]
[1701041,"Valvuloplastia mitral (a.c. 04-02-033)","MLE",0,0,{"$nulls":32},"Proc"]
[1701042,"Valvuloplastia aortica y/o pulmonar,c/u (a.c. 04-02-033)","MLE",0,0,{"$nulls":32},"Proc"]
[1701046,"Estudio electrofisiologico endocardiaco de las arritmias","MLE",0,0,{"$nulls":32},"Proc"]
[1701050,"Ablacion con corriente continua o radiofrecuencia de nodulo","MLE",0,0,{"$nulls":32},"Proc"]
[1701051,"Ablacion con corriente continua o con radiofrecuencia de vias accesorias y otros","MLE",{"$f":"SUM(E1731+H1731)","v":0},{"$f":"SUM(F1731:G1731)","v":0},{"$nulls":32},"Proc"]
[1707001,"Espirometría Basal                                                                                       ","MLE",0,0,{"$nulls":32},"Proc"]
[1707002,"Espirometria basal y con broncodilatador                                                         ","MLE",0,0,{"$nulls":32},"Proc"]
[1707003,"Provocacion con antigeno (incluye el antigeno)","MLE",0,0,{"$nulls":32},"Proc"]
[1707004,"Test de provocacion con ejercicio                                                                      ","MLE",0,0,{"$nulls":32},"Proc"]
[1707005,"Provocacion con histamina (pd 20),test de, (incluye la espirometría basal y el tratamiento de los efectos advesos de la histamina)","MLE",0,0,{"$nulls":32},"Proc"]
[1707050,"Provocacion bronquial con histamina y/o metacolina","MLE",0,0,{"$nulls":32},"Proc"]
[1707051,"Curva dosis respuesta a broncodilatadores.","MLE",0,0,{"$nulls":32},"Proc"]
[1707006,"Test espirometrico de posicion lateral","MLE",0,0,{"$nulls":32},"Proc"]
[1707007,"Analisis de gas espirado","MLE",0,0,{"$nulls":32},"Proc"]
[1707008,"Capacidad de difusion, estudio de","MLE",0,0,{"$nulls":32},"Proc"]
[1707009,"Capacidad fisica del trabajo","MLE",0,0,{"$nulls":32},"Proc"]
[1707010,"Curva de lavado de nitrogeno (n)","MLE",0,0,{"$nulls":32},"Proc"]
[1707011,"Curva de relajacion flujovolumen basal ","MLE",0,0,{"$nulls":32},"Proc"]
[1707012,"Distensibilidad pulmonar, (\"compliance\"), estudio de","MLE",0,0,{"$nulls":32},"Proc"]
[1707013,"Medicion de presion de oclusion","MLE",0,0,{"$nulls":32},"Proc"]
[1707014,"Medicion de presion inspiratoria maxima (proc. Aut.)","MLE",0,0,{"$nulls":32},"Proc"]
[1707015,"Medicion de presion trans-diafragmatica","MLE",0,0,{"$nulls":32},"Proc"]
[1707016,"Registro flujometrico, por semana","MLE",0,0,{"$nulls":32},"Proc"]
[1707017,"Respuesta respiratoria al co2","MLE",0,0,{"$nulls":32},"Proc"]
[1707018,"Tiempo de tolerancia a la fatiga respiratoria","MLE",0,0,{"$nulls":32},"Proc"]
[1707019,"Ventilacion alveolar, estudio de (incluye ventilacion minuto","MLE",0,0,{"$nulls":32},"Proc"]
[1707020,"Volúmenes pulmonares por lavado de nitrógeno","MLE",0,0,{"$nulls":32},"Proc"]
[1707021,"Laringotraqueobroncoscopia con fibroscopio","MLE",0,0,{"$nulls":32},"Proc"]
[1707022,"Larigotraqueoscopia con tubo rigido","MLE",0,0,{"$nulls":32},"Proc"]
[1707023,"Mediastinoscopia c/s biopsia","MLE",0,0,{"$nulls":32},"Proc"]
[1707024,"Pleuroscopia (toracoscopia) c/s biopsia","MLE",0,0,{"$nulls":32},"Proc"]
[1707025,"Procedimiento para determinar gasometria arterial en  reposo","MLE",0,0,{"$nulls":32},"Proc"]
[1707026,"Procedimiento para determinar gasometria arterial respirando","MLE",0,0,{"$nulls":32},"Proc"]
[1707054,"Saturacion de O2 en reposo y/o ejercicio (con oximetro)","MLE",0,0,{"$nulls":32},"Proc"]
[1707055,"Saturacion de O2 en reposo y/o ejercicio y/o O2 100% (con  oximetro)","MLE",0,0,{"$nulls":32},"Proc"]
[1707027,"Broncoaspiración, c/s lavado y/o colocación de medicamentos por sonda traqueobronquial (proc. aut.)","MLE",0,0,{"$nulls":32},"Proc"]
[1707029,"Toracocentesis evacuadora,c/s toma de muestras","MLE",0,0,{"$nulls":32},"Proc"]
[1707030,"Aerosolterapia con aire comprimido y oxigeno (en atencion cerrada, incluida en valor dia cama)    ","MLE",0,0,{"$nulls":32},"Proc"]
[1707032,"Biopsia pleural (con aguja)","MLE",0,0,{"$nulls":32},"Proc"]
[1707033,"Biopsia pulmonar (con aguja) no incluye la radiologia","MLE",0,0,{"$nulls":32},"Proc"]
[1707034,"Cuerpo extrano de bronquio, extraccion por via","MLE",0,0,{"$nulls":32},"Proc"]
[1707035,"Inmunoterapia por bcg","MLE",0,0,{"$nulls":32},"Proc"]
[1707036,"Inmunoterapia por sesion (incluye el tratamiento de","MLE",0,0,{"$nulls":32},"Proc"]
[1707037,"Intubacion traqueal (proc. Aut.)","MLE",0,0,{"$nulls":32},"Proc"]
[1707038,"Monitoreo o estudio de apnea durante el sueño","MLE",0,0,{"$nulls":32},"Proc"]
[1707052,"Monitorizacion saturacion de O2 durante el sueño","MLE",0,0,{"$nulls":32},"Proc"]
[1707053,"Monitorizacion saturacion de O2 durante el sueño con presion positiva continua nasal","MLE",0,0,{"$nulls":32},"Proc"]
[5099097,"Clorhidrometria",null,0,0,{"$nulls":32},"Proc"]
[5099017,"TILT TEST ",null,0,0,{"$nulls":32},"Proc"]
[5099098,"Ecocardiograma  estrés (con dobutamina)",null,0,0,{"$nulls":32},"Proc"]
[null,"Instalación drenaje Pleural",null,0,0,{"$nulls":32},"Proc"]
[null,"Pletismografia ",null,0,0,{"$nulls":32},"Proc"]
[null,"Endosonografia Bronquial Obstructiva: EBUS",null,0,0,{"$nulls":32},"Proc"]
[null," Ablación septal con Alcohol en las Miocardiopatías Hipertróficas,",null,0,0,{"$nulls":32},"Proc"]
[null," Cierre comunicaciones intrauriculares con dispositivo, pediátrica",null,0,0,{"$nulls":32},"Proc"]
[null," Desplazamiento del electrodo  ",null,0,0,{"$nulls":32},"Proc"]
[null," Extracción dispositivo implantable ",null,0,0,{"$nulls":32},"Proc"]
[null," Extraccion endovascular de electrodos de dispositivos implantados (marcapasos, desfibriladores o resincronizadores)",null,0,0,{"$nulls":32},"Proc"]
[null," Implantación Resincronizador (No Incluye Electrodos)",null,0,0,{"$nulls":32},"Proc"]
[null," Implante marcapasos desfibrilador DDD",null,0,0,{"$nulls":32},"Proc"]
[null," Implante marcapasos desfibrilador VVI",null,0,0,{"$nulls":32},"Proc"]
[null," Marcapaso DDD con desincronización cardiaca",null,0,0,{"$nulls":32},"Proc"]
[null," Marcapaso VVI con resincronisador cardiaco",null,0,0,{"$nulls":32},"Proc"]
[null," Recambio Desfibrilador Cardiaco Bicameral",null,0,0,{"$nulls":32},"Proc"]
[null," Reposicion electrodo Auricular ",null,0,0,{"$nulls":32},"Proc"]
[null," Reposiciones parciales equipo marcapaso ",null,0,0,{"$nulls":32},"Proc"]
[null," TEST de Ajmalina ",null,{"$f":"SUM(E1793+H1793)","v":0},{"$f":"SUM(F1793:G1793)","v":0},{"$nulls":32},"Proc"]
[null," TEST de Procainamida ",null,0,0,{"$nulls":32},"Proc"]
[null," TEST Nitroglicerina ",null,0,0,{"$nulls":32},"Proc"]
[null," Ultrasonido intracardiaco: ICE",null,0,0,{"$nulls":32},"Proc"]
[null," Ultrasonido intravascular: IVUS",null,0,0,{"$nulls":32},"Proc"]
[null," Extracción de cuerpos extraños intravascular",null,0,0,{"$nulls":32},"Proc"]
[null," Cierre percutáneo del foramen oval con dispositivo Amplatzer: FOP",null,0,0,{"$nulls":32},"Proc"]
[null," Guía de presión intracoronaria: PW.",null,0,0,{"$nulls":32},"Proc"]
[null," Implantación percutánea de válvula aórtica: TAVI",null,0,0,{"$nulls":32},"Proc"]
[null," Estudio de Puentes Coronarios,",null,0,0,{"$nulls":32},"Proc"]
[null," Angioplastia con stent en ramas pulmonares",null,0,0,{"$nulls":32},"Proc"]
[null," Instalación de ECMO adulto",null,0,0,{"$nulls":32},"Proc"]
[null," Instalación de ECMO Pediátrico",null,0,0,{"$nulls":32},"Proc"]
[null," Cierre de ductos por coils ",null,0,0,{"$nulls":32},"Proc"]
[null," Tratamiento endovascular enfermedad arterial oclusiva de extremidades",null,0,0,{"$nulls":32},"Proc"]
[null,"Instalación cateter central tunelizado ",null,0,0,{"$nulls":32},"Proc"]
[null," Tratamiento percutáneo de la coartación aortica",null,0,0,{"$nulls":32},"Proc"]
[null," Micro embolizaciones mal formación arterio venosa",null,0,0,{"$nulls":32},"Proc"]
[null,"Inyectoterapia  de lesiones sangrantes",null,0,0,{"$nulls":32},"Proc"]
[null,"TOTAL",null,{"$f":"SUM(D1705:D1811)","v":0},{"$f":"SUM(E1705:E1811)","v":0},0,0,0,{"$nulls":19},0,0,0,0,0,0,0,0,0,0]
[null,"PROC. DIAGNOSTICO Y TERAPEUTICO                             "]
[1701001,"E.C.G. de reposo (incluye mínimo 12 derivaciones y 4 complejos por derivación)             ","MAI",{"$f":"SUM(E1814+H1814)","v":0},{"$f":"SUM(F1814:G1814)","v":0},{"$nulls":32},"Proc",{"v":5380,"d":"5,380"},{"$f":"AM1814*F1814","v":0}]
[1701003,"Ergometría (incluye E.C.G. antes, durante y después del ejercicio con monitoreo continuo y medición de la intensidad del esfuerzo)","MAI",{"$f":"SUM(E1815+H1815)","v":0},{"$f":"SUM(F1815:G1815)","v":0},{"$nulls":32},"Proc",{"v":15160,"d":"15,160"},0]
[1701006,"E.C.G. continuo (test Holter o similares, por ej. variabilidad de la frecuencia cardíaca y/o alta resolución del ST y/o depolarización tardía); 20 a 24 horas de registro                                                             ","MAI",0,0,{"$nulls":32},"Proc",{"v":25710,"d":"25,710"},0]
[1701007,"Ecocardiograma Doppler, con registro (incluye cód. 17.01.008)","MAI",0,0,{"$nulls":32},"Proc",{"v":49090,"d":"49,090"},0]
[1701045,"Ecocardiograma Doppler color","MAI",0,0,{"$nulls":32},"Proc",{"v":54710,"d":"54,710"},0]
[1701008,"Ecocardiograma bidimensional (incluye registro modo M, papel fotosensible y fotografía), en adultos o niños (proc. aut.)","MAI",0,0,{"$nulls":32},"Proc",{"v":30690,"d":"30,690"},0]
[1701010,"Sondeo cardíaco derecho c/s termodilución, en adultos o niños","MAI",0,0,{"$nulls":32},"Proc",{"v":237460,"d":"237,460"},0]
[1701011,"Sondeo cardíaco izquierdo y derecho, en adultos o niños","MAI",0,0,{"$nulls":32},"Proc",{"v":269940,"d":"269,940"},0]
[1701012,"Sondeo cardíaco izquierdo, en adultos o niños","MAI",0,0,{"$nulls":32},"Proc",{"v":220130,"d":"220,130"},0]
[1701019,"Cinecoronariografía derecha y/o izquierda (incluye sondeo cardíaco izquierdo  y ventriculografía izquierda)","MAI",0,0,{"$nulls":32},"Proc",{"v":282760,"d":"282,760"},0]
[1701020,"Ventriculografía derecha, en adultos o niños (incl. proc. rad., y sondeo cardíaco derecho)","MAI",0,0,{"$nulls":32},"Proc",{"v":289320,"d":"289,320"},0]
[1701021,"Ventriculografía izquierda, en adultos o niños (incl. proc. rad., y sondeo cardíaco izquierdo)","MAI",0,0,{"$nulls":32},"Proc",{"v":244680,"d":"244,680"},0]
[1701022,"Aortografía, en adultos o niños (Incluye proc. rad.)","MAI",0,0,{"$nulls":32},"Proc",{"v":261160,"d":"261,160"},0]
[1701023,"Arteriografía de extremidades, en adultos o niños (incluye proc. rad.)","MAI",0,0,{"$nulls":32},"Proc",{"v":312290,"d":"312,290"},0]
[1701024,"Arteriografía selectiva o superselectiva (pulmonar, renal, tronco celíaco, etc) en adultos o niños (incl. proc. rad.)","MAI",0,0,{"$nulls":32},"Proc",{"v":276920,"d":"276,920"},0]
[1701131,"Angioplastía Intraluminal coronaria uno o multiples vasos (incl. proc. rad; balón, rotablator, Stent o similar)","MAI",0,0,{"$nulls":32},"Proc",{"v":2026580,"d":"2,026,580"},0]
[1701132,"Angioplastía Intraluminal periférica (incluye proc. rad., balón, Stent o similar)","MAI",0,0,{"$nulls":32},"Proc",{"v":1265800,"d":"1,265,800"},0]
[1701043,"Angioplastía de coartación aórtica (incl. proc. rad.) (proc. completo)","MAI",0,0,{"$nulls":32},"Proc",{"v":1225140,"d":"1,225,140"},0]
[1701144,"Angioplastía de arteria pulmonar o vena cava en niños (incluye proc. rad., balón, Stent o similar)","MAI",0,0,{"$nulls":32},"Proc",{"v":1283500,"d":"1,283,500"},0]
[1701033,"Biopsia endomiocárdica (proc. completo)","MAI",0,0,{"$nulls":32},"Proc",{"v":181630,"d":"181,630"},0]
[1701038,"Septostomía de Rashkind","MAI",0,0,{"$nulls":32},"Proc",{"v":414460,"d":"414,460"},0]
[1701035,"Colocación de sonda marcapaso transitorio (proc. completo)","MAI",0,0,{"$nulls":32},"Proc",{"v":153660,"d":"153,660"},0]
[1701141,"Valvuloplastía mitral o tricúspide (incl. proc. radiológico,  incluye balón)","MAI",0,0,{"$nulls":32},"Proc",{"v":1244950,"d":"1,244,950"},0]
[1701142,"Valvuloplastía aórtica y/o pulmonar c/u (incl. proc. radiológico,  incluye balón)","MAI",0,0,{"$nulls":32},"Proc",{"v":1244950,"d":"1,244,950"},0]
[null,"Total ARANCEL MAI",null,{"$f":"SUM(D1814:D1837)","v":0},{"$f":"SUM(E1814:E1837)","v":0},0,0,0,{"$nulls":19},0,0,0,0,0,0,0,0,0,0,null,{"v":11616070,"d":"11,616,070"},0]
[null,"Cierre percutáneo del foramen oval con dispositivo ",null,{"$f":"SUM(E1839+H1839)","v":0},{"$f":"SUM(F1839:G1839)","v":0},{"$nulls":32},"Proc",null,{"$f":"AM1839*F1839","v":0}]
[null,"TOTAL ARANCEL MLE Y NO ARANCELADO",null,{"$f":"D1839","v":0},{"$f":"E1839","v":0},0,0,0,{"$nulls":19},0,0,0,0,0,0,0,0,0,0]
[null,"TOTAL PRODUCCION",null,{"$f":"SUM(D1838,D1840)","v":0},{"$f":"SUM(E1838,E1840)","v":0},0,0,0,{"$nulls":19},0,0,0,0,0,0,0,0,0,0,0,{"v":11616070,"d":"11,616,070"},0]
[null,"CIRUGIA CARDIOVASCULAR                                   "]
[1703001,"Embolectomía y/o trombectomía, unilateral, miembro superior o inferior (proc. aut.)","MAI",{"$f":"SUM(J1843:O1843)","v":0},{"$nulls":4},{"$f":"+J1843+K1843","v":0},{"$nulls":6},{"$f":"SUM(Q1843:R1843)","v":0},null,null,{"$f":"SUM(T1843:U1843)","v":0},null,null,{"$f":"SUM(W1843:X1843)","v":0},null,null,{"$f":"SUM(Z1843:AA1843)","v":0},{"$nulls":12},"Cmay",{"v":182430,"d":"182,430"},{"$f":"AM1843*I1843","v":0},{"$f":"IF(D1843>=P1843 + S1843+ V1843 + Y1843,\"\",\"La suma no puede ser mayor al total\")","v":""}]
[1703002,"Fístula arteriovenosa congénita o traumática, repar. quir.","MAI",{"$f":"SUM(J1844:O1844)","v":0},{"$nulls":4},0,{"$nulls":6},{"$f":"SUM(Q1844:R1844)","v":0},null,null,{"$f":"SUM(T1844:U1844)","v":0},null,null,{"$f":"SUM(W1844:X1844)","v":0},null,null,{"$f":"SUM(Z1844:AA1844)","v":0},{"$nulls":12},"Cmay",{"v":261140,"d":"261,140"},{"$f":"AM1844*I1844","v":0},""]
[1703003,"Fístula arteriovenosa (de Brescia o similar)","MAI",{"$f":"SUM(J1845:O1845)","v":0},{"$nulls":4},0,{"$nulls":6},{"$f":"SUM(Q1845:R1845)","v":0},null,null,{"$f":"SUM(T1845:U1845)","v":0},null,null,{"$f":"SUM(W1845:X1845)","v":0},null,null,{"$f":"SUM(Z1845:AA1845)","v":0},{"$nulls":12},"Cmay",{"v":159020,"d":"159,020"},0,""]
[1703004,"Fístula arteriovenosa derivación externa","MAI",0,{"$nulls":4},0,{"$nulls":6},0,null,null,0,null,null,0,null,null,0,{"$nulls":12},"Cmay",{"v":159020,"d":"159,020"},0,""]
[1703005,"Reparación quirúrgica de vasos arteriales y/o venosos intra-abdominales o intra-torácicos c/s injerto (biológicos o sintéticos)","MAI",0,{"$nulls":4},0,{"$nulls":6},0,null,null,0,null,null,0,null,null,0,{"$nulls":12},"Cmay",{"v":370370,"d":"370,370"},0,""]
[1703006,"Reparación quirúrgica de vasos arteriales y/o venosos periféricos c/s injerto (biológicos o sintéticos)","MAI",0,{"$nulls":4},0,{"$nulls":6},0,null,null,0,null,null,0,null,null,0,{"$nulls":12},"Cmay",{"v":242680,"d":"242,680"},0,""]
[1703007,"Reparación quirúrgica de vasos arteriales y/o venosos periféricos c/s injerto (biológicos o sintéticos) aórtico-abdominal","MAI",0,{"$nulls":4},0,{"$nulls":6},0,null,null,0,null,null,0,null,null,0,{"$nulls":12},"Cmay",{"v":581900,"d":"581,900"},0,""]
[1703008,"Reparación quirúrgica de vasos arteriales y/o venosos periféricos c/s injerto (biológicos o sintéticos) periféricos","MAI",0,{"$nulls":4},0,{"$nulls":6},0,null,null,0,null,null,0,null,null,0,{"$nulls":12},"Cmay",{"v":276760,"d":"276,760"},0,""]
[1703009,"Reparación quirúrgica de vasos arteriales y/o venosos periféricos c/s injerto (biológicos o sintéticos) tóraco-abdominal","MAI",0,{"$nulls":4},0,{"$nulls":6},0,null,null,0,null,null,0,null,null,0,{"$nulls":12},"Cmay",{"v":747460,"d":"747,460"},0,""]
[1703010,"Puentes aorto bifemoral puentes de troncos supra-aórticos","MAI",0,{"$nulls":4},0,{"$nulls":6},0,null,null,0,null,null,0,null,null,0,{"$nulls":12},"Cmay",{"v":505490,"d":"505,490"},0,""]
[1703011,"Puentes aorto aorto unifemoral","MAI",0,{"$nulls":4},0,{"$nulls":6},0,null,null,0,null,null,0,null,null,0,{"$nulls":12},"Cmay",{"v":411940,"d":"411,940"},0,""]
[1703012,"Puentes aorto aorto visceral (renal, mesentérico o similar)","MAI",0,{"$nulls":4},0,{"$nulls":6},0,null,null,0,null,null,0,null,null,0,{"$nulls":12},"Cmay",{"v":488320,"d":"488,320"},0,""]
[1703013,"Puentes aorto aorto ilíaco","MAI",0,{"$nulls":4},0,{"$nulls":6},0,null,null,0,null,null,0,null,null,0,{"$nulls":12},"Cmay",{"v":488320,"d":"488,320"},0,""]
[1703014,"Endarterectomía carotídea, subclavia, vertebral, femoral, o similar  c/s injerto (proc. aut.)","MAI",0,{"$nulls":4},0,{"$nulls":6},0,null,null,0,null,null,0,null,null,0,{"$nulls":12},"Cmay",{"v":411940,"d":"411,940"},0,""]
[1703015,"Endarterectomía femoral común, superficial o profunda, poplítea u otras c/s injerto (proc. aut.)","MAI",0,{"$nulls":4},0,{"$nulls":6},0,null,null,0,null,null,0,null,null,0,{"$nulls":12},"Cmay",{"v":292410,"d":"292,410"},0,""]
[1703016,"Endarterectomía renal, c/s injerto (proc. aut.)","MAI",0,{"$nulls":4},0,{"$nulls":6},0,null,null,0,null,null,0,null,null,0,{"$nulls":12},"Cmay",{"v":355950,"d":"355,950"},0,""]
[1703017,"Endarterectomía fémoro-tibial o distales","MAI",0,{"$nulls":4},0,{"$nulls":6},0,null,null,0,null,null,0,null,null,0,{"$nulls":12},"Cmay",{"v":411940,"d":"411,940"},0,""]
[1703018,"Endarterectomía fémoro-poplíteo","MAI",0,{"$nulls":4},0,{"$nulls":6},0,null,null,0,null,null,0,null,null,0,{"$nulls":12},"Cmay",{"v":411940,"d":"411,940"},0,""]
[1703019,"Ligadura troncos arteriales, (proc. aut.)","MAI",0,{"$nulls":4},0,{"$nulls":6},0,null,null,0,null,null,0,null,null,0,{"$nulls":12},"Cmay",{"v":191770,"d":"191,770"},0,""]
[1703020,"Otras derivaciones: fémoro–femoral, axilo-humeral, axilo-femoral, carótidosubclavio, axilo-axilar o similares; c/u","MAI",0,{"$nulls":4},0,{"$nulls":6},0,null,null,0,null,null,0,null,null,0,{"$nulls":12},"Cmay",{"v":370360,"d":"370,360"},0,""]
[1703021,"Anastomosis portocava u otras portosistémicas","MAI",0,{"$nulls":4},0,{"$nulls":6},0,null,null,0,null,null,0,null,null,0,{"$nulls":12},"Cmay",{"v":535120,"d":"535,120"},0,""]
[1703022,"Anastomosis venosas intraabdominales","MAI",0,{"$nulls":4},0,{"$nulls":6},0,null,null,0,null,null,0,null,null,0,{"$nulls":12},"Cmay",{"v":462310,"d":"462,310"},0,""]
[1703023,"Denudación venosa (proc. aut.)","MAI",0,{"$nulls":4},0,{"$nulls":28},"CMen",{"v":36380,"d":"36,380"},0]
[1703024,"Derivaciones venosas de extremidades puentes venosos","MAI",0,{"$nulls":4},0,{"$nulls":6},0,null,null,0,null,null,0,null,null,0,{"$nulls":12},"Cmay",{"v":300510,"d":"300,510"},0,{"$f":"IF(D1866>=P1866 + S1866+ V1866 + Y1866,\"\",\"La suma no puede ser mayor al total\")","v":""}]
[1703025,"Implante filtros venosos","MAI",0,{"$nulls":4},0,{"$nulls":6},0,null,null,0,null,null,0,null,null,0,{"$nulls":12},"Cmay",{"v":294630,"d":"294,630"},0,""]
[1703026,"Ligadura cayado safena interna, unilateral","MAI",0,{"$nulls":4},0,{"$nulls":6},0,null,null,0,null,null,0,null,null,0,{"$nulls":12},"Cmay",{"v":137580,"d":"137,580"},0,""]
[1703027,"Ligadura otros troncos venosos (poplíteo, femoral, ilíacas, humeral, axilar, otros); ligadura de venas comunicantes y/o perforantes, y/o resección de paquetes varicosos, cualquier técnica (una extremidad);c/u","MAI",0,{"$nulls":4},0,{"$nulls":6},0,null,null,0,null,null,0,null,null,0,{"$nulls":12},"Cmay",{"v":152430,"d":"152,430"},0,""]
[1703028,"Ligadura vena cava inferior","MAI",0,{"$nulls":4},0,{"$nulls":6},0,null,null,0,null,null,0,null,null,0,{"$nulls":12},"Cmay",{"v":280120,"d":"280,120"},0,""]
[1703029,"Resección cutáneo-aponeurótica unilateral (incluye fasciotomía interna o posterior)","MAI",0,{"$nulls":4},0,{"$nulls":6},0,null,null,0,null,null,0,null,null,0,{"$nulls":12},"Cmay",{"v":170730,"d":"170,730"},0,""]
[1703030,"Safenectomía interna y/o externa, unilateral o endoablación por láser","MAI",0,{"$nulls":4},0,{"$nulls":6},0,null,null,0,null,null,0,null,null,0,{"$nulls":12},"Cmay",{"v":146540,"d":"146,540"},0,""]
[1703031,"Trombectomía de venas profundas","MAI",0,{"$nulls":4},0,{"$nulls":6},0,null,null,0,null,null,0,null,null,0,{"$nulls":12},"Cmay",{"v":152020,"d":"152,020"},0,""]
[1703032,"Anastomosis linfovenosas","MAI",0,{"$nulls":4},0,{"$nulls":6},0,null,null,0,null,null,0,null,null,0,{"$nulls":12},"Cmay",{"v":219630,"d":"219,630"},0,""]
[1703033,"Linfedema, trat. quir. una extremidad","MAI",0,{"$nulls":4},0,{"$nulls":6},0,null,null,0,null,null,0,null,null,0,{"$nulls":12},"Cmay",{"v":281970,"d":"281,970"},0,""]
[1703034,"Adenitis, trat. quir.","MAI",0,{"$nulls":4},0,{"$nulls":28},"CMen",{"v":44240,"d":"44,240"},0]
[1703035,"Biopsia quir. ganglionar (cualquier región periférica superficial o profunda) (proc. aut.)","MAI",0,{"$nulls":4},0,{"$nulls":28},"CMen",{"v":85790,"d":"85,790"},0]
[1703036,"Disección y extirpación  ganglionar regional (proc. aut.): axilo-supraclavicular","MAI",0,{"$nulls":4},0,{"$nulls":6},0,null,null,0,null,null,0,null,null,0,{"$nulls":12},"Cmay",{"v":352480,"d":"352,480"},0,{"$f":"IF(D1878>=P1878 + S1878+ V1878 + Y1878,\"\",\"La suma no puede ser mayor al total\")","v":""}]
[1703037,"Disección y extirpación  ganglionar regional (proc. aut.): cérvico-torácica","MAI",0,{"$nulls":4},0,{"$nulls":6},0,null,null,0,null,null,0,null,null,0,{"$nulls":12},"Cmay",{"v":316080,"d":"316,080"},0,""]
[1703038,"Disección y extirpación  ganglionar regional (proc. aut.): ileoinguinal","MAI",0,{"$nulls":4},0,{"$nulls":6},0,null,null,0,null,null,0,null,null,0,{"$nulls":12},"Cmay",{"v":355070,"d":"355,070"},0,""]
[1703039,"Disección y extirpación  ganglionar regional (proc. aut.): inguinoescrotales","MAI",0,{"$nulls":4},0,{"$nulls":6},0,null,null,0,null,null,0,null,null,0,{"$nulls":12},"Cmay",{"v":300510,"d":"300,510"},0,""]
[1703040,"Disección y extirpación  ganglionar regional (proc. aut.): lumbo-aórticos","MAI",0,{"$nulls":4},0,{"$nulls":6},0,null,null,0,null,null,0,null,null,0,{"$nulls":12},"Cmay",{"v":437440,"d":"437,440"},0,""]
[1703041,"Disección y extirpación  ganglionar regional (proc. aut.): mediastínicos","MAI",0,{"$nulls":4},0,{"$nulls":6},0,null,null,0,null,null,0,null,null,0,{"$nulls":12},"Cmay",{"v":411940,"d":"411,940"},0,""]
[1703042,"Disección y extirpación  ganglionar regional (proc. aut.): poplíteos","MAI",0,{"$nulls":4},0,{"$nulls":6},0,null,null,0,null,null,0,null,null,0,{"$nulls":12},"Cmay",{"v":197700,"d":"197,700"},0,""]
[1703043,"Disección y extirpación  ganglionar regional (proc. aut.): radical clásica o modificada de cuello","MAI",0,{"$nulls":4},0,{"$nulls":6},0,null,null,0,null,null,0,null,null,0,{"$nulls":12},"Cmay",{"v":294630,"d":"294,630"},0,""]
[1703044,"Disección y extirpación  ganglionar regional (proc. aut.): yugular simple","MAI",0,{"$nulls":4},0,{"$nulls":6},0,null,null,0,null,null,0,null,null,0,{"$nulls":12},"Cmay",{"v":137580,"d":"137,580"},0,""]
[1703045,"Simpatectomía cérvico-torácica","MAI",0,{"$nulls":4},0,{"$nulls":6},0,null,null,0,null,null,0,null,null,0,{"$nulls":12},"Cmay",{"v":316080,"d":"316,080"},0,""]
[1703046,"Simpatectomía lumbar","MAI",0,{"$nulls":4},0,{"$nulls":6},0,null,null,0,null,null,0,null,null,0,{"$nulls":12},"Cmay",{"v":274540,"d":"274,540"},0,""]
[1703047,"Anastomosis vasculares sistémicopulmonares (Blalock-Pott-Glenn o similares)","MAI",0,{"$nulls":4},0,{"$nulls":6},0,null,null,0,null,null,0,null,null,0,{"$nulls":12},"Cmay",{"v":535120,"d":"535,120"},0,""]
[1703048,"Cambio de generador de marcapaso, sin cambio de electrodo (no incluye el valor de la prótesis)","MAI",0,{"$nulls":4},0,{"$nulls":6},0,null,null,0,null,null,0,null,null,0,{"$nulls":12},"Cmay",{"v":143100,"d":"143,100"},0,""]
[1703148,"Cambio de generador de marcapaso (incluye el valor de la prótesis)","MAI",0,{"$nulls":4},0,{"$nulls":6},0,null,null,0,null,null,0,null,null,0,{"$nulls":12},"Cmay",{"v":1604060,"d":"1,604,060"},0,""]
[1703049,"Coartación aórtica infantil (preductal) trat. quir.","MAI",0,{"$nulls":4},0,{"$nulls":6},0,null,null,0,null,null,0,null,null,0,{"$nulls":12},"Cmay",{"v":535120,"d":"535,120"},0,""]
[1703050,"Coartación aórtica, trat. quir.","MAI",0,{"$nulls":4},0,{"$nulls":6},0,null,null,0,null,null,0,null,null,0,{"$nulls":12},"Cmay",{"v":535120,"d":"535,120"},0,""]
[1703051,"Conducto arterioso persistente, trat. quir.","MAI",0,{"$nulls":4},0,{"$nulls":6},0,null,null,0,null,null,0,null,null,0,{"$nulls":12},"Cmay",{"v":598200,"d":"598,200"},0,""]
[1703052,"Fístula coronaria, trat. quir.","MAI",0,{"$nulls":4},0,{"$nulls":6},0,null,null,0,null,null,0,null,null,0,{"$nulls":12},"Cmay",{"v":475500,"d":"475,500"},0,""]
[1703053,"Implantación de marcapaso c/electrod. intraven. o epicárdico (no incluye el valor de la prótesis)","MAI",0,{"$nulls":4},0,{"$nulls":6},0,null,null,0,null,null,0,null,null,0,{"$nulls":12},"Cmay",{"v":193320,"d":"193,320"},0,""]
[1703153,"Implantación de marcapaso c/electrod. intraven. o epicárdico (incluye el valor de la prótesis)","MAI",0,{"$nulls":4},0,{"$nulls":6},0,null,null,0,null,null,0,null,null,0,{"$nulls":12},"Cmay",{"v":1937020,"d":"1,937,020"},0,""]
[1703054,"Operación sobre anillos valvulares o vasculares","MAI",0,{"$nulls":4},0,{"$nulls":6},0,null,null,0,null,null,0,null,null,0,{"$nulls":12},"Cmay",{"v":392380,"d":"392,380"},0,""]
[1703055,"Operaciones sobre arteria pulmonar, constricción por cinta","MAI",0,{"$nulls":4},0,{"$nulls":6},0,null,null,0,null,null,0,null,null,0,{"$nulls":12},"Cmay",{"v":370370,"d":"370,370"},0,""]
[1703056,"Pericardiectomía y/o extirp. de quistes y/o tumores","MAI",0,{"$nulls":4},0,{"$nulls":6},0,null,null,0,null,null,0,null,null,0,{"$nulls":12},"Cmay",{"v":489870,"d":"489,870"},0,""]
[1703057,"Pericardiorrafia o míopericardiorrafia en heridas penetrante","MAI",{"$f":"SUM(J1901:O1901)","v":0},{"$nulls":4},0,{"$nulls":6},0,null,null,0,null,null,0,null,null,0,{"$nulls":12},"Cmay",{"v":453470,"d":"453,470"},0,""]
[1703058,"Pericardiotomía","MAI",0,{"$nulls":4},0,{"$nulls":6},0,null,null,0,null,null,0,null,null,0,{"$nulls":12},"Cmay",{"v":292410,"d":"292,410"},0,""]
[1703059,"Sinequias pericárdicas, trat. quir. ( proc. aut.)","MAI",0,{"$nulls":4},0,{"$nulls":6},0,null,null,0,null,null,0,null,null,0,{"$nulls":12},"Cmay",{"v":453470,"d":"453,470"},0,""]
[1703060,"Operaciones cardíacas sin circulación extracorpórea","MAI",0,{"$nulls":4},0,{"$nulls":6},0,null,null,0,null,null,0,null,null,0,{"$nulls":12},"Cmay",{"v":492340,"d":"492,340"},0,""]
[1703061,"De complejidad mayor: incluye reempl. valv. múl., tres o más ptes aortoc. y/o anast. con art. mamaria, correc. card. cong. compl. (por ej.: Fallot; atresia tric.; doble salida del vent. der.; transp. grandes vasos; vent. único o sim.), ...","MAI",0,{"$nulls":4},0,{"$nulls":6},0,null,null,0,null,null,0,null,null,0,{"$nulls":12},"Cmay",{"v":3653080,"d":"3,653,080"},0,""]
[1703062,"De complejidad mediana: incluye comunicación interventricular, reemplazo univalvular, uno o dos puentes aortocoronarios; aneurisma ventricular, corrección de Wolf-Parkinson White y otras arritmias","MAI",0,{"$nulls":4},0,{"$nulls":6},0,null,null,0,null,null,0,null,null,0,{"$nulls":12},"Cmay",{"v":2211830,"d":"2,211,830"},0,""]
[1703063,"De complejidad menor: incluye comunicación interauricular simple, estenosis pulmonar valvular, estenosis mitral o similar","MAI",0,{"$nulls":4},{"$f":"+J1907+K1907","v":0},{"$nulls":6},0,null,null,0,null,null,0,null,null,0,{"$nulls":12},"Cmay",{"v":1360160,"d":"1,360,160"},0,""]
[null,"TOTAL ARANCEL MAI",null,{"$f":"SUM(D1843:D1907)","v":0},{"$nulls":4},{"$f":"SUM(I1843:I1907)","v":0},0,0,0,0,0,0,0,0,0,0,0,0,0,0,0,0,0,0,0,0,0,0,0,0,0,0,0,0,0,{"v":30741150,"d":"30,741,150"},0]
[null," Instalación de ECMO adulto   cirugía",null,{"$f":"SUM(J1909:O1909)","v":0},{"$nulls":4},{"$f":"+J1909+K1909","v":0},{"$nulls":6},0,null,null,{"$f":"SUM(T1909:U1909)","v":0},null,null,{"$f":"SUM(W1909:X1909)","v":0},null,null,{"$f":"SUM(Z1909:AA1909)","v":0},{"$nulls":12},"Cmay",null,null,{"$f":"IF(D1909>=P1909 + S1909+ V1909 + Y1909,\"\",\"La suma no puede ser mayor al total\")","v":""}]
[null," Instalación de ECMO Pediátrico   cirugía",null,{"$f":"SUM(J1910:O1910)","v":0},{"$nulls":4},0,{"$nulls":6},0,null,null,0,null,null,0,null,null,0,{"$nulls":12},"Cmay",null,null,""]
[null," Trasplante corazón",null,0,{"$nulls":4},0,{"$nulls":6},{"$f":"SUM(Q1911:R1911)","v":0},null,null,0,null,null,0,null,null,0,{"$nulls":12},"Cmay",null,null,""]
[null," Implantación Resincronizador (No Incluye Electrodos)",null,{"$f":"SUM(J1912:O1912)","v":0},{"$nulls":4},0,{"$nulls":6},0,null,null,0,null,null,0,null,null,0,{"$nulls":12},"Cmay",null,null,""]
[null," Implante marcapasos desfibrilador DDD",null,{"$f":"SUM(J1913:O1913)","v":0},{"$nulls":4},0,{"$nulls":6},0,null,null,0,null,null,0,null,null,0,{"$nulls":12},"Cmay",null,null,""]
[null," Implante marcapasos desfibrilador VVI",null,0,{"$nulls":4},0,{"$nulls":6},0,null,null,0,null,null,0,null,null,0,{"$nulls":12},"Cmay",null,null,""]
[null," Implante marcapaso DDD con resincronización cardiaca",null,0,{"$nulls":4},0,{"$nulls":6},0,null,null,0,null,null,0,null,null,0,{"$nulls":12},"Cmay",null,null,""]
[null," Implante marcapaso VVI con resincronisador cardiaco",null,0,{"$nulls":4},0,{"$nulls":6},0,null,null,0,null,null,0,null,null,0,{"$nulls":12},"Cmay",null,null,""]
[null," Recambio Desfibrilador Cardiaco Bicameral",null,0,{"$nulls":4},0,{"$nulls":6},0,null,null,0,null,null,0,null,null,0,{"$nulls":12},"Cmay",null,null,""]
[null," Reposicion electrodo Auricular ",null,0,{"$nulls":4},0,{"$nulls":6},0,null,null,0,null,null,0,null,null,0,{"$nulls":12},"Cmay",null,null,""]
[null," Reposiciones parciales equipo marcapaso ",null,0,{"$nulls":4},0,{"$nulls":6},0,null,null,0,null,null,0,null,null,0,{"$nulls":12},"Cmay",null,null,""]
[null," TOTAL ARANCEL MLE Y NO ARANCELADO ",null,{"$f":"SUM(D1909:D1919)","v":0},{"$nulls":4},{"$f":"SUM(I1909:I1919)","v":0},0,0,0,0,0,0,0,0,0,0,0,0,0,0,0,0,0,0,0,0,0,0,0,0,0,0,0,0,0]
[null," TOTAL PRODUCCION ",null,{"$f":"SUM(D1908+D1920)","v":0},{"$nulls":4},{"$f":"SUM(I1908+I1920)","v":0},0,0,0,0,0,0,0,0,0,0,0,0,0,0,0,0,0,0,0,0,0,0,0,0,0,0,0,0,0,{"v":30741150,"d":"30,741,150"},0]
[null,"CIRUGIA DE TORAX     "]
[1704001,"Cirugía del opérculo torácico","MAI",{"$f":"SUM(J1923:O1923)","v":0},{"$nulls":4},{"$f":"+J1923+K1923","v":0},{"$nulls":6},{"$f":"SUM(Q1923:R1923)","v":0},null,null,{"$f":"SUM(T1923:U1923)","v":0},null,null,{"$f":"SUM(W1923:X1923)","v":0},null,null,{"$f":"SUM(Z1923:AA1923)","v":0},{"$nulls":12},"Cmay",{"v":282490,"d":"282,490"},{"$f":"AM1923*I1923","v":0},{"$f":"IF(D1923>=P1923 + S1923+ V1923 + Y1923,\"\",\"La suma no puede ser mayor al total\")","v":""}]
[1704002,"Cirugía tórax abierto traumático y/o fijación tórax volante, osteosíntesis costales múltiples y de esternón (no incluye el valor de la prótesis)","MAI",{"$f":"SUM(J1924:O1924)","v":0},{"$nulls":4},0,{"$nulls":6},{"$f":"SUM(Q1924:R1924)","v":0},null,null,{"$f":"SUM(T1924:U1924)","v":0},null,null,{"$f":"SUM(W1924:X1924)","v":0},null,null,{"$f":"SUM(Z1924:AA1924)","v":0},{"$nulls":12},"Cmay",{"v":379680,"d":"379,680"},{"$f":"AM1924*I1924","v":0},""]
[1704003,"Fenestración o toracoplastía","MAI",{"$f":"SUM(J1925:O1925)","v":0},{"$nulls":4},0,{"$nulls":6},{"$f":"SUM(Q1925:R1925)","v":0},null,null,{"$f":"SUM(T1925:U1925)","v":0},null,null,{"$f":"SUM(W1925:X1925)","v":0},null,null,{"$f":"SUM(Z1925:AA1925)","v":0},{"$nulls":12},"Cmay",{"v":274540,"d":"274,540"},0,""]
[1704004,"Reparación pectum excavatum o carinatum, (proc. aut.)","MAI",0,{"$nulls":4},0,{"$nulls":6},0,null,null,0,null,null,0,null,null,0,{"$nulls":12},"Cmay",{"v":249540,"d":"249,540"},0,""]
[1704005,"Resección de costillas y/o pared costal y/o cartílago y/o esternón s/plastía (proc. aut.)","MAI",0,{"$nulls":4},0,{"$nulls":6},0,null,null,0,null,null,0,null,null,0,{"$nulls":12},"Cmay",{"v":190740,"d":"190,740"},0,""]
[1704006,"Resección de pared costal c/plastía (toracoplastía osteoplástica de York o similar)","MAI",0,{"$nulls":4},0,{"$nulls":6},0,null,null,0,null,null,0,null,null,0,{"$nulls":12},"Cmay",{"v":232280,"d":"232,280"},0,""]
[1704007,"Toracofrenolaparatomía exploradora c/s reparación vísceras torácicas y abdominales","MAI",0,{"$nulls":4},0,{"$nulls":6},0,null,null,0,null,null,0,null,null,0,{"$nulls":12},"Cmay",{"v":339180,"d":"339,180"},0,""]
[1704008,"Toracofrenotomía exploradora","MAI",0,{"$nulls":4},0,{"$nulls":6},0,null,null,0,null,null,0,null,null,0,{"$nulls":12},"Cmay",{"v":292410,"d":"292,410"},0,""]
[1704009,"Toracotomía exploradora, c/s biopsia, c/s debridación, c/s drenaje","MAI",0,{"$nulls":4},0,{"$nulls":6},0,null,null,0,null,null,0,null,null,0,{"$nulls":12},"Cmay",{"v":243350,"d":"243,350"},0,""]
[1704010,"Toracotomía mínima c/s resección costal, c/s biopsia, c/s drenaje","MAI",0,{"$nulls":4},0,{"$nulls":6},0,null,null,0,null,null,0,null,null,0,{"$nulls":12},"Cmay",{"v":123950,"d":"123,950"},0,""]
[1704011,"Mediastinotomía exploradora ant. o post. c/s biopsia proc. aut","MAI",0,{"$nulls":4},0,{"$nulls":6},0,null,null,0,null,null,0,null,null,0,{"$nulls":12},"Cmay",{"v":185500,"d":"185,500"},0,""]
[1704012,"Mediastinotomía exploradora ant. o post. c/s biopsia proc. Aut vía cervical","MAI",0,{"$nulls":4},0,{"$nulls":6},0,null,null,0,null,null,0,null,null,0,{"$nulls":12},"Cmay",{"v":159020,"d":"159,020"},0,""]
[1704013,"Mediastinotomía exploradora ant. o post. c/s biopsia proc. Aut vía torácica","MAI",0,{"$nulls":4},0,{"$nulls":6},0,null,null,0,null,null,0,null,null,0,{"$nulls":12},"Cmay",{"v":226030,"d":"226,030"},0,""]
[1704014,"Timectomía vía cervical","MAI",0,{"$nulls":4},0,{"$nulls":6},0,null,null,0,null,null,0,null,null,0,{"$nulls":12},"Cmay",{"v":210240,"d":"210,240"},0,""]
[1704015,"Timectomía vía torácica medioesternal","MAI",0,{"$nulls":4},0,{"$nulls":6},0,null,null,0,null,null,0,null,null,0,{"$nulls":12},"Cmay",{"v":263500,"d":"263,500"},0,""]
[1704016,"Conducto torácico, ligadura quirúrgica","MAI",0,{"$nulls":4},0,{"$nulls":6},0,null,null,0,null,null,0,null,null,0,{"$nulls":12},"Cmay",{"v":274530,"d":"274,530"},0,""]
[1704017,"Tumores o quistes de mediastino (anterior o posterior) trat. quir. c/s disección ganglionar","MAI",0,{"$nulls":4},0,{"$nulls":6},0,null,null,0,null,null,0,null,null,0,{"$nulls":12},"Cmay",{"v":417090,"d":"417,090"},0,""]
[1704018,"Cirugía del diafragma con cirugía de vísceras abdominales o torácicas","MAI",0,{"$nulls":4},0,{"$nulls":6},0,null,null,0,null,null,0,null,null,0,{"$nulls":12},"Cmay",{"v":344380,"d":"344,380"},0,""]
[1704064,"Frenoparálisis trat. quir.","MAI",0,{"$nulls":4},0,{"$nulls":6},0,null,null,0,null,null,0,null,null,0,{"$nulls":12},"Cmay",{"v":342620,"d":"342,620"},0,""]
[1704019,"Heridas traumáticas, trat. quir.","MAI",0,{"$nulls":4},0,{"$nulls":6},0,null,null,0,null,null,0,null,null,0,{"$nulls":12},"Cmay",{"v":253720,"d":"253,720"},0,""]
[1704020,"Hernioplastía diafragmática por vía torácica c/ prótesis (no incluye valor de la prótesis)","MAI",0,{"$nulls":4},0,{"$nulls":6},0,null,null,0,null,null,0,null,null,0,{"$nulls":12},"Cmay",{"v":292410,"d":"292,410"},0,""]
[1704021,"Hernioplastía diafragmática por vía torácica, sin prótesis","MAI",0,{"$nulls":4},0,{"$nulls":6},0,null,null,0,null,null,0,null,null,0,{"$nulls":12},"Cmay",{"v":264140,"d":"264,140"},0,""]
[1704022,"Tumores, malformaciones o quistes del diafragma (no incluye valor de la prótesis) trat. quir.","MAI",0,{"$nulls":4},0,{"$nulls":6},0,null,null,0,null,null,0,null,null,0,{"$nulls":12},"Cmay",{"v":292410,"d":"292,410"},0,""]
[1704023,"Cuerpo extraño pleural, extrac. quir.","MAI",0,{"$nulls":4},0,{"$nulls":6},0,null,null,0,null,null,0,null,null,0,{"$nulls":12},"Cmay",{"v":243350,"d":"243,350"},0,""]
[1704024,"Decorticación pleuropulmonar (pleurectomía parcial o total)","MAI",0,{"$nulls":4},0,{"$nulls":6},0,null,null,0,null,null,0,null,null,0,{"$nulls":12},"Cmay",{"v":288410,"d":"288,410"},0,""]
[1704025,"Pleurodesis por pleurotomía","MAI",0,{"$nulls":4},0,{"$nulls":6},0,null,null,0,null,null,0,null,null,0,{"$nulls":12},"Cmay",{"v":82340,"d":"82,340"},0,""]
[1704026,"Pleurodesis por toracotomía","MAI",0,{"$nulls":4},0,{"$nulls":6},0,null,null,0,null,null,0,null,null,0,{"$nulls":12},"Cmay",{"v":261210,"d":"261,210"},0,""]
[1704027,"Pleurotomía única o doble c/s biopsia con trócar","MAI",0,{"$nulls":4},0,{"$nulls":28},"CMen",{"v":57940,"d":"57,940"},0]
[1704028,"Tumores pleurales, trat. quir.","MAI",0,{"$nulls":4},0,{"$nulls":6},0,null,null,0,null,null,0,null,null,0,{"$nulls":12},"Cmay",{"v":266420,"d":"266,420"},0,{"$f":"IF(D1951>=P1951 + S1951+ V1951 + Y1951,\"\",\"La suma no puede ser mayor al total\")","v":""}]
[1704029,"Broncotomía o traqueobroncotomía exploradora o terapéutica por toracotomía (proc. aut.)","MAI",0,{"$nulls":4},0,{"$nulls":6},0,null,null,0,null,null,0,null,null,0,{"$nulls":12},"Cmay",{"v":292410,"d":"292,410"},0,""]
[1704030,"Cirugía ruptura traqueobronquial o tratamiento quirúrgico fístula postneumonectomía por esternotomía media","MAI",0,{"$nulls":4},0,{"$nulls":6},0,null,null,0,null,null,0,null,null,0,{"$nulls":12},"Cmay",{"v":475500,"d":"475,500"},0,""]
[1704031,"Plastía de tráquea y/o bronquios c/s resección, c/s prótesis (no incluye el valor de la prótesis)","MAI",0,{"$nulls":4},0,{"$nulls":6},0,null,null,0,null,null,0,null,null,0,{"$nulls":12},"Cmay",{"v":484670,"d":"484,670"},0,""]
[1704032,"Tratamiento quirúrgico fístula bronquial por toracotomía","MAI",0,{"$nulls":4},0,{"$nulls":6},0,null,null,0,null,null,0,null,null,0,{"$nulls":12},"Cmay",{"v":381950,"d":"381,950"},0,""]
[1704033,"Tumores traqueales, extirpación","MAI",0,{"$nulls":4},0,{"$nulls":6},0,null,null,0,null,null,0,null,null,0,{"$nulls":12},"Cmay",{"v":466820,"d":"466,820"},0,""]
[1704034,"Absceso pulmonar, drenaje por toracotomía","MAI",0,{"$nulls":4},0,{"$nulls":6},0,null,null,0,null,null,0,null,null,0,{"$nulls":12},"Cmay",{"v":261210,"d":"261,210"},0,""]
[1704035,"Biopsia pulmonar por toracotomía","MAI",0,{"$nulls":4},0,{"$nulls":6},0,null,null,0,null,null,0,null,null,0,{"$nulls":12},"Cmay",{"v":243350,"d":"243,350"},0,""]
[1704036,"Bulas, trat. quir.","MAI",0,{"$nulls":4},0,{"$nulls":6},0,null,null,0,null,null,0,null,null,0,{"$nulls":12},"Cmay",{"v":243350,"d":"243,350"},0,""]
[1704037,"Cirugía de quiste hidatídico sin resección pulmonar","MAI",0,{"$nulls":4},0,{"$nulls":6},0,null,null,0,null,null,0,null,null,0,{"$nulls":12},"Cmay",{"v":433910,"d":"433,910"},0,""]
[1704038,"Cuerpo extraño intrapulmonar, extirp. quir.","MAI",0,{"$nulls":4},0,{"$nulls":6},0,null,null,0,null,null,0,null,null,0,{"$nulls":12},"Cmay",{"v":269290,"d":"269,290"},0,""]
[1704039,"Heridas de pulmón, trat. quir. (proc. aut.)","MAI",0,{"$nulls":4},0,{"$nulls":6},0,null,null,0,null,null,0,null,null,0,{"$nulls":12},"Cmay",{"v":227100,"d":"227,100"},0,""]
[1704040,"Lobectomía o bilobectomía","MAI",0,{"$nulls":4},0,{"$nulls":6},0,null,null,0,null,null,0,null,null,0,{"$nulls":12},"Cmay",{"v":433910,"d":"433,910"},0,""]
[1704041,"Metástasis bilateral, trat. quir. por esternotomía","MAI",0,{"$nulls":4},0,{"$nulls":6},0,null,null,0,null,null,0,null,null,0,{"$nulls":12},"Cmay",{"v":433910,"d":"433,910"},0,""]
[1704042,"Metástasis unilateral","MAI",0,{"$nulls":4},0,{"$nulls":6},0,null,null,0,null,null,0,null,null,0,{"$nulls":12},"Cmay",{"v":307970,"d":"307,970"},0,""]
[1704043,"Neumonectomía c/s resección de pared costal","MAI",0,{"$nulls":4},0,{"$nulls":6},0,null,null,0,null,null,0,null,null,0,{"$nulls":12},"Cmay",{"v":506670,"d":"506,670"},0,""]
[1704044,"Neumostomía (proc. aut.)","MAI",0,{"$nulls":4},0,{"$nulls":6},0,null,null,0,null,null,0,null,null,0,{"$nulls":12},"Cmay",{"v":243350,"d":"243,350"},0,""]
[1704045,"Quistectomía simple","MAI",0,{"$nulls":4},0,{"$nulls":6},0,null,null,0,null,null,0,null,null,0,{"$nulls":12},"Cmay",{"v":307970,"d":"307,970"},0,""]
[1704046,"Resecciones segmentarias","MAI",0,{"$nulls":4},0,{"$nulls":6},0,null,null,0,null,null,0,null,null,0,{"$nulls":12},"Cmay",{"v":370370,"d":"370,370"},0,""]
[1704047,"Resecciones segmentarias vía cervical","MAI",0,{"$nulls":4},0,{"$nulls":6},0,null,null,0,null,null,0,null,null,0,{"$nulls":12},"Cmay",{"v":155110,"d":"155,110"},0,""]
[1704048,"Resecciones segmentarias vía torácica","MAI",0,{"$nulls":4},0,{"$nulls":6},0,null,null,0,null,null,0,null,null,0,{"$nulls":12},"Cmay",{"v":274530,"d":"274,530"},0,""]
[1704049,"Esofagostomía cervical (proc. aut.)","MAI",0,{"$nulls":4},0,{"$nulls":6},0,null,null,0,null,null,0,null,null,0,{"$nulls":12},"Cmay",{"v":155110,"d":"155,110"},0,""]
[1704050,"Tumores benignos y/o quistes. trat. quir.- Vía cervical","MAI",0,{"$nulls":4},0,{"$nulls":6},0,null,null,0,null,null,0,null,null,0,{"$nulls":12},"Cmay",{"v":203880,"d":"203,880"},0,""]
[1704051,"Tumores benignos y/o quistes. trat. quir.- Vía torácica","MAI",0,{"$nulls":4},0,{"$nulls":6},0,null,null,0,null,null,0,null,null,0,{"$nulls":12},"Cmay",{"v":274530,"d":"274,530"},0,""]
[1704052,"Divertículos, trat. quir.- Vía cervical","MAI",0,{"$nulls":4},0,{"$nulls":6},0,null,null,0,null,null,0,null,null,0,{"$nulls":12},"Cmay",{"v":182430,"d":"182,430"},0,""]
[1704053,"Divertículos, trat. quir.- Vía torácica","MAI",0,{"$nulls":4},0,{"$nulls":6},0,null,null,0,null,null,0,null,null,0,{"$nulls":12},"Cmay",{"v":253120,"d":"253,120"},0,""]
[1704054,"Achalasia, trat. quir.","MAI",0,{"$nulls":4},0,{"$nulls":6},0,null,null,0,null,null,0,null,null,0,{"$nulls":12},"Cmay",{"v":294630,"d":"294,630"},0,""]
[1704055,"Atresia esofágica, trat. quir.","MAI",0,{"$nulls":4},0,{"$nulls":6},0,null,null,0,null,null,0,null,null,0,{"$nulls":12},"Cmay",{"v":467560,"d":"467,560"},0,""]
[1704056,"Esofagectomía con restitución del tránsito mediante estómago o intestino; parcial o total","MAI",0,{"$nulls":4},0,{"$nulls":6},0,null,null,0,null,null,0,null,null,0,{"$nulls":12},"Cmay",{"v":566310,"d":"566,310"},0,""]
[1704057,"Esofagectomía total con esofagostomía, gastrostomía y yeyunostomía","MAI",0,{"$nulls":4},0,{"$nulls":6},0,null,null,0,null,null,0,null,null,0,{"$nulls":12},"Cmay",{"v":472740,"d":"472,740"},0,""]
[1704058,"Esofagogastrectomía proximal","MAI",0,{"$nulls":4},0,{"$nulls":6},0,null,null,0,null,null,0,null,null,0,{"$nulls":12},"Cmay",{"v":514280,"d":"514,280"},0,""]
[1704059,"Prótesis o tubo endoesofágico, colocación de (proc. aut.)","MAI",0,{"$nulls":4},0,{"$nulls":6},0,null,null,0,null,null,0,null,null,0,{"$nulls":12},"Cmay",{"v":224490,"d":"224,490"},0,""]
[1704060,"Reconstitución de tránsito en segundo tiempo (estómago o intestino) de operación cód. 17-04-057","MAI",0,{"$nulls":4},0,{"$nulls":6},0,null,null,0,null,null,0,null,null,0,{"$nulls":12},"Cmay",{"v":381950,"d":"381,950"},0,""]
[1704061,"Sutura herida o perforación esófago cervical","MAI",0,{"$nulls":4},0,{"$nulls":6},0,null,null,0,null,null,0,null,null,0,{"$nulls":12},"Cmay",{"v":342100,"d":"342,100"},0,""]
[1704062,"Sutura herida o perforación esófago torácico","MAI",0,{"$nulls":4},0,{"$nulls":6},0,null,null,0,null,null,0,null,null,0,{"$nulls":12},"Cmay",{"v":433910,"d":"433,910"},0,""]
[1704063,"Várices, ligadura directa","MAI",0,{"$nulls":4},0,{"$nulls":6},0,null,null,0,null,null,0,null,null,0,{"$nulls":12},"Cmay",{"v":280120,"d":"280,120"},0,""]
[null,"TOTAL ARANCEL MAI",null,{"$f":"SUM(D1923:D1986)","v":0},{"$nulls":4},{"$f":"SUM(I1923:I1986)","v":0},0,0,0,0,0,0,0,0,0,0,0,0,0,0,0,0,0,0,0,0,0,0,0,0,0,0,0,0,0,{"v":19193930,"d":"19,193,930"},0]
[null,"Instalación drenaje Pleural   cirugía",null,0,{"$nulls":4},{"$f":"+J1988+K1988","v":0},{"$nulls":6},0,null,null,0,null,null,0,null,null,0,{"$nulls":12},"Cmay",null,null,{"$f":"IF(D1988>=P1988 + S1988+ V1988 + Y1988,\"\",\"La suma no puede ser mayor al total\")","v":""}]
[null," Trasplante pulmón",null,0,{"$nulls":4},0,{"$nulls":6},{"$f":"SUM(Q1989:R1989)","v":0},null,null,{"$f":"SUM(T1989:U1989)","v":0},null,null,{"$f":"SUM(W1989:X1989)","v":0},null,null,{"$f":"SUM(Z1989:AA1989)","v":0},{"$nulls":12},"Cmay",null,null,""]
[null," TOTAL ARANCEL MLE Y NO ARANCELADO ",null,{"$f":"SUM(D1988:D1989)","v":0},{"$nulls":4},{"$f":"SUM(I1988:I1989)","v":0},0,0,0,0,0,0,0,0,0,0,0,0,0,0,0,0,0,0,0,0,0,0,0,0,0,0,0,0]
[null," TOTAL PRODUCCION ",null,{"$f":"SUM(D1987+D1990)","v":0},{"$nulls":4},{"$f":"SUM(I1987+I1990)","v":0},0,0,0,0,0,0,0,0,0,0,0,0,0,0,0,0,0,0,0,0,0,0,0,0,0,0,0,0,null,{"v":19193930,"d":"19,193,930"},0]
[null,"Procedimientos gastroenterología"]
[1801037,"Ureasa, test de (para helicobacter pylori) o similar","MLE",{"$f":"SUM(E1993+H1993)","v":0},{"$f":"SUM(F1993:G1993)","v":0},{"$nulls":32},"Proc"]
[1801002,"Esofagoscopia","MLE",0,0,{"$nulls":32},"Proc"]
[1801004,"Ano-recto-sigmoidoscopia en adultos","MLE",0,0,{"$nulls":32},"Proc"]
[1801005,"Ano-recto-sigmoidescopia en niños (además anestesia cód. 22-01-001 si corresponde)","MLE",0,0,{"$nulls":32},"Proc"]
[1801007,"Sigmoidoscopia y colonoscopia izquierda con tubo flexible","MLE",0,0,{"$nulls":32},"Proc"]
[1801008,"Coledocoscopia intraoperatoria c/s extraccion de calculos","MLE",0,0,{"$nulls":32},"Proc"]
[1801009,"Peritoneoscopia transparietal (incluye el neumoperitoneo)","MLE",0,0,{"$nulls":32},"Proc"]
[1801010,"Test de  Bernstein","MLE",0,0,{"$nulls":32},"Proc"]
[1801011,"Manometria esofagica","MLE",0,0,{"$nulls":32},"Proc"]
[1801012,"Reflujo acido, test de (grossman o similar) o reflujo","MLE",0,0,{"$nulls":32},"Proc"]
[1801013,"Sondeo gastrico con estimulacion de insulina (hollander)","MLE",0,0,{"$nulls":32},"Proc"]
[1801014,"Vaciamiento gastrico, test de (goldstein o similar)","MLE",0,0,{"$nulls":32},"Proc"]
[1801015,"Biopsia de intestino delgado, por capsula (de rubin,crosby o sim)","MLE",0,0,{"$nulls":32},"Proc"]
[1801016,"Puncion biopsia transparietal de organos abdominales c/u","MLE",{"$f":"SUM(E2006+H2006)","v":0},{"$f":"SUM(F2006:G2006)","v":0},{"$nulls":32},"Proc"]
[1801018,"Colangiopancreatografia retrograda, por intubacion endoscopica con la ampolla de vater (incluye endoscopia) (a.c 04-02-009)","MLE",0,0,{"$nulls":32},"Proc"]
[1801019,"Drenaje de la via biliar transhepatica y/o percutaneo (a.c.","MLE",0,0,{"$nulls":32},"Proc"]
[1801020,"Fistulografia (a.c. 04-02-009)","MLE",0,0,{"$nulls":32},"Proc"]
[1801021,"Neumoperitoneo por puncion transparietal","MLE",0,0,{"$nulls":32},"Proc"]
[1801022,"Intubacion sonda de sengstaken","MLE",0,0,{"$nulls":32},"Proc"]
[1801023,"Intubacion con sonda gastrica                                                                ","MLE",0,0,{"$nulls":32},"Proc"]
[1801024,"Intubacion con sonda de miller-abbot o de alimentacion","MLE",0,0,{"$nulls":32},"Proc"]
[1801025,"Dilatacion essofagica por balon neumatico (de mosher o similar)","MLE",0,0,{"$nulls":32},"Proc"]
[1801026,"Dilatacion esofagica por bujia de hg (hurst o similar)","MLE",0,0,{"$nulls":32},"Proc"]
[1801027,"Colocacion endoscopica de tubo  transtumoral en via biliar","MLE",0,0,{"$nulls":32},"Proc"]
[1801028,"Cuerpo extrano de esofago y/o estomago, extraccion","MLE",0,0,{"$nulls":32},"Proc"]
[1801029,"Devolvulacion del sigmoides por endoscopia (incluye ano-recto-sigmoidoscopia) (proc. Aut)","MLE",0,0,{"$nulls":32},"Proc"]
[1801030,"Dilatacion ano-rectal, por sesion","MLE",0,0,{"$nulls":32},"Proc"]
[1801031,"Polipos de esofago y/o estomago o intestino delgado,","MLE",0,0,{"$nulls":32},"Proc"]
[1801045,"Polipos rectales, rectosigmoideos o de colon trat. Completo","MLE",0,0,{"$nulls":32},"Proc"]
[1801032,"Escleroterapia de hemorroides, cualquier numero (incluye cod. 18-01-004 al 18-01-007 según corresp)","MLE",0,0,{"$nulls":32},"Proc"]
[1801033,"Escleroterapia o hemostasia de varices esofagicas y/o ulcera","MLE",0,0,{"$nulls":32},"Proc"]
[1801034,"Extraccion percutanea incruenta de calculos biliares","MLE",0,0,{"$nulls":32},"Proc"]
[1801035,"Ligadura hemorroides","MLE",0,0,{"$nulls":32},"Proc"]
[1801036,"Papilotomia endoscopica c/s extraccion de calculos, c/s","MLE",0,0,{"$nulls":32},"Proc"]
[1801038,"Puncion evacuadora de absceso intraabdominales (hepatico u otros), c/s toma de muestra, c/s inyeccion de medicamentos","MLE",0,0,{"$nulls":32},"Proc"]
[1801041,"Puncion evacuadora de liquido ascitico, con colocacion de expansores de plasma, c/s tomada de muestra, c/s inyeccion de medicamentos (no incluye el valor de los expansores ni otros medicamentos)","MLE",0,0,{"$nulls":32},"Proc"]
[1801042,"Vaciamiento manual de fecaloma                                                                   ","MLE",0,0,{"$nulls":32},"Proc"]
[1801043,"Manometria anorrectal",null,0,0,{"$nulls":32},"Proc"]
[5099020,"Medición de pH gástrico",null,0,0,{"$nulls":32},"Proc"]
[5099099,"Endosonografia rectal",null,0,0,{"$nulls":32},"Proc"]
[5099100,"Endosonografia con punción",null,0,0,{"$nulls":32},"Proc"]
[5099101,"Endosonografia compleja",null,0,0,{"$nulls":32},"Proc"]
[5099102,"Endosonografia alta lineal",null,0,0,{"$nulls":32},"Proc"]
[5099103,"Endosonografia alta radial",null,0,0,{"$nulls":32},"Proc"]
[5099104,"Endosonografia con sonda radial",null,0,0,{"$nulls":32},"Proc"]
[5099105,"Instalacion de sonda nasogastrica",null,0,0,{"$nulls":32},"Proc"]
[5099106,"litotripsia biliar",null,0,0,{"$nulls":32},"Proc"]
[5099107,"mucosectomia",null,0,0,{"$nulls":32},"Proc"]
[5099108,"Dilatacion neumática de la acalasia por balón  ",null,0,0,{"$nulls":32},"Proc"]
[null,"Escleroterapia várices con cionocrilato",null,0,0,{"$nulls":32},"Proc"]
[null,"Hemostasia con endoclips",null,0,0,{"$nulls":32},"Proc"]
[null,"Polipectomía colón",null,0,0,{"$nulls":32},"Proc"]
[null,"Polipectomía gástrica / duodenal",null,0,0,{"$nulls":32},"Proc"]
[null,"Cierre de fistula de esófago-colon-gástrica",null,0,0,{"$nulls":32},"Proc"]
[null,"Coagulación Endoscópica con Argón plasma  (digestivo alto y bajo)",null,0,0,{"$nulls":32},"Proc"]
[null,"Dilatación de Estenosis Colonica",null,0,0,{"$nulls":32},"Proc"]
[null,"Dilatación Pilórica y/o Estenosis Duodenal",null,0,0,{"$nulls":32},"Proc"]
[null,"Instalación de Prótesis de Colon",null,0,0,{"$nulls":32},"Proc"]
[null,"Instalación de Prótesis Duodenal",null,0,0,{"$nulls":32},"Proc"]
[null,"Instalación de Prótesis Gástrica en Fístulas y Tumor",null,0,0,{"$nulls":32},"Proc"]
[null,"Ligadura varices esofágicas",null,0,0,{"$nulls":32},"Proc"]
[null,"Punción ascítica ",null,0,0,{"$nulls":32},"Proc"]
[null," TOTAL",null,{"$f":"SUM(D1993:D2054)","v":0},{"$f":"SUM(E1993:E2054)","v":0},0,0,0,{"$nulls":19},0,0,0,0,0,0,0,0,0,0,0]
[null,"GRUPO 18 : GASTROENTEROLOGIA      "]
[null,"PROC. DIAGNOSTICO Y TERAPEUTICO                             "]
[1801001,"Gastroduodenoscopía (incluye esofagoscopía)                                                      ","MAI",0,0,{"$nulls":32},"Proc",{"v":37130,"d":"37,130"},{"$f":"AM2058*F2058","v":0}]
[1801003,"Yeyuno-ileoscopía (incluye esofago-gastro-duodenoscopía)","MAI",0,0,{"$nulls":32},"Proc",{"v":44780,"d":"44,780"},{"$f":"AM2059*F2059","v":0}]
[1801006,"Colonoscopía larga (incluye sigmoidoscopía y colonoscopía izquierda)","MAI",0,0,{"$nulls":32},"Proc",{"v":47710,"d":"47,710"},{"$f":"AM2060*F2060","v":0}]
[null,"TOTAL",null,{"$f":"SUM(D2058:D2060)","v":0},{"$f":"SUM(E2058:E2060)","v":0},{"$f":"SUM(F2058:F2060)","v":0},{"$f":"SUM(G2058:G2060)","v":0},{"$f":"SUM(H2058:H2060)","v":0},{"$nulls":19},{"$f":"SUM(AB2058:AB2060)","v":0},0,0,0,0,0,0,0,0,0,0,{"v":129620,"d":"129,620"},0]
[null,"CIRUGIA ABDOMINAL                                           "]
[1802001,"Diafragmática por vía abdominal o cualquiera otra hernia con uso de prótesis (no incluye el valor de la prótesis)","MAI",{"$f":"SUM(J2063:O2063)","v":0},{"$nulls":4},{"$f":"+J2063+K2063","v":0},{"$nulls":6},{"$f":"SUM(Q2063:R2063)","v":0},null,null,{"$f":"SUM(T2063:U2063)","v":0},null,null,{"$f":"SUM(W2063:X2063)","v":0},null,null,{"$f":"SUM(Z2063:AA2063)","v":0},{"$nulls":12},"Cmay",{"v":263500,"d":"263,500"},{"$f":"AM2063*I2063","v":0},{"$f":"IF(D2063>=P2063 + S2063+ V2063 + Y2063,\"\",\"La suma no puede ser mayor al total\")","v":""}]
[1802101,"Diafragmática por vía abdominal o cualquiera otra hernia con uso de prótesis (incluye el valor de la prótesis)","MAI",{"$f":"SUM(J2064:O2064)","v":0},{"$nulls":4},0,{"$nulls":6},{"$f":"SUM(Q2064:R2064)","v":0},null,null,{"$f":"SUM(T2064:U2064)","v":0},null,null,{"$f":"SUM(W2064:X2064)","v":0},null,null,{"$f":"SUM(Z2064:AA2064)","v":0},{"$nulls":12},"Cmay",{"v":448690,"d":"448,690"},{"$f":"AM2064*I2064","v":0},""]
[1802002,"Incisional o evisceración post-op. sin resección intestinal","MAI",{"$f":"SUM(J2065:O2065)","v":0},{"$nulls":4},0,{"$nulls":6},{"$f":"SUM(Q2065:R2065)","v":0},null,null,{"$f":"SUM(T2065:U2065)","v":0},null,null,{"$f":"SUM(W2065:X2065)","v":0},null,null,{"$f":"SUM(Z2065:AA2065)","v":0},{"$nulls":12},"Cmay",{"v":186340,"d":"186,340"},0,""]
[1802003,"Inguinal, crural, umbilical, de la línea blanca o similares, recidivada o no, simple o estrangulada s/resección intest. c/u","MAI",0,{"$nulls":4},0,{"$nulls":6},0,null,null,0,null,null,0,null,null,0,{"$nulls":12},"Cmay",{"v":170730,"d":"170,730"},0,""]
[1802004,"Laparotomía exploradora, c/s liberación de adherencias, c/s drenaje, c/s biopsias como proc. aut. o como resultado de una herida penetrante abdominal no complicada o de un hemoperitoneo postoperatorio ...","MAI",0,{"$nulls":4},0,{"$nulls":6},0,null,null,0,null,null,0,null,null,0,{"$nulls":12},"Cmay",{"v":159020,"d":"159,020"},0,""]
[1802005,"Onfalocele (hasta 5 cms.); trat. quir.","MAI",0,{"$nulls":4},0,{"$nulls":6},0,null,null,0,null,null,0,null,null,0,{"$nulls":12},"Cmay",{"v":172840,"d":"172,840"},0,""]
[1802006,"Onfalocele (mas de 5 cms.); trat. quir.","MAI",0,{"$nulls":4},0,{"$nulls":6},0,null,null,0,null,null,0,null,null,0,{"$nulls":12},"Cmay",{"v":201910,"d":"201,910"},0,""]
[1802013,"Gastrosquisis","MAI",0,{"$nulls":4},0,{"$nulls":6},0,null,null,0,null,null,0,null,null,0,{"$nulls":12},"Cmay",{"v":303100,"d":"303,100"},0,""]
[1802007,"Peritonitis difusa aguda, trat. quir. (proc. aut.) ","MAI",0,{"$nulls":4},0,{"$nulls":6},0,null,null,0,null,null,0,null,null,0,{"$nulls":12},"Cmay",{"v":224490,"d":"224,490"},0,""]
[1802008,"Peritoneal (parietal)","MAI",0,{"$nulls":4},0,{"$nulls":6},0,null,null,0,null,null,0,null,null,0,{"$nulls":12},"Cmay",{"v":172840,"d":"172,840"},0,""]
[1802009,"Retroperitoneal","MAI",0,{"$nulls":4},0,{"$nulls":6},0,null,null,0,null,null,0,null,null,0,{"$nulls":12},"Cmay",{"v":255650,"d":"255,650"},0,""]
[1802010,"Antrectomía y vagotomía troncular o selectiva (proc. aut.)","MAI",0,{"$nulls":4},0,{"$nulls":6},0,null,null,0,null,null,0,null,null,0,{"$nulls":12},"Cmay",{"v":342100,"d":"342,100"},0,""]
[1802011,"Desgastrectomía y neoanastomosis, c/s vaguectomía","MAI",0,{"$nulls":4},0,{"$nulls":6},0,null,null,0,null,null,0,null,null,0,{"$nulls":12},"Cmay",{"v":385930,"d":"385,930"},0,""]
[1802012,"Gastroenteroanastomosis, cualquier técnica. (proc. aut.)","MAI",0,{"$nulls":4},0,{"$nulls":6},0,null,null,0,null,null,0,null,null,0,{"$nulls":12},"Cmay",{"v":235180,"d":"235,180"},0,""]
[1802014,"Gastrotomía y/o gastrostomía (proc. aut.)","MAI",0,{"$nulls":4},0,{"$nulls":6},0,null,null,0,null,null,0,null,null,0,{"$nulls":12},"Cmay",{"v":152020,"d":"152,020"},0,""]
[1802015,"Perforación gástrica aguda, trat. quir. (proc. aut.)","MAI",0,{"$nulls":4},0,{"$nulls":6},0,null,null,0,null,null,0,null,null,0,{"$nulls":12},"Cmay",{"v":206590,"d":"206,590"},0,""]
[1802016,"Piloroplastía (proc. aut.)","MAI",0,{"$nulls":4},0,{"$nulls":6},0,null,null,0,null,null,0,null,null,0,{"$nulls":12},"Cmay",{"v":183230,"d":"183,230"},0,""]
[1802017,"Gastrectomía sub-total distal: Con disección ganglionar","MAI",0,{"$nulls":4},0,{"$nulls":6},0,null,null,0,null,null,0,null,null,0,{"$nulls":12},"Cmay",{"v":373260,"d":"373,260"},0,""]
[1802018,"Gastrectomía sub-total distal: Sin disección ganglionar","MAI",0,{"$nulls":4},0,{"$nulls":6},0,null,null,0,null,null,0,null,null,0,{"$nulls":12},"Cmay",{"v":321820,"d":"321,820"},0,""]
[1802019,"Dumping y/o síndrome asa aferente, trat. quir.","MAI",0,{"$nulls":4},0,{"$nulls":6},0,null,null,0,null,null,0,null,null,0,{"$nulls":12},"Cmay",{"v":368040,"d":"368,040"},0,""]
[1802020,"Gastrectomía sub-total con vagotomía","MAI",0,{"$nulls":4},0,{"$nulls":6},0,null,null,0,null,null,0,null,null,0,{"$nulls":12},"Cmay",{"v":342100,"d":"342,100"},0,""]
[1802021,"Gastrectomía sub-total proximal con esófago-gastro-anastomosis u otra derivación","MAI",0,{"$nulls":4},0,{"$nulls":6},0,null,null,0,null,null,0,null,null,0,{"$nulls":12},"Cmay",{"v":475500,"d":"475,500"},0,""]
[1802022,"Gastrectomía total","MAI",0,{"$nulls":4},0,{"$nulls":6},0,null,null,0,null,null,0,null,null,0,{"$nulls":12},"Cmay",{"v":475500,"d":"475,500"},0,""]
[1802023,"Gastrectomía total o sub-total ampliada (incluye esplenectomía y pancreatectomía corporocaudal y disección ganglionar)","MAI",0,{"$nulls":4},0,{"$nulls":6},0,null,null,0,null,null,0,null,null,0,{"$nulls":12},"Cmay",{"v":846250,"d":"846,250"},0,""]
[1802024,"Gastropexia y/u otra cirugía antirreflujo, c/s vagotomía","MAI",0,{"$nulls":4},0,{"$nulls":6},0,null,null,0,null,null,0,null,null,0,{"$nulls":12},"Cmay",{"v":281630,"d":"281,630"},0,""]
[1802025,"Vagotomía selectiva y superselectiva c/s dren. gástrico, c/s piloroplastía (proc. aut.)","MAI",0,{"$nulls":4},0,{"$nulls":6},0,null,null,0,null,null,0,null,null,0,{"$nulls":12},"Cmay",{"v":268670,"d":"268,670"},0,""]
[1802079,"Gastrectomía total con ostomías proximal y distal","MAI",0,{"$nulls":4},0,{"$nulls":6},0,null,null,0,null,null,0,null,null,0,{"$nulls":12},"Cmay",{"v":381970,"d":"381,970"},0,""]
[1802080,"Reconstitución  de tránsito en 2° tiempo de operación código 18-02-079","MAI",0,{"$nulls":4},0,{"$nulls":6},0,null,null,0,null,null,0,null,null,0,{"$nulls":12},"Cmay",{"v":329980,"d":"329,980"},0,""]
[1802026,"Drenaje de colecciones líquidas hepáticas","MAI",0,{"$nulls":4},0,{"$nulls":6},0,null,null,0,null,null,0,null,null,0,{"$nulls":12},"Cmay",{"v":253120,"d":"253,120"},0,""]
[1802027,"Colangioenteroanastomosis intrahepática","MAI",0,{"$nulls":4},0,{"$nulls":6},0,null,null,0,null,null,0,null,null,0,{"$nulls":12},"Cmay",{"v":505490,"d":"505,490"},0,""]
[1802028,"Colecistectomía c/s colangiografía operatoria","MAI",0,{"$nulls":4},0,{"$nulls":6},0,null,null,0,null,null,0,null,null,0,{"$nulls":12},"Cmay",{"v":279040,"d":"279,040"},0,""]
[1802081,"Colecistectomía por videolaparoscopía, proc. completo","MAI",0,{"$nulls":4},0,{"$nulls":6},0,null,null,0,null,null,0,null,null,0,{"$nulls":12},"Cmay",{"v":370360,"d":"370,360"},0,""]
[1802029,"Colecistectomía y coledocostomía (sonda T y colangiografía postoperatoria) c/s colangiografía operatoria","MAI",0,{"$nulls":4},0,{"$nulls":6},0,null,null,0,null,null,0,null,null,0,{"$nulls":12},"Cmay",{"v":299820,"d":"299,820"},0,""]
[1802030,"Colecistogastroanastomosis o colecistoenteroanastomosis","MAI",0,{"$nulls":4},0,{"$nulls":6},0,null,null,0,null,null,0,null,null,0,{"$nulls":12},"Cmay",{"v":346630,"d":"346,630"},0,""]
[1802031,"Colecistostomía (proc. aut.)","MAI",0,{"$nulls":4},0,{"$nulls":6},0,null,null,0,null,null,0,null,null,0,{"$nulls":12},"Cmay",{"v":172840,"d":"172,840"},0,""]
[1802032,"Colédoco o hepatoenteroanastomosis","MAI",0,{"$nulls":4},0,{"$nulls":6},0,null,null,0,null,null,0,null,null,0,{"$nulls":12},"Cmay",{"v":394050,"d":"394,050"},0,""]
[1802033,"Coledocostomía supraduodenal o hepaticostomía (proc. aut.)","MAI",0,{"$nulls":4},0,{"$nulls":6},0,null,null,0,null,null,0,null,null,0,{"$nulls":12},"Cmay",{"v":255650,"d":"255,650"},0,""]
[1802034,"Colocación de válvula peritoneoyugular derivativa de ascitis","MAI",0,{"$nulls":4},0,{"$nulls":6},0,null,null,0,null,null,0,null,null,0,{"$nulls":12},"Cmay",{"v":159020,"d":"159,020"},0,""]
[1802035,"Desconexión acigoportal con transección esofágica","MAI",0,{"$nulls":4},0,{"$nulls":6},0,null,null,0,null,null,0,null,null,0,{"$nulls":12},"Cmay",{"v":535120,"d":"535,120"},0,""]
[1802036,"Desconexión ácigoportal sin transección esofágica","MAI",0,{"$nulls":4},0,{"$nulls":6},0,null,null,0,null,null,0,null,null,0,{"$nulls":12},"Cmay",{"v":462310,"d":"462,310"},0,""]
[1802037,"Drenaje vía biliar transhepático","MAI",0,{"$nulls":4},0,{"$nulls":6},0,null,null,0,null,null,0,null,null,0,{"$nulls":12},"Cmay",{"v":253120,"d":"253,120"},0,""]
[1802038,"Esfinteroplastía transduodenal, (proc. aut.)","MAI",0,{"$nulls":4},0,{"$nulls":6},0,null,null,0,null,null,0,null,null,0,{"$nulls":12},"Cmay",{"v":342100,"d":"342,100"},0,""]
[1802039,"Hepatectomía segmentaria (proc. aut.)","MAI",0,{"$nulls":4},0,{"$nulls":6},0,null,null,0,null,null,0,null,null,0,{"$nulls":12},"Cmay",{"v":411940,"d":"411,940"},0,""]
[1802040,"Herida traumática de hígado y/o vía biliar, trat. quir.","MAI",0,{"$nulls":4},0,{"$nulls":6},0,null,null,0,null,null,0,null,null,0,{"$nulls":12},"Cmay",{"v":294630,"d":"294,630"},0,""]
[1802041,"Lobectomía hepática (proc. aut.)","MAI",0,{"$nulls":4},0,{"$nulls":6},0,null,null,0,null,null,0,null,null,0,{"$nulls":12},"Cmay",{"v":555860,"d":"555,860"},0,""]
[1802042,"Quiste hidatídico, único o múltiple, y/o cistoyeyunoanastomosis, trat. quir.","MAI",0,{"$nulls":4},0,{"$nulls":6},0,null,null,0,null,null,0,null,null,0,{"$nulls":12},"Cmay",{"v":300570,"d":"300,570"},0,""]
[1802100,"Trasplante hepático","MAI",0,{"$nulls":4},0,{"$nulls":6},0,null,null,0,null,null,0,null,null,0,{"$nulls":12},"Cmay",{"v":889550,"d":"889,550"},0,""]
[1802043,"Abscesos, quistes, pseudoquistes o similares, trat. quir.","MAI",0,{"$nulls":4},0,{"$nulls":6},0,null,null,0,null,null,0,null,null,0,{"$nulls":12},"Cmay",{"v":280120,"d":"280,120"},0,""]
[1802044,"Heridas, traumatismos, trat. quir.","MAI",0,{"$nulls":4},0,{"$nulls":6},0,null,null,0,null,null,0,null,null,0,{"$nulls":12},"Cmay",{"v":233820,"d":"233,820"},0,""]
[1802045,"Pancreatectomía parcial","MAI",0,{"$nulls":4},0,{"$nulls":6},0,null,null,0,null,null,0,null,null,0,{"$nulls":12},"Cmay",{"v":411940,"d":"411,940"},0,""]
[1802046,"Pancreatectomía total c/s esplenectomía","MAI",0,{"$nulls":4},0,{"$nulls":6},0,null,null,0,null,null,0,null,null,0,{"$nulls":12},"Cmay",{"v":607880,"d":"607,880"},0,""]
[1802047,"Pancreatoduodenectomía","MAI",0,{"$nulls":4},0,{"$nulls":6},0,null,null,0,null,null,0,null,null,0,{"$nulls":12},"Cmay",{"v":854190,"d":"854,190"},0,""]
[1802048,"Secuestrectomía en pancreatitis aguda","MAI",0,{"$nulls":4},0,{"$nulls":6},0,null,null,0,null,null,0,null,null,0,{"$nulls":12},"Cmay",{"v":343290,"d":"343,290"},0,""]
[1802148,"Yeyunopancreatostomía","MAI",0,{"$nulls":4},0,{"$nulls":6},0,null,null,0,null,null,0,null,null,0,{"$nulls":12},"Cmay",{"v":435620,"d":"435,620"},0,""]
[1802049,"Autoimplante de bazo (incluye esplenectomía)","MAI",0,{"$nulls":4},0,{"$nulls":6},0,null,null,0,null,null,0,null,null,0,{"$nulls":12},"Cmay",{"v":301590,"d":"301,590"},0,""]
[1802050,"Esplenectomía total o parcial (proc. aut.)","MAI",0,{"$nulls":4},0,{"$nulls":6},0,null,null,0,null,null,0,null,null,0,{"$nulls":12},"Cmay",{"v":253120,"d":"253,120"},0,""]
[1802051,"Operación de etapificación (incluye esplenectomía, biopsias hepáticas, de ganglios abdominales y de cresta ilíaca)","MAI",0,{"$nulls":4},0,{"$nulls":6},0,null,null,0,null,null,0,null,null,0,{"$nulls":12},"Cmay",{"v":352480,"d":"352,480"},0,""]
[1802052,"Sutura esplénica (proc. aut.)","MAI",0,{"$nulls":4},0,{"$nulls":6},0,null,null,0,null,null,0,null,null,0,{"$nulls":12},"Cmay",{"v":233820,"d":"233,820"},0,""]
[1802053,"Apendicectomía y/o dren. absceso apendicular (proc. aut.)","MAI",0,{"$nulls":4},0,{"$nulls":6},0,null,null,0,null,null,0,null,null,0,{"$nulls":12},"Cmay",{"v":190980,"d":"190,980"},0,""]
[1802054,"Cierre de colostomía (proc. aut.)","MAI",0,{"$nulls":4},0,{"$nulls":6},0,null,null,0,null,null,0,null,null,0,{"$nulls":12},"Cmay",{"v":172840,"d":"172,840"},0,""]
[1802055,"Colostomía (proc. aut.)","MAI",0,{"$nulls":4},0,{"$nulls":6},0,null,null,0,null,null,0,null,null,0,{"$nulls":12},"Cmay",{"v":183230,"d":"183,230"},0,""]
[1802056,"Colostomía, complicaciones tardías, trat. quir.","MAI",0,{"$nulls":4},0,{"$nulls":6},0,null,null,0,null,null,0,null,null,0,{"$nulls":12},"Cmay",{"v":216700,"d":"216,700"},0,""]
[1802057,"Divertículo de Meckel, trat. quir.","MAI",0,{"$nulls":4},0,{"$nulls":6},0,null,null,0,null,null,0,null,null,0,{"$nulls":12},"Cmay",{"v":164540,"d":"164,540"},0,""]
[1802058,"Entero-enteroanastomosis o enterocoloanastomosis (proc. aut.)","MAI",0,{"$nulls":4},0,{"$nulls":6},0,null,null,0,null,null,0,null,null,0,{"$nulls":12},"Cmay",{"v":213000,"d":"213,000"},0,""]
[1802059,"Enterotomía o enterostomía (yeyunostomía u otra) (proc. aut.)","MAI",0,{"$nulls":4},{"$f":"+J2127+K2127","v":0},{"$nulls":6},0,null,null,0,null,null,0,null,null,0,{"$nulls":12},"Cmay",{"v":152020,"d":"152,020"},0,{"$f":"IF(D2127>=P2127 + S2127+ V2127 + Y2127,\"\",\"La suma no puede ser mayor al total\")","v":""}]
[1802060,"Ileostomía terminal o en asa (proc. aut.)","MAI",0,{"$nulls":4},0,{"$nulls":6},0,null,null,0,null,null,0,null,null,0,{"$nulls":12},"Cmay",{"v":201140,"d":"201,140"},{"$f":"AM2128*I2128","v":0},""]
[1802061,"Invaginación intestinal, trat. quir.","MAI",{"$f":"SUM(J2129:O2129)","v":0},{"$nulls":4},0,{"$nulls":6},{"$f":"SUM(Q2129:R2129)","v":0},null,null,{"$f":"SUM(T2129:U2129)","v":0},null,null,{"$f":"SUM(W2129:X2129)","v":0},null,null,{"$f":"SUM(Z2129:AA2129)","v":0},{"$nulls":12},"Cmay",{"v":164540,"d":"164,540"},0,""]
[1802062,"Persistencia conducto onfalomesentérico, trat. quir.","MAI",0,{"$nulls":4},0,{"$nulls":6},0,null,null,0,null,null,0,null,null,0,{"$nulls":12},"Cmay",{"v":164540,"d":"164,540"},0,""]
[1802063,"Quiste uraco, trat. quir.","MAI",0,{"$nulls":4},0,{"$nulls":6},0,null,null,0,null,null,0,null,null,0,{"$nulls":12},"Cmay",{"v":164540,"d":"164,540"},0,""]
[1802065,"Oclusión intestinal, trat. quir.:- Con resección","MAI",0,{"$nulls":4},0,{"$nulls":6},0,null,null,0,null,null,0,null,null,0,{"$nulls":12},"Cmay",{"v":253070,"d":"253,070"},0,""]
[1802066,"Oclusión intestinal, trat. quir.:- Sin resección","MAI",0,{"$nulls":4},0,{"$nulls":6},0,null,null,0,null,null,0,null,null,0,{"$nulls":12},"Cmay",{"v":206590,"d":"206,590"},0,""]
[1802067,"Colectomía parcial o hemicolectomía","MAI",0,{"$nulls":4},0,{"$nulls":6},0,null,null,0,null,null,0,null,null,0,{"$nulls":12},"Cmay",{"v":394050,"d":"394,050"},0,""]
[1802068,"Colectomía total abdominal","MAI",0,{"$nulls":4},0,{"$nulls":6},0,null,null,0,null,null,0,null,null,0,{"$nulls":12},"Cmay",{"v":484670,"d":"484,670"},0,""]
[1802069,"Descenso de colon c/conservación del esfínter, incluye resección de colon","MAI",0,{"$nulls":4},0,{"$nulls":6},0,null,null,0,null,null,0,null,null,0,{"$nulls":12},"Cmay",{"v":474340,"d":"474,340"},0,""]
[1802070,"Hartmann, operación de (o similar)","MAI",0,{"$nulls":4},0,{"$nulls":6},0,null,null,0,null,null,0,null,null,0,{"$nulls":12},"Cmay",{"v":394050,"d":"394,050"},0,""]
[1802071,"Perforación y/o herida de intestino, única o múltiple, trat. quir. (proc. aut.)","MAI",0,{"$nulls":4},0,{"$nulls":6},0,null,null,0,null,null,0,null,null,0,{"$nulls":12},"Cmay",{"v":198850,"d":"198,850"},0,""]
[1802072,"Quiste y/o tumor del mesenterio y/o epiplones, único y/o múltiple, trat. quir.","MAI",0,{"$nulls":4},0,{"$nulls":6},0,null,null,0,null,null,0,null,null,0,{"$nulls":12},"Cmay",{"v":198850,"d":"198,850"},0,""]
[1802073,"Reconstitución  tránsito post operación de Hartmann o sim.","MAI",0,{"$nulls":4},0,{"$nulls":6},0,null,null,0,null,null,0,null,null,0,{"$nulls":12},"Cmay",{"v":394050,"d":"394,050"},0,""]
[1802074,"Resección de intestino y enteroanastomosis (proc. aut.)","MAI",0,{"$nulls":4},0,{"$nulls":6},0,null,null,0,null,null,0,null,null,0,{"$nulls":12},"Cmay",{"v":253200,"d":"253,200"},0,""]
[1802082,"Resección intestinal con ostomías proximal y distal","MAI",0,{"$nulls":4},0,{"$nulls":6},0,null,null,0,null,null,0,null,null,0,{"$nulls":12},"Cmay",{"v":242680,"d":"242,680"},0,""]
[1802075,"Resección intestinal masiva por trombosis mesentérica u otra etiología","MAI",0,{"$nulls":4},0,{"$nulls":6},0,null,null,0,null,null,0,null,null,0,{"$nulls":12},"Cmay",{"v":449320,"d":"449,320"},0,""]
[1802076,"Duplicación intestinal, trat. quir.","MAI",0,{"$nulls":4},0,{"$nulls":6},0,null,null,0,null,null,0,null,null,0,{"$nulls":12},"Cmay",{"v":253120,"d":"253,120"},0,""]
[1802077,"Mal rotación intestinal, trat. quir.","MAI",0,{"$nulls":4},0,{"$nulls":6},0,null,null,0,null,null,0,null,null,0,{"$nulls":12},"Cmay",{"v":253120,"d":"253,120"},0,""]
[null,"Total ARANCEL MAI",null,{"$f":"SUM(D2063:D2145)","v":0},{"$nulls":4},{"$f":"SUM(I2063:I2145)","v":0},0,0,0,0,0,0,0,0,0,0,0,0,0,0,0,0,0,0,0,0,0,0,0,0,0,0,0,0,null,{"v":26356000,"d":"26,356,000"},0]
[5099005,"Gastrectomía en Manga o Gastrectomía Vertical Tipo Sleeve",null,0,{"$nulls":4},{"$f":"+J2147+K2147","v":0},{"$nulls":6},0,null,null,0,null,null,0,null,null,0,{"$nulls":12},"Cmay",null,null,{"$f":"IF(D2147>=P2147 + S2147+ V2147 + Y2147,\"\",\"La suma no puede ser mayor al total\")","v":""}]
[5099006,"Cirugía bariátrica con banda gástrica ajustable (Banding)",null,0,{"$nulls":4},0,{"$nulls":6},0,null,null,0,null,null,0,null,null,0,{"$nulls":12},"Cmay",null,null,""]
[5099007,"Cirugía bariátrica con Balón Intragástrico",null,0,{"$nulls":4},0,{"$nulls":6},0,null,null,0,null,null,0,null,null,0,{"$nulls":12},"Cmay",null,null,""]
[null,"Cirugía bariátrica con Bypass gástrico",null,0,{"$nulls":4},0,{"$nulls":6},0,null,null,0,null,null,0,null,null,0,{"$nulls":12},"Cmay",null,null,""]
[null,"Cierre de fistula de esófago-colon-gástrica  cirugía",null,0,{"$nulls":4},0,{"$nulls":6},0,null,null,0,null,null,0,null,null,0,{"$nulls":12},"Cmay",null,null,""]
[null,"TOTAL ARANCEL MLE Y NO ARANCELADO",null,{"$f":"SUM(D2147:D2151)","v":0},{"$nulls":4},{"$f":"SUM(I2147:I2151)","v":0},0,0,0,0,0,0,0,0,0,0,0,0,0,0,0,0,0,0,0,0,0,0,0,0,0,0,0,0]
[null,"TOTAL PRODUCCION",null,{"$f":"SUM(D2146+D2152)","v":0},{"$nulls":4},{"$f":"SUM(I2146+I2152)","v":0},0,0,0,0,0,0,0,0,0,0,0,0,0,0,0,0,0,0,0,0,0,0,0,0,0,0,0,0,null,{"v":26356000,"d":"26,356,000"},0]
[null,"CIRUGIA PROCTOLOGICA                                 "]
[1803001,"Absceso anorrectal complejo (implica hospitalización y anestesia general)","MAI",{"$f":"SUM(J2155:O2155)","v":0},{"$nulls":4},{"$f":"+J2155+K2155","v":0},{"$nulls":6},{"$f":"SUM(Q2155:R2155)","v":0},null,null,{"$f":"SUM(T2155:U2155)","v":0},null,null,{"$f":"SUM(W2155:X2155)","v":0},null,null,{"$f":"SUM(Z2155:AA2155)","v":0},{"$nulls":12},"Cmay",{"v":137580,"d":"137,580"},{"$f":"AM2155*I2155","v":0},{"$f":"IF(D2155>=P2155 + S2155+ V2155 + Y2155,\"\",\"La suma no puede ser mayor al total\")","v":""}]
[1803002,"Absceso anorrectal simple, trat. quir.","MAI",{"$f":"SUM(J2156:O2156)","v":0},{"$nulls":4},0,{"$nulls":28},"CMen",{"v":57940,"d":"57,940"},{"$f":"AM2156*I2156","v":0}]
[1803003,"Absceso sacrocoxígeo, drenaje","MAI",{"$f":"SUM(J2157:O2157)","v":0},{"$nulls":4},0,{"$nulls":28},"CMen",{"v":35110,"d":"35,110"},0]
[1803004,"Biopsia quirúrgica rectal (proc. aut.)","MAI",0,{"$nulls":4},0,{"$nulls":6},{"$f":"SUM(Q2158:R2158)","v":0},null,null,{"$f":"SUM(T2158:U2158)","v":0},null,null,{"$f":"SUM(W2158:X2158)","v":0},null,null,{"$f":"SUM(Z2158:AA2158)","v":0},{"$nulls":12},"Cmay",{"v":42240,"d":"42,240"},0,{"$f":"IF(D2158>=P2158 + S2158+ V2158 + Y2158,\"\",\"La suma no puede ser mayor al total\")","v":""}]
[1803005,"Criptectomía y/o papilectomía (cualquier número; proc. aut.)","MAI",0,{"$nulls":4},0,{"$nulls":28},"CMen",{"v":35110,"d":"35,110"},0]
[1803006,"Extracción por vía abdominal","MAI",0,{"$nulls":4},0,{"$nulls":6},0,null,null,0,null,null,0,null,null,0,{"$nulls":12},"Cmay",{"v":221900,"d":"221,900"},0,{"$f":"IF(D2160>=P2160 + S2160+ V2160 + Y2160,\"\",\"La suma no puede ser mayor al total\")","v":""}]
[1803007,"Extracción por vía anal","MAI",0,{"$nulls":4},0,{"$nulls":28},"CMen",{"v":50680,"d":"50,680"},0]
[1803008,"Desgarros y heridas anorrectales, trat. quir- Con compromiso del esfínter","MAI",0,{"$nulls":4},0,{"$nulls":6},0,null,null,0,null,null,0,null,null,0,{"$nulls":12},"Cmay",{"v":164190,"d":"164,190"},0,{"$f":"IF(D2162>=P2162 + S2162+ V2162 + Y2162,\"\",\"La suma no puede ser mayor al total\")","v":""}]
[1803009,"Desgarros y heridas anorrectales, trat. quir- Sin compromiso del esfínter","MAI",0,{"$nulls":4},0,{"$nulls":6},0,null,null,0,null,null,0,null,null,0,{"$nulls":12},"Cmay",{"v":106500,"d":"106,500"},0,""]
[1803010,"Esfinterotomía (proc. aut.)","MAI",0,{"$nulls":4},0,{"$nulls":6},0,null,null,0,null,null,0,null,null,0,{"$nulls":12},"Cmay",{"v":65590,"d":"65,590"},0,""]
[1803011,"Estenosis anal, plastía","MAI",0,{"$nulls":4},0,{"$nulls":6},0,null,null,0,null,null,0,null,null,0,{"$nulls":12},"Cmay",{"v":123950,"d":"123,950"},0,""]
[1803012,"Estenosis rectal, plastía","MAI",0,{"$nulls":4},0,{"$nulls":6},0,null,null,0,null,null,0,null,null,0,{"$nulls":12},"Cmay",{"v":136450,"d":"136,450"},0,""]
[1803013,"Fecaloma, trat. quir.","MAI",0,{"$nulls":4},0,{"$nulls":6},0,null,null,0,null,null,0,null,null,0,{"$nulls":12},"Cmay",{"v":224810,"d":"224,810"},0,""]
[1803014,"Fístula trat. quir. de:- Rectovesical","MAI",0,{"$nulls":4},0,{"$nulls":6},0,null,null,0,null,null,0,null,null,0,{"$nulls":12},"Cmay",{"v":253120,"d":"253,120"},0,""]
[1803015,"Fístula trat. quir. de:- Rectovaginal, rectouretral o uretrovaginal","MAI",0,{"$nulls":4},0,{"$nulls":6},0,null,null,0,null,null,0,null,null,0,{"$nulls":12},"Cmay",{"v":221900,"d":"221,900"},0,""]
[1803016,"Fístula trat. quir. de:- Anorrectal, de cualquier tipo","MAI",0,{"$nulls":4},0,{"$nulls":6},0,null,null,0,null,null,0,null,null,0,{"$nulls":12},"Cmay",{"v":146540,"d":"146,540"},0,""]
[1803017,"Fisura anal, repar. quir.","MAI",0,{"$nulls":4},0,{"$nulls":6},0,null,null,0,null,null,0,null,null,0,{"$nulls":12},"Cmay",{"v":73370,"d":"73,370"},0,""]
[1803018,"Hemorroidectomía (incluye otras operaciones complementarias en canal anal)","MAI",0,{"$nulls":4},0,{"$nulls":6},0,null,null,0,null,null,0,null,null,0,{"$nulls":12},"Cmay",{"v":165480,"d":"165,480"},0,""]
[1803019,"Hemorroides, trombectomía (proc. aut.)","MAI",0,{"$nulls":4},0,{"$nulls":28},"CMen",{"v":23480,"d":"23,480"},0]
[1803020,"Imperforación anal, reconstitución del tránsito- Por vía abdómino-perineal","MAI",0,{"$nulls":4},0,{"$nulls":6},0,null,null,0,null,null,0,null,null,0,{"$nulls":12},"Cmay",{"v":274530,"d":"274,530"},0,{"$f":"IF(D2174>=P2174 + S2174+ V2174 + Y2174,\"\",\"La suma no puede ser mayor al total\")","v":""}]
[1803021,"Imperforación anal, reconstitución del tránsito- Por vía perineal","MAI",0,{"$nulls":4},0,{"$nulls":6},0,null,null,0,null,null,0,null,null,0,{"$nulls":12},"Cmay",{"v":164540,"d":"164,540"},0,""]
[1803022,"Imperforación anal, reconstitución del tránsito- Por vía sagital posterior","MAI",0,{"$nulls":4},0,{"$nulls":6},0,null,null,0,null,null,0,null,null,0,{"$nulls":12},"Cmay",{"v":249540,"d":"249,540"},0,""]
[1803023,"Incontinencia anal, trat. quir. de- Con cerclaje","MAI",0,{"$nulls":4},0,{"$nulls":6},0,null,null,0,null,null,0,null,null,0,{"$nulls":12},"Cmay",{"v":146540,"d":"146,540"},0,""]
[1803024,"Incontinencia anal, trat. quir. de- Con plastía muscular","MAI",0,{"$nulls":4},0,{"$nulls":6},0,null,null,0,null,null,0,null,null,0,{"$nulls":12},"Cmay",{"v":204000,"d":"204,000"},0,""]
[1803025,"Pólipo rectal, trat. quir.- Por vía abdominal","MAI",0,{"$nulls":4},0,{"$nulls":6},0,null,null,0,null,null,0,null,null,0,{"$nulls":12},"Cmay",{"v":221900,"d":"221,900"},0,""]
[1803026,"Pólipo rectal, trat. quir.- Por vía anal","MAI",0,{"$nulls":4},0,{"$nulls":6},0,null,null,0,null,null,0,null,null,0,{"$nulls":12},"Cmay",{"v":137580,"d":"137,580"},0,""]
[1803027,"Prolapso rectal, trat. quir.- Por vía abdominal","MAI",0,{"$nulls":4},0,{"$nulls":6},0,null,null,0,null,null,0,null,null,0,{"$nulls":12},"Cmay",{"v":247870,"d":"247,870"},0,""]
[1803028,"Prolapso rectal, trat. quir.- Por vía anal","MAI",0,{"$nulls":4},0,{"$nulls":6},0,null,null,0,null,null,0,null,null,0,{"$nulls":12},"Cmay",{"v":152020,"d":"152,020"},0,""]
[1803029,"Panproctocolectomía (2 equipos)","MAI",0,{"$nulls":4},0,{"$nulls":6},0,null,null,0,null,null,0,null,null,0,{"$nulls":12},"Cmay",{"v":607880,"d":"607,880"},0,""]
[1803030,"Prurito anal, trat. quir. por denervación","MAI",0,{"$nulls":4},0,{"$nulls":6},0,null,null,0,null,null,0,null,null,0,{"$nulls":12},"Cmay",{"v":77160,"d":"77,160"},0,""]
[1803031,"Quiste sacrocoxígeo, trat. quir.","MAI",0,{"$nulls":4},0,{"$nulls":6},0,null,null,0,null,null,0,null,null,0,{"$nulls":12},"Cmay",{"v":152020,"d":"152,020"},0,""]
[1803032,"Resección abdómino-perineal de ano y recto (2 equipos)","MAI",0,{"$nulls":4},0,{"$nulls":6},0,null,null,0,null,null,0,null,null,0,{"$nulls":12},"Cmay",{"v":433910,"d":"433,910"},0,""]
[1803033,"Resección abdómino-perineal de ano y recto ampliada (2 equipos) (incluye genitales femeninos)","MAI",0,{"$nulls":4},0,{"$nulls":6},0,null,null,0,null,null,0,null,null,0,{"$nulls":12},"Cmay",{"v":503910,"d":"503,910"},0,""]
[1803034,"Resección anterior de recto","MAI",0,{"$nulls":4},0,{"$nulls":6},0,null,null,0,null,null,0,null,null,0,{"$nulls":12},"Cmay",{"v":352480,"d":"352,480"},0,""]
[1803035,"Resección perineal de ano y recto","MAI",0,{"$nulls":4},0,{"$nulls":6},0,null,null,0,null,null,0,null,null,0,{"$nulls":12},"Cmay",{"v":287220,"d":"287,220"},0,""]
[1803036,"A los cirujanos del equipo perineal en cada intervención anterior","MAI",0,{"$nulls":4},0,{"$nulls":28},"CMen",{"v":155920,"d":"155,920"},0]
[1803038,"Condilomas anales, trat. quir. (para electrofulguración ver cód. 16-01-006)","MAI",0,{"$nulls":4},0,{"$nulls":6},0,null,null,0,null,null,0,null,null,0,{"$nulls":12},"Cmay",{"v":114050,"d":"114,050"},0,{"$f":"IF(D2191>=P2191 + S2191+ V2191 + Y2191,\"\",\"La suma no puede ser mayor al total\")","v":""}]
[null,"TOTAL",null,{"$f":"SUM(D2155:D2191)","v":0},{"$nulls":4},{"$f":"SUM(I2155:I2191)","v":0},0,0,0,0,0,0,0,0,0,0,0,0,0,0,0,0,0,0,0,0,0,0,0,0,0,0,0,0,0,{"v":6769010,"d":"6,769,010"},{"$f":"SUM(AN2155:AN2191)","v":0}]
["PROCEDIMIENTOS DE UROLOGÍA Y NEFROLOGÍA"]
[1901001,"Exploracion de uretra antero-posterior con bujia y/o explo -","MLE",{"$f":"SUM(E2194+H2194)","v":0},{"$f":"SUM(F2194:G2194)","v":0},{"$nulls":32},"Proc"]
[1901002,"Cistoscopia con sondeo de uno o ambos ureteres","MLE",0,0,{"$nulls":32},"Proc"]
[1901003,"Cistoscopia y/o uretrocistoscopia y/o uretroscopia","MLE",0,0,{"$nulls":32},"Proc"]
[1901004,"Ureteronefroscopia","MLE",0,0,{"$nulls":32},"Proc"]
[1901005,"Prostatica transparietal o transrectal (ademas anestesia","MLE",0,0,{"$nulls":32},"Proc"]
[1901006,"Renal transparietal","MLE",0,0,{"$nulls":32},"Proc"]
[1901007,"Cistometria (proc.aut.)","MLE",0,0,{"$nulls":32},"Proc"]
[1901008,"Electromiografia perineal y del esfinter uretral en adultos","MLE",0,0,{"$nulls":32},"Proc"]
[1901009,"Electromiografia perineal y del esfinter uretral en ninos","MLE",0,0,{"$nulls":32},"Proc"]
[1901010,"Perfil uretral (proc.aut.)","MLE",0,0,{"$nulls":32},"Proc"]
[1901011,"Uroflujometria (proc.aut.)","MLE",0,0,{"$nulls":32},"Proc"]
[1901030,"Estudio urodinamico (incluye cistometria, emg perineal y del","MLE",{"$f":"SUM(E2205+H2205)","v":0},{"$f":"SUM(F2205:G2205)","v":0},{"$nulls":32},"Proc"]
[1901012,"Cistografia por sonda (de relleno) o por puncion  hipo-","MLE",0,0,{"$nulls":32},"Proc"]
[1901013,"Inyeccion de medio de contraste en cuerpo cavernoso","MLE",0,0,{"$nulls":32},"Proc"]
[1901015,"Ureteropielografia ascendente (directa) por cateterismo","MLE",0,0,{"$nulls":32},"Proc"]
[1901016,"Uretrografia retrograda o cistouretrografia (miccional)","MLE",0,0,{"$nulls":32},"Proc"]
[1901018,"Dilatacion uretra c/s masaje, c/s instilacion o inyeccion de","MLE",0,0,{"$nulls":32},"Proc"]
[1901019,"Instilacion vesical (incluye colocacion de sonda) proc. Aut.                                      ","MLE",0,0,{"$nulls":32},"Proc"]
[1901020,"Inyeccion de medicamentos en el pene","MLE",0,0,{"$nulls":32},"Proc"]
[1901021,"Vac. Vesical p/puncion hipogastrica o cistostomia p/puncion","MLE",0,0,{"$nulls":32},"Proc"]
[1901022,"Vac. Vesical por sonda uretral, (proc. Aut.)                                                    ","MLE",0,0,{"$nulls":32},"Proc"]
[5099110,"Procedimiento hemodinamia-ablacion renal   ",null,0,0,{"$nulls":32},"Proc"]
[" 5099021 "," Urología:Urodinamia ",null,0,0,{"$nulls":32},"Proc"]
[" 5099109 "," Urologia-instalacion de sonda vesical ",null,0,0,{"$nulls":32},"Proc"]
[null," Extracción percutánea de calculos renales ",null,0,0,{"$nulls":32},"Proc"]
[null," Plasmaferesis en patología renal",null,0,0,{"$nulls":32},"Proc"]
[null,"TOTAL PRODUCCION",null,{"$f":"SUM(D2194:D2219)","v":0},{"$f":"SUM(E2194:E2219)","v":0},0,0,0,{"$nulls":19},0,0,0,0,0,0,0,0,0,0]
[null,"GRUPO 19 : UROLOGIA Y NEFROLOGIA   "]
[null,"DIALISIS                                                    "]
[1901023,"Hemodiálisis con insumos incluidos","MAI",0,0,{"$nulls":32},"Proc",{"v":45790,"d":"45,790"},{"$f":"AM2223*F2223","v":0}]
[1901024,"Hemodiálisis sin insumos","MAI",0,0,{"$nulls":32},"Proc",{"v":28790,"d":"28,790"},0]
[1901025,"Peritoneodiálisis  (incluye insumos)","MAI",0,0,{"$nulls":32},"Proc",{"v":29650,"d":"29,650"},0]
[1901026,"Peritoneodiálisis continua en paciente crónico (adulto o niños) (tratamiento mensual)","MAI",0,0,{"$nulls":32},"Proc",{"v":889830,"d":"889,830"},0]
[1901126,"Instalación de cateter para peritoneodiális","MAI",0,0,{"$nulls":32},"Proc",{"v":404170,"d":"404,170"},0]
[1901027,"Hemodiálisis, tratamiento mensual (con insumos incluidos)","MAI",0,0,{"$nulls":32},"Proc",{"v":618020,"d":"618,020"},0]
[1901028,"Hemodiálisis con bicarbonato con insumos (por sesion)","MAI",0,0,{"$nulls":32},"Proc",{"v":55720,"d":"55,720"},0]
[1901029,"Hemodiálisis con bicarbonato con insumos (tratamiento mensual)","MAI",0,0,{"$nulls":32},"Proc",{"v":724410,"d":"724,410"},0]
[null,"TOTAL",null,{"$f":"SUM(D2223:D2230)","v":0},0,0,0,0,{"$nulls":19},{"$f":"SUM(AB2223:AB2230)","v":0},0,0,0,0,0,0,0,0,0,0,{"v":2796380,"d":"2,796,380"},0]
[null,"CIRUGIA UROLOGICA Y SUPRARRENAL                           "]
[1902001,"Absceso perinefrítico, vaciamiento","MAI",{"$f":"SUM(J2233:O2233)","v":0},{"$nulls":4},{"$f":"+J2233+K2233","v":0},{"$nulls":6},{"$f":"SUM(Q2233:R2233)","v":0},null,null,{"$f":"SUM(T2233:U2233)","v":0},null,null,{"$f":"SUM(W2233:X2233)","v":0},null,null,{"$f":"SUM(Z2233:AA2233)","v":0},{"$nulls":12},"Cmay",{"v":190740,"d":"190,740"},{"$f":"AM2233*I2233","v":0},{"$f":"IF(D2233>=P2233 + S2233+ V2233 + Y2233,\"\",\"La suma no puede ser mayor al total\")","v":""}]
[1902002,"Arterias renales, operaciones sobre (proc. aut.)","MAI",{"$f":"SUM(J2234:O2234)","v":0},{"$nulls":4},0,{"$nulls":6},{"$f":"SUM(Q2234:R2234)","v":0},null,null,{"$f":"SUM(T2234:U2234)","v":0},null,null,{"$f":"SUM(W2234:X2234)","v":0},null,null,{"$f":"SUM(Z2234:AA2234)","v":0},{"$nulls":12},"Cmay",{"v":504060,"d":"504,060"},{"$f":"AM2234*I2234","v":0},""]
[1902003,"Auto o heterotrasplante","MAI",{"$f":"SUM(J2235:O2235)","v":0},{"$nulls":4},0,{"$nulls":6},{"$f":"SUM(Q2235:R2235)","v":0},null,null,{"$f":"SUM(T2235:U2235)","v":0},null,null,{"$f":"SUM(W2235:X2235)","v":0},null,null,{"$f":"SUM(Z2235:AA2235)","v":0},{"$nulls":12},"Cmay",{"v":696260,"d":"696,260"},0,""]
[1902004,"Cirugía de banco, (proc. completo) (micro-extracorpórea), autotrasplante","MAI",0,{"$nulls":4},0,{"$nulls":6},{"$f":"SUM(Q2236:R2236)","v":0},null,null,{"$f":"SUM(T2236:U2236)","v":0},null,null,{"$f":"SUM(W2236:X2236)","v":0},null,null,{"$f":"SUM(Z2236:AA2236)","v":0},{"$nulls":12},"Cmay",{"v":677400,"d":"677,400"},0,""]
[1902005,"Litiasis renal, trat. quir. percutáneo c/s ultrasonido (incluye todo el procedimiento)","MAI",0,{"$nulls":4},0,{"$nulls":6},0,null,null,0,null,null,0,null,null,0,{"$nulls":12},"Cmay",{"v":375270,"d":"375,270"},0,""]
[1902090,"Litiasis renal trat. por onda de choque (litotripsia extracorpórea)","MAI",0,{"$nulls":4},0,{"$nulls":6},0,null,null,0,null,null,0,null,null,0,{"$nulls":12},"Cmay",{"v":464990,"d":"464,990"},0,""]
[1902006,"Litiasis renal, trat. quir. por nefrotomía anatrófica o bivalva","MAI",0,{"$nulls":4},0,{"$nulls":6},0,null,null,0,null,null,0,null,null,0,{"$nulls":12},"Cmay",{"v":320660,"d":"320,660"},0,""]
[1902008,"Lumbotomía exploradora c/s dren., c/s biopsia (proc. aut.)","MAI",0,{"$nulls":4},0,{"$nulls":6},0,null,null,0,null,null,0,null,null,0,{"$nulls":12},"Cmay",{"v":206590,"d":"206,590"},0,""]
[1902009,"Nefrectomía parcial cualquier vía y técnica. Incluye disección ganglionar etapificadora o reductiva","MAI",0,{"$nulls":4},0,{"$nulls":6},0,null,null,0,null,null,0,null,null,0,{"$nulls":12},"Cmay",{"v":506530,"d":"506,530"},0,""]
[1902010,"Nefrectomía radical ampliada (incluye ganglios)","MAI",0,{"$nulls":4},0,{"$nulls":6},0,null,null,0,null,null,0,null,null,0,{"$nulls":12},"Cmay",{"v":506530,"d":"506,530"},0,""]
[1902011,"Nefrectomía total","MAI",0,{"$nulls":4},0,{"$nulls":6},0,null,null,0,null,null,0,null,null,0,{"$nulls":12},"Cmay",{"v":263500,"d":"263,500"},0,""]
[1902012,"Nefrostomía, nefropexia y/o nefrotomía por litiasis, biopsias u otras","MAI",0,{"$nulls":4},0,{"$nulls":6},0,null,null,0,null,null,0,null,null,0,{"$nulls":12},"Cmay",{"v":237470,"d":"237,470"},0,""]
[1902013,"Pielotomía exploradora y/o terapéutica (incluye la  pielostomía y/o pieloplastía)","MAI",0,{"$nulls":4},0,{"$nulls":6},0,null,null,0,null,null,0,null,null,0,{"$nulls":12},"Cmay",{"v":330980,"d":"330,980"},0,""]
[1902014,"Suprarrenalectomía bilateral","MAI",0,{"$nulls":4},0,{"$nulls":6},0,null,null,0,null,null,0,null,null,0,{"$nulls":12},"Cmay",{"v":420040,"d":"420,040"},0,""]
[1902015,"Suprarrenalectomía unilateral","MAI",0,{"$nulls":4},0,{"$nulls":6},0,null,null,0,null,null,0,null,null,0,{"$nulls":12},"Cmay",{"v":320660,"d":"320,660"},0,""]
[1902016,"Anastomosis de los uréteres","MAI",0,{"$nulls":4},0,{"$nulls":6},0,null,null,0,null,null,0,null,null,0,{"$nulls":12},"Cmay",{"v":352480,"d":"352,480"},0,""]
[1902017,"Fístula urétero-vaginal, trat. quir.","MAI",0,{"$nulls":4},0,{"$nulls":6},0,null,null,0,null,null,0,null,null,0,{"$nulls":12},"Cmay",{"v":294630,"d":"294,630"},0,""]
[1902018,"Nefroureterectomía","MAI",0,{"$nulls":4},0,{"$nulls":6},0,null,null,0,null,null,0,null,null,0,{"$nulls":12},"Cmay",{"v":424560,"d":"424,560"},0,""]
[1902019,"Ureterectomía","MAI",0,{"$nulls":4},0,{"$nulls":6},0,null,null,0,null,null,0,null,null,0,{"$nulls":12},"Cmay",{"v":305060,"d":"305,060"},0,""]
[1902020,"Urétero-litotomía abierta","MAI",0,{"$nulls":4},0,{"$nulls":6},0,null,null,0,null,null,0,null,null,0,{"$nulls":12},"Cmay",{"v":229990,"d":"229,990"},0,""]
[1902021,"Urétero o negro-litotomía endoscópica c/ureteroscopía rigida o flexible, con o sin fragmentación.","MAI",0,{"$nulls":4},0,{"$nulls":6},0,null,null,0,null,null,0,null,null,0,{"$nulls":12},"Cmay",{"v":464990,"d":"464,990"},0,""]
[1902022,"Ureteroplastías, proc. completo","MAI",0,{"$nulls":4},0,{"$nulls":6},0,null,null,0,null,null,0,null,null,0,{"$nulls":12},"Cmay",{"v":352480,"d":"352,480"},0,""]
[1902023,"Uréterorrafia y/o uréterolisis c/u","MAI",0,{"$nulls":4},0,{"$nulls":6},0,null,null,0,null,null,0,null,null,0,{"$nulls":12},"Cmay",{"v":253120,"d":"253,120"},0,""]
[1902024,"Ureterostomía bilateral: vesical, cutánea o intestinal","MAI",0,{"$nulls":4},0,{"$nulls":6},0,null,null,0,null,null,0,null,null,0,{"$nulls":12},"Cmay",{"v":440850,"d":"440,850"},0,""]
[1902025,"Ureterostomía unilateral: vesical, cutánea o intestinal","MAI",0,{"$nulls":4},0,{"$nulls":6},0,null,null,0,null,null,0,null,null,0,{"$nulls":12},"Cmay",{"v":330980,"d":"330,980"},0,""]
[1902027,"Cistectomía parcial y/o trat. quir. de divertículo vesical","MAI",0,{"$nulls":4},0,{"$nulls":6},0,null,null,0,null,null,0,null,null,0,{"$nulls":12},"Cmay",{"v":242680,"d":"242,680"},0,""]
[1902028,"Cistectomía radical, proc. completo","MAI",0,{"$nulls":4},0,{"$nulls":6},0,null,null,0,null,null,0,null,null,0,{"$nulls":12},"Cmay",{"v":662830,"d":"662,830"},0,""]
[1902029,"Cistoplastía, proc. completo","MAI",0,{"$nulls":4},0,{"$nulls":6},0,null,null,0,null,null,0,null,null,0,{"$nulls":12},"Cmay",{"v":440850,"d":"440,850"},0,""]
[1902030,"Cistorrafia, proc. completo","MAI",0,{"$nulls":4},0,{"$nulls":6},0,null,null,0,null,null,0,null,null,0,{"$nulls":12},"Cmay",{"v":164540,"d":"164,540"},0,""]
[1902031,"Cistostomía c/s extracción de cuerpo extraño o cálculo","MAI",0,{"$nulls":4},0,{"$nulls":6},0,null,null,0,null,null,0,null,null,0,{"$nulls":12},"Cmay",{"v":164540,"d":"164,540"},0,""]
[1902032,"Extrofia vesical, proc. completo","MAI",0,{"$nulls":4},0,{"$nulls":6},0,null,null,0,null,null,0,null,null,0,{"$nulls":12},"Cmay",{"v":320630,"d":"320,630"},0,""]
[1902033,"Fístula vésico-cutánea, y/o vaginal, y/o intest., trat. quir.","MAI",0,{"$nulls":4},0,{"$nulls":6},0,null,null,0,null,null,0,null,null,0,{"$nulls":12},"Cmay",{"v":247870,"d":"247,870"},0,""]
[1902034,"Lesiones del cuello vesical, trat. quir.","MAI",0,{"$nulls":4},0,{"$nulls":6},0,null,null,0,null,null,0,null,null,0,{"$nulls":12},"Cmay",{"v":201140,"d":"201,140"},0,""]
[1902035,"Ligadura de arterias hipogástricas (proc. aut.)","MAI",0,{"$nulls":4},0,{"$nulls":6},0,null,null,0,null,null,0,null,null,0,{"$nulls":12},"Cmay",{"v":198850,"d":"198,850"},0,""]
[1902036,"Operación de Bricker","MAI",0,{"$nulls":4},0,{"$nulls":6},0,null,null,0,null,null,0,null,null,0,{"$nulls":12},"Cmay",{"v":483660,"d":"483,660"},0,""]
[1902037,"Resección endoscópica de cáncer vesical","MAI",0,{"$nulls":4},0,{"$nulls":6},0,null,null,0,null,null,0,null,null,0,{"$nulls":12},"Cmay",{"v":264140,"d":"264,140"},0,""]
[1902038,"Reservorio continente intestinal externo o interno","MAI",0,{"$nulls":4},0,{"$nulls":6},0,null,null,0,null,null,0,null,null,0,{"$nulls":12},"Cmay",{"v":440850,"d":"440,850"},0,""]
[1902040,"Diverticulectomía por vía vaginal, perineal, penoescrotal o quistectomía uretral","MAI",0,{"$nulls":4},0,{"$nulls":6},0,null,null,0,null,null,0,null,null,0,{"$nulls":12},"Cmay",{"v":253120,"d":"253,120"},0,""]
[1902041,"Flegmón urinoso, drenaje y cistostomía","MAI",0,{"$nulls":4},0,{"$nulls":6},0,null,null,0,null,null,0,null,null,0,{"$nulls":12},"Cmay",{"v":183230,"d":"183,230"},0,""]
[1902042,"Glándulas de Cowper, lesiones de las, trat. quir.","MAI",0,{"$nulls":4},0,{"$nulls":6},0,null,null,0,null,null,0,null,null,0,{"$nulls":12},"Cmay",{"v":118920,"d":"118,920"},0,""]
[1902043,"Hipospadia distal o plastía de uretra (cada tiempo)","MAI",0,{"$nulls":4},0,{"$nulls":6},0,null,null,0,null,null,0,null,null,0,{"$nulls":12},"Cmay",{"v":198850,"d":"198,850"},0,""]
[1902044,"Hipospadia proximal, trat. quir. en un tiempo","MAI",0,{"$nulls":4},0,{"$nulls":6},0,null,null,0,null,null,0,null,null,0,{"$nulls":12},"Cmay",{"v":247870,"d":"247,870"},0,""]
[1902045,"Incontinencia urinaria, trat. quir. por vía abdominal, suprapúbica o combinada (proc. aut.)","MAI",0,{"$nulls":4},0,{"$nulls":6},0,null,null,0,null,null,0,null,null,0,{"$nulls":12},"Cmay",{"v":235580,"d":"235,580"},0,""]
[1902046,"Meatotomía mujer","MAI",0,{"$nulls":4},0,{"$nulls":6},0,null,null,0,null,null,0,null,null,0,{"$nulls":12},"Cmay",{"v":44890,"d":"44,890"},0,""]
[1902047,"Meatotomía quirúrgica c/s resección de pólipo o carúncula","MAI",0,{"$nulls":4},0,{"$nulls":6},0,null,null,0,null,null,0,null,null,0,{"$nulls":12},"Cmay",{"v":118920,"d":"118,920"},0,""]
[1902048,"Pólipo meato, electrocoagulación","MAI",0,{"$nulls":4},0,{"$nulls":6},0,null,null,0,null,null,0,null,null,0,{"$nulls":12},"Cmay",{"v":37060,"d":"37,060"},0,""]
[1902049,"Uretrectomía c/s cistostomía","MAI",0,{"$nulls":4},0,{"$nulls":6},0,null,null,0,null,null,0,null,null,0,{"$nulls":12},"Cmay",{"v":240070,"d":"240,070"},0,""]
[1902050,"Plastía de uretra o trat. de fístulas residuales","MAI",0,{"$nulls":4},0,{"$nulls":6},0,null,null,0,null,null,0,null,null,0,{"$nulls":12},"Cmay",{"v":143100,"d":"143,100"},0,""]
[1902051,"Uretrostomía","MAI",0,{"$nulls":4},0,{"$nulls":6},0,null,null,0,null,null,0,null,null,0,{"$nulls":12},"Cmay",{"v":124340,"d":"124,340"},0,""]
[1902052,"Uretrotomía externa (proc. aut.)","MAI",0,{"$nulls":4},0,{"$nulls":6},0,null,null,0,null,null,0,null,null,0,{"$nulls":12},"Cmay",{"v":143100,"d":"143,100"},0,""]
[1902053,"Uretrotomía interna y/o uretrolitotomía (proc. aut.)","MAI",0,{"$nulls":4},0,{"$nulls":6},0,null,null,0,null,null,0,null,null,0,{"$nulls":12},"Cmay",{"v":156580,"d":"156,580"},0,""]
[1902054,"Absceso, trat. quir.","MAI",0,{"$nulls":4},0,{"$nulls":6},0,null,null,0,null,null,0,null,null,0,{"$nulls":12},"Cmay",{"v":137580,"d":"137,580"},0,""]
[1902055,"Adenoma o cáncer prostático, resección endoscópica","MAI",0,{"$nulls":4},0,{"$nulls":6},0,null,null,0,null,null,0,null,null,0,{"$nulls":12},"Cmay",{"v":258240,"d":"258,240"},0,""]
[1902056,"Adenoma prostático, trat. quir. cualquier vía o técnica abierta","MAI",0,{"$nulls":4},0,{"$nulls":6},0,null,null,0,null,null,0,null,null,0,{"$nulls":12},"Cmay",{"v":284240,"d":"284,240"},0,""]
[1902057,"Prostatectomía radical por cáncer prostáctico, cualquier vía o técnica, incluye linfadenectomía si corresponde ","MAI",0,{"$nulls":4},0,{"$nulls":6},0,null,null,0,null,null,0,null,null,0,{"$nulls":12},"Cmay",{"v":506530,"d":"506,530"},0,""]
[1902058,"Vesiculostomía diagnóstica y/o terapéutica","MAI",0,{"$nulls":4},0,{"$nulls":6},0,null,null,0,null,null,0,null,null,0,{"$nulls":12},"Cmay",{"v":137580,"d":"137,580"},0,""]
[1902059,"Biopsia quirúrgica (uno o ambos) (proc. aut.)","MAI",0,{"$nulls":4},0,{"$nulls":6},0,null,null,0,null,null,0,null,null,0,{"$nulls":12},"Cmay",{"v":137580,"d":"137,580"},0,""]
[1902060,"Descenso testículo abdominal c/s hernioplastía","MAI",0,{"$nulls":4},0,{"$nulls":6},0,null,null,0,null,null,0,null,null,0,{"$nulls":12},"Cmay",{"v":189400,"d":"189,400"},0,""]
[1902061,"Descenso testículo inguinal c/s hernioplastía","MAI",0,{"$nulls":4},0,{"$nulls":6},0,null,null,0,null,null,0,null,null,0,{"$nulls":12},"Cmay",{"v":161800,"d":"161,800"},0,""]
[1902062,"Escroto, plastía de, proc. completo","MAI",0,{"$nulls":4},0,{"$nulls":6},0,null,null,0,null,null,0,null,null,0,{"$nulls":12},"Cmay",{"v":146540,"d":"146,540"},0,""]
[1902063,"Hidatidectomía unilat. c/s eversión de la vaginal (proc. aut.)","MAI",0,{"$nulls":4},0,{"$nulls":6},0,null,null,0,null,null,0,null,null,0,{"$nulls":12},"Cmay",{"v":137580,"d":"137,580"},0,""]
[1902064,"Hidrocele y/o hematocele, trat. quir.","MAI",0,{"$nulls":4},0,{"$nulls":6},0,null,null,0,null,null,0,null,null,0,{"$nulls":12},"Cmay",{"v":137580,"d":"137,580"},0,""]
[1902065,"Orquidectomía un lado","MAI",0,{"$nulls":4},0,{"$nulls":6},0,null,null,0,null,null,0,null,null,0,{"$nulls":12},"Cmay",{"v":137580,"d":"137,580"},0,""]
[1902066,"Orquidopexia  un lado","MAI",0,{"$nulls":4},0,{"$nulls":6},0,null,null,0,null,null,0,null,null,0,{"$nulls":12},"Cmay",{"v":137580,"d":"137,580"},0,""]
[1902067,"Prótesis testicular, (proc. aut.)","MAI",0,{"$nulls":4},{"$f":"+J2297+K2297","v":0},{"$nulls":6},0,null,null,0,null,null,0,null,null,0,{"$nulls":12},"Cmay",{"v":137580,"d":"137,580"},0,{"$f":"IF(D2297>=P2297 + S2297+ V2297 + Y2297,\"\",\"La suma no puede ser mayor al total\")","v":""}]
[1902068,"Orquidectomía ampliada por cáncer testicular","MAI",0,{"$nulls":4},0,{"$nulls":6},0,null,null,0,null,null,0,null,null,0,{"$nulls":12},"Cmay",{"v":170730,"d":"170,730"},{"$f":"AM2298*I2298","v":0},""]
[1902069,"Tumores malignos del testículo, orquidectomía ampliada con vaciamiento lumbo-aórtico","MAI",{"$f":"SUM(J2299:O2299)","v":0},{"$nulls":4},0,{"$nulls":6},0,null,null,0,null,null,0,null,null,0,{"$nulls":12},"Cmay",{"v":475500,"d":"475,500"},0,""]
[1902070,"Anastomosis de los deferentes","MAI",0,{"$nulls":4},0,{"$nulls":6},{"$f":"SUM(Q2300:R2300)","v":0},null,null,{"$f":"SUM(T2300:U2300)","v":0},null,null,{"$f":"SUM(W2300:X2300)","v":0},null,null,{"$f":"SUM(Z2300:AA2300)","v":0},{"$nulls":12},"Cmay",{"v":219630,"d":"219,630"},0,""]
[1902071,"Epididimectomía parcial o total, un lado","MAI",0,{"$nulls":4},0,{"$nulls":6},0,null,null,0,null,null,0,null,null,0,{"$nulls":12},"Cmay",{"v":151390,"d":"151,390"},0,""]
[1902072,"Plastía epidídimo-deferente (operación de Martín o sim.)","MAI",0,{"$nulls":4},0,{"$nulls":6},0,null,null,0,null,null,0,null,null,0,{"$nulls":12},"Cmay",{"v":219630,"d":"219,630"},0,""]
[1902073,"Quistes del cordón, y/o epidídimo, extirpación; epididimotomía diagnóstica y/o terapéutica (proc. aut.)","MAI",0,{"$nulls":4},0,{"$nulls":6},0,null,null,0,null,null,0,null,null,0,{"$nulls":12},"Cmay",{"v":137580,"d":"137,580"},0,""]
[1902074,"Torsión del cordón, trat. quir. (incluye la fijación del otro testículo)","MAI",0,{"$nulls":4},0,{"$nulls":6},0,null,null,0,null,null,0,null,null,0,{"$nulls":12},"Cmay",{"v":143100,"d":"143,100"},0,""]
[1902075,"Varicocele unilateral, trat. quir.","MAI",0,{"$nulls":4},0,{"$nulls":6},0,null,null,0,null,null,0,null,null,0,{"$nulls":12},"Cmay",{"v":137580,"d":"137,580"},0,""]
[1902076,"Vasectomía bilateral, (proc. aut.) (la vasectomía como tiempo previo a una resección de próstata esta incluida en la prostatectomía)","MAI",0,{"$nulls":4},0,{"$nulls":6},0,null,null,0,null,null,0,null,null,0,{"$nulls":12},"Cmay",{"v":137580,"d":"137,580"},0,""]
[1902077,"Epispadias, trat. quir.","MAI",0,{"$nulls":4},0,{"$nulls":6},0,null,null,0,null,null,0,null,null,0,{"$nulls":12},"Cmay",{"v":219630,"d":"219,630"},0,""]
[1902078,"Amputación parcial del pene (proc. aut.)","MAI",0,{"$nulls":4},0,{"$nulls":6},0,null,null,0,null,null,0,null,null,0,{"$nulls":12},"Cmay",{"v":170730,"d":"170,730"},0,""]
[1902079,"Amputación total del pene, proc. completo","MAI",0,{"$nulls":4},0,{"$nulls":6},0,null,null,0,null,null,0,null,null,0,{"$nulls":12},"Cmay",{"v":279040,"d":"279,040"},0,""]
[1902080,"Biopsia de pene (proc. aut.)","MAI",0,{"$nulls":4},0,{"$nulls":28},"CMen",{"v":37730,"d":"37,730"},0]
[1902081,"Cavernosostomía y/o caverno-espongiostomía y/o shunt safenocavernoso","MAI",0,{"$nulls":4},0,{"$nulls":6},0,null,null,0,null,null,0,null,null,0,{"$nulls":12},"Cmay",{"v":170730,"d":"170,730"},0,{"$f":"IF(D2311>=P2311 + S2311+ V2311 + Y2311,\"\",\"La suma no puede ser mayor al total\")","v":""}]
[1902082,"Circuncisión (incluye sección de frenillo, y/o de sinequias bálano-prepuciales, y/o incisión dorsal c/s meatotomía)","MAI",0,{"$nulls":4},0,{"$nulls":6},0,null,null,0,null,null,0,null,null,0,{"$nulls":12},"Cmay",{"v":143100,"d":"143,100"},0,""]
[1902083,"Lesiones del cuerpo cavernoso, trat. quir.","MAI",0,{"$nulls":4},0,{"$nulls":6},0,null,null,0,null,null,0,null,null,0,{"$nulls":12},"Cmay",{"v":151390,"d":"151,390"},0,""]
[1902084,"Meatotomía hombre y/o sección frenillo y/o incisión dorsal, (proc. aut.)","MAI",0,{"$nulls":4},0,{"$nulls":28},"CMen",{"v":28300,"d":"28,300"},0]
[1902085,"Plastía de pene, proc. completo (no incluye valor de la prótesis)","MAI",0,{"$nulls":4},0,{"$nulls":6},0,null,null,0,null,null,0,null,null,0,{"$nulls":12},"Cmay",{"v":281970,"d":"281,970"},0,{"$f":"IF(D2315>=P2315 + S2315+ V2315 + Y2315,\"\",\"La suma no puede ser mayor al total\")","v":""}]
[null,"TOTAL",null,{"$f":"SUM(D2233:D2315)","v":0},{"$nulls":4},{"$f":"SUM(I2233:I2315)","v":0},0,0,0,0,0,0,0,0,0,0,0,0,0,0,0,0,0,0,0,0,0,0,0,0,0,0,0,0,0,{"$f":"SUM(AM2233:AM2315)","v":{"v":21471760,"d":"21,471,760"}},{"$f":"SUM(AN2233:AN2315)","v":0}]
[null,"GRUPO 20 : GINECOLOGIA Y OBSTETRICIA  "]
[2001001,"Amnioscopía c/s escalpe fetal","MAI",{"$f":"SUM(E2318+H2318)","v":0},{"$f":"SUM(F2318:G2318)","v":0},{"$nulls":32},"Proc",{"v":12970,"d":"12,970"},{"$f":"AM2318*F2318","v":0}]
[2001002,"Colposcopía","MAI",0,0,{"$nulls":32},"Proc",{"v":6930,"d":"6,930"},0]
[2001005,"Histeroscopía diagnostica o terapéutica (proc. aut.)","MAI",0,0,{"$nulls":32},"Proc",{"v":29510,"d":"29,510"},0]
[2001006,"Amniocentesis","MAI",0,0,{"$nulls":32},"Proc",{"v":9520,"d":"9,520"},0]
[2001007,"Culdocentesis (punción del Douglas)","MAI",0,0,{"$nulls":32},"Proc",{"v":19860,"d":"19,860"},0]
[2001008,"Hidrotubación y/o insuflación de trompas","MAI",0,0,{"$nulls":32},"Proc",{"v":9520,"d":"9,520"},0]
[2001009,"Monitoreo basal con informe","MAI",0,0,{"$nulls":32},"Proc",{"v":3880,"d":"3,880"},0]
[2001010,"Monitoreo fetal estresante, con control permanente del especialista y tratamiento de las posibles complicaciones","MAI",0,0,{"$nulls":32},"Proc",{"v":12360,"d":"12,360"},0]
[2001021,"Cordocentesis","MAI",0,0,{"$nulls":32},"Proc",{"v":22240,"d":"22,240"},0]
[2001012,"Galactografía (a.c.  04-02-005)","MAI",0,0,{"$nulls":32},"Proc",{"v":10040,"d":"10,040"},0]
[2001013,"Histerosalpingografía (a.c. 04-02-011)","MAI",0,0,{"$nulls":32},"Proc",{"v":13000,"d":"13,000"},0]
[2001014,"Biopsia endometrio, vulva, vagina, cuello, c/u (proc. aut.)","MAI",0,0,{"$nulls":32},"Proc",{"v":19680,"d":"19,680"},0]
[2001015,"Colocación o extracción de dispositivo intrauterino (no incluye el valor del dispositivo)                    ","MAI",0,0,{"$nulls":32},"Proc",{"v":8180,"d":"8,180"},0]
[2001016,"Electrodiatermo o criocoagulación de lesiones del cuello","MAI",0,0,{"$nulls":32},"Proc",{"v":20060,"d":"20,060"},0]
[2001020,"Test postcoital","MAI",0,0,{"$nulls":32},"Proc",{"v":10040,"d":"10,040"},0]
[2001022,"Punción evacuadora de quistes mamarios, c/s toma de muestras, c/s inyección de medicamentos","MAI",0,0,{"$nulls":32},"Proc",{"v":9220,"d":"9,220"},0]
[2001023,"Biopsia estereotaxíca digital de mama","MAI",0,0,{"$nulls":32},"Proc",{"v":467610,"d":"467,610"},0]
[null,"Total ARANCEL MAI",null,{"$f":"SUM(D2318:D2334)","v":0},{"$f":"SUM(E2318:E2334)","v":0},{"$f":"SUM(F2318:F2334)","v":0},{"$f":"SUM(G2318:G2334)","v":0},{"$f":"SUM(H2318:H2334)","v":0},{"$nulls":19},{"$f":"SUM(AB2318:AB2334)","v":0},0,0,0,0,0,0,0,0,0,0,{"v":684620,"d":"684,620"},0]
[5099003,"Biopsia estereotáxica de mama",null,0,0,{"$nulls":32},"Proc"]
[5099004,"Biopsia core (BC) guiada por ultrasonido (US)",null,0,0,{"$nulls":32},"Proc"]
[5099045,"Insercion Implante Anticonceptivo",null,0,0,{"$nulls":32},"Proc"]
[5099046,"Remocion Implante Anticonceptivo",null,{"$f":"SUM(E2339+H2339)","v":0},{"$f":"SUM(F2339:G2339)","v":0},{"$nulls":32},"Proc"]
[5099047,"Insercion Pellets subcutáneo ",null,{"$f":"SUM(E2340+H2340)","v":0},{"$f":"SUM(F2340:G2340)","v":0},{"$nulls":32},"Proc"]
[null,"Electrofulguración condiloma",null,{"$f":"SUM(E2341+H2341)","v":0},{"$f":"SUM(F2341:G2341)","v":0},{"$nulls":32},"Proc"]
[null,"TOTAL ARANCEL MLE Y NO ARANCELADO",null,{"$f":"SUM(D2336:D2341)","v":0},{"$f":"SUM(E2336:E2341)","v":0},0,0,0,{"$nulls":19},0,0,0,0,0,0,0,0,0,0,0]
[null,"TOTAL PRODUCCION",null,{"$f":"SUM(D2335+D2342)","v":0},{"$f":"SUM(E2335+E2342)","v":0},0,0,0,{"$nulls":19},0,0,0,0,0,0,0,0,0,0,0,{"v":684620,"d":"684,620"},0]
[null,"CIRUGIA DE LA MAMA (UN LADO)  "]
[2002001,"Absceso y/o hematoma, trat. quir.","MAI",{"$f":"SUM(J2345:O2345)","v":0},{"$nulls":4},{"$f":"+J2345+K2345","v":0},{"$nulls":28},"CMen",{"v":33860,"d":"33,860"},{"$f":"AM2345*I2345","v":0}]
[2002002,"Mastectomía parcial (cuadrantectomía o similar) o total s/vaciamiento ganglionar","MAI",{"$f":"SUM(J2346:O2346)","v":0},{"$nulls":4},0,{"$nulls":6},{"$f":"SUM(Q2346:R2346)","v":0},null,null,{"$f":"SUM(T2346:U2346)","v":0},null,null,{"$f":"SUM(W2346:X2346)","v":0},null,null,{"$f":"SUM(Z2346:AA2346)","v":0},{"$nulls":12},"Cmay",{"v":196280,"d":"196,280"},{"$f":"AM2346*I2346","v":0},{"$f":"IF(D2346>=P2346 + S2346+ V2346 + Y2346,\"\",\"La suma no puede ser mayor al total\")","v":""}]
[2002003,"Mastectomía radical o tumorectomía c/vaciamiento ganglionar o mastectomía total c/vaciamiento ganglionar","MAI",{"$f":"SUM(J2347:O2347)","v":0},{"$nulls":4},0,{"$nulls":6},{"$f":"SUM(Q2347:R2347)","v":0},null,null,{"$f":"SUM(T2347:U2347)","v":0},null,null,{"$f":"SUM(W2347:X2347)","v":0},null,null,{"$f":"SUM(Z2347:AA2347)","v":0},{"$nulls":12},"Cmay",{"v":354700,"d":"354,700"},{"$f":"AM2347*I2347","v":0},""]
[2002005,"Tumor benigno y/o quiste y/o mama supernumeraria y/o aberrante o politelia, o biopsia quirúrgica extemporánea, trat. quir. (proc. aut)","MAI",{"$f":"SUM(J2348:O2348)","v":0},{"$nulls":4},0,{"$nulls":6},{"$f":"SUM(Q2348:R2348)","v":0},null,null,{"$f":"SUM(T2348:U2348)","v":0},null,null,{"$f":"SUM(W2348:X2348)","v":0},null,null,{"$f":"SUM(Z2348:AA2348)","v":0},{"$nulls":12},"Cmay",{"v":137580,"d":"137,580"},{"$f":"AM2348*I2348","v":0},""]
[null,"TOTAL",null,{"$f":"SUM(D2345:D2348)","v":0},{"$nulls":4},{"$f":"SUM(I2345:I2348)","v":0},0,0,0,0,0,0,0,0,0,0,0,0,0,0,0,0,0,0,0,0,0,0,0,0,0,0,0,0,0,{"v":722420,"d":"722,420"},0]
[null,"CIRUGIA GINECOLOGICA                                  "]
[2003031,"Videolaparoscopía ginecológica exploradora (incluye toma de muestras para biopsias, punción de quistes y liberación de adherencias) (proc. aut.)","MAI",{"$f":"SUM(J2351:O2351)","v":0},{"$nulls":4},{"$f":"+J2351+K2351","v":0},{"$nulls":6},{"$f":"SUM(Q2351:R2351)","v":0},null,null,{"$f":"SUM(T2351:U2351)","v":0},null,null,{"$f":"SUM(W2351:X2351)","v":0},null,null,{"$f":"SUM(Z2351:AA2351)","v":0},{"$nulls":12},"Cmay",{"v":146140,"d":"146,140"},{"$f":"AM2351*I2351","v":0},{"$f":"IF(D2351>=P2351 + S2351+ V2351 + Y2351,\"\",\"La suma no puede ser mayor al total\")","v":""}]
[2003001,"Ooforectomía parcial o total, uni o bilateral (proc. aut.)","MAI",{"$f":"SUM(J2352:O2352)","v":0},{"$nulls":4},0,{"$nulls":6},{"$f":"SUM(Q2352:R2352)","v":0},null,null,{"$f":"SUM(T2352:U2352)","v":0},null,null,{"$f":"SUM(W2352:X2352)","v":0},null,null,{"$f":"SUM(Z2352:AA2352)","v":0},{"$nulls":12},"Cmay",{"v":165690,"d":"165,690"},{"$f":"AM2352*I2352","v":0},""]
[2003002,"Anexectomía y/o vac. de absceso tubo-ovárico, uni o bilateral.","MAI",{"$f":"SUM(J2353:O2353)","v":0},{"$nulls":4},0,{"$nulls":6},{"$f":"SUM(Q2353:R2353)","v":0},null,null,{"$f":"SUM(T2353:U2353)","v":0},null,null,{"$f":"SUM(W2353:X2353)","v":0},null,null,{"$f":"SUM(Z2353:AA2353)","v":0},{"$nulls":12},"Cmay",{"v":198850,"d":"198,850"},0,""]
[2003003,"Embarazo tubario, trat. quir.","MAI",0,{"$nulls":4},0,{"$nulls":6},0,null,null,{"$f":"SUM(T2354:U2354)","v":0},null,null,{"$f":"SUM(W2354:X2354)","v":0},null,null,{"$f":"SUM(Z2354:AA2354)","v":0},{"$nulls":12},"Cmay",{"v":201910,"d":"201,910"},0,""]
[2003004,"Ligadura o sección uni o bilateral de las trompas (Madlener, Pomeroy, o similares) (proc. aut.)","MAI",0,{"$nulls":4},0,{"$nulls":6},0,null,null,{"$f":"SUM(T2355:U2355)","v":0},null,null,{"$f":"SUM(W2355:X2355)","v":0},null,null,{"$f":"SUM(Z2355:AA2355)","v":0},{"$nulls":12},"Cmay",{"v":159020,"d":"159,020"},0,""]
[2003005,"Salpingectomía uni o bilateral","MAI",0,{"$nulls":4},0,{"$nulls":6},0,null,null,0,null,null,{"$f":"SUM(W2356:X2356)","v":0},null,null,0,{"$nulls":12},"Cmay",{"v":159020,"d":"159,020"},0,""]
[2003006,"Esterilidad tubaria, operación plástica, uni o bilateral- Con microcirugía","MAI",0,{"$nulls":4},0,{"$nulls":6},0,null,null,0,null,null,0,null,null,0,{"$nulls":12},"Cmay",{"v":342100,"d":"342,100"},0,""]
[2003007,"Esterilidad tubaria, operación plástica, uni o bilateral- Sin microcirugía","MAI",0,{"$nulls":4},0,{"$nulls":6},0,null,null,0,null,null,0,null,null,0,{"$nulls":12},"Cmay",{"v":232280,"d":"232,280"},0,""]
[2003008,"Miomectomía","MAI",0,{"$nulls":4},0,{"$nulls":6},0,null,null,0,null,null,0,null,null,0,{"$nulls":12},"Cmay",{"v":196910,"d":"196,910"},0,""]
[2003041,"Extracción de DIU incrustado, por vía abdominal","MAI",0,{"$nulls":4},0,{"$nulls":6},0,null,null,0,null,null,0,null,null,0,{"$nulls":12},"Cmay",{"v":196910,"d":"196,910"},0,""]
[2003009,"Histerectomía por vía abdominal, c/s anexectomía uni o bilat.- Sub-total","MAI",0,{"$nulls":4},0,{"$nulls":6},0,null,null,0,null,null,0,null,null,0,{"$nulls":12},"Cmay",{"v":233820,"d":"233,820"},0,""]
[2003010,"Histerectomía por vía abdominal, c/s anexectomía uni o bilat.- Total o ampliada","MAI",0,{"$nulls":4},0,{"$nulls":6},0,null,null,0,null,null,0,null,null,0,{"$nulls":12},"Cmay",{"v":419360,"d":"419,360"},0,""]
[2003011,"Ligamento ancho: abscesos y/o hematomas y/o flegmones y/o quistomas y/o várices u otros, trat. quir. (proc. aut.)","MAI",0,{"$nulls":4},0,{"$nulls":6},0,null,null,0,null,null,0,null,null,0,{"$nulls":12},"Cmay",{"v":227100,"d":"227,100"},0,""]
[2003012,"Conización y/o amputación del cuello, diagnostica y/o terapéutica  c/s biopsia","MAI",0,{"$nulls":4},0,{"$nulls":6},0,null,null,0,null,null,0,null,null,0,{"$nulls":12},"Cmay",{"v":137580,"d":"137,580"},0,""]
[2003013,"Exanteración pelviana anterior y/o posterior","MAI",0,{"$nulls":4},0,{"$nulls":6},0,null,null,0,null,null,0,null,null,0,{"$nulls":12},"Cmay",{"v":736570,"d":"736,570"},0,""]
[2003014,"Histerectomía por vía vaginal","MAI",0,{"$nulls":4},0,{"$nulls":6},0,null,null,0,null,null,0,null,null,0,{"$nulls":12},"Cmay",{"v":351780,"d":"351,780"},0,""]
[2003015,"Histerectomía radical con disección pelviana completa de territorios ganglionares, incluye ganglios lumboaórticos (operación de Wertheim o similares)","MAI",0,{"$nulls":4},0,{"$nulls":6},0,null,null,0,null,null,0,null,null,0,{"$nulls":12},"Cmay",{"v":572520,"d":"572,520"},0,""]
[2003016,"Histerectomía total c/intervención incontinencia urinaria, cualquier técnica","MAI",0,{"$nulls":4},0,{"$nulls":6},0,null,null,0,null,null,0,null,null,0,{"$nulls":12},"Cmay",{"v":450520,"d":"450,520"},0,""]
[2003017,"Histeropexia","MAI",0,{"$nulls":4},0,{"$nulls":6},0,null,null,0,null,null,0,null,null,0,{"$nulls":12},"Cmay",{"v":182430,"d":"182,430"},0,""]
[2003018,"Plastía uterina (operación de Strassmar o similares)","MAI",0,{"$nulls":4},0,{"$nulls":6},0,null,null,0,null,null,0,null,null,0,{"$nulls":12},"Cmay",{"v":221900,"d":"221,900"},0,""]
[2003019,"Polipectomía (uno o más) (proc. aut.)","MAI",0,{"$nulls":4},0,{"$nulls":28},"CMen",{"v":42880,"d":"42,880"},0]
[2003020,"Sinequia y/o estenosis cervical, trat. quir.","MAI",0,{"$nulls":4},0,{"$nulls":6},0,null,null,0,null,null,0,null,null,0,{"$nulls":12},"Cmay",{"v":73370,"d":"73,370"},0,{"$f":"IF(D2372>=P2372 + S2372+ V2372 + Y2372,\"\",\"La suma no puede ser mayor al total\")","v":""}]
[2003030,"Desgarro cervical trat. quir.","MAI",0,{"$nulls":4},0,{"$nulls":6},0,null,null,0,null,null,0,null,null,0,{"$nulls":12},"Cmay",{"v":137580,"d":"137,580"},0,""]
[2003040,"Incompetencia cervical trat. quir.","MAI",0,{"$nulls":4},0,{"$nulls":6},0,null,null,0,null,null,0,null,null,0,{"$nulls":12},"Cmay",{"v":118890,"d":"118,890"},0,""]
[2003021,"Colpoceliotomía","MAI",0,{"$nulls":4},0,{"$nulls":6},0,null,null,0,null,null,0,null,null,0,{"$nulls":12},"Cmay",{"v":73370,"d":"73,370"},0,""]
[2003022,"Incontinencia urinaria de esfuerzo, trat. quir. por vía vaginal (proc. aut.)","MAI",0,{"$nulls":4},0,{"$nulls":6},0,null,null,0,null,null,0,null,null,0,{"$nulls":12},"Cmay",{"v":170730,"d":"170,730"},0,""]
[2003023,"Prolapso anterior y/o posterior con repar., incontinencia urinaria por vía extravaginal o combinada","MAI",0,{"$nulls":4},0,{"$nulls":6},0,null,null,0,null,null,0,null,null,0,{"$nulls":12},"Cmay",{"v":279040,"d":"279,040"},0,""]
[2003024,"Prolapso anterior y/o posterior c/s trat. de incontinencia urinaria por vía vaginal, trat. quir.","MAI",0,{"$nulls":4},0,{"$nulls":6},0,null,null,0,null,null,0,null,null,0,{"$nulls":12},"Cmay",{"v":183230,"d":"183,230"},0,""]
[2003025,"Quiste y/o desgarro y/o tabique vaginal, trat. quir.","MAI",0,{"$nulls":4},0,{"$nulls":6},0,null,null,0,null,null,0,null,null,0,{"$nulls":12},"Cmay",{"v":73370,"d":"73,370"},0,""]
[2003026,"Bartolinitis, vaciamiento y drenaje (proc. aut.)","MAI",0,{"$nulls":4},0,{"$nulls":28},"CMen",{"v":35110,"d":"35,110"},0]
[2003027,"Bartolinocistoneostomía o extirp. de la glándula","MAI",0,{"$nulls":4},0,{"$nulls":6},0,null,null,0,null,null,0,null,null,0,{"$nulls":12},"Cmay",{"v":137580,"d":"137,580"},0,{"$f":"IF(D2381>=P2381 + S2381+ V2381 + Y2381,\"\",\"La suma no puede ser mayor al total\")","v":""}]
[2003028,"Vulvectomía- Radical","MAI",0,{"$nulls":4},0,{"$nulls":6},0,null,null,0,null,null,0,null,null,0,{"$nulls":12},"Cmay",{"v":419400,"d":"419,400"},0,""]
[2003029,"Vulvectomía- Simple","MAI",0,{"$nulls":4},0,{"$nulls":6},0,null,null,0,null,null,0,null,null,0,{"$nulls":12},"Cmay",{"v":238270,"d":"238,270"},0,""]
[null,"TOTAL",null,{"$f":"SUM(D2351:D2383)","v":0},{"$nulls":4},{"$f":"SUM(I2351:I2383)","v":0},{"$f":"SUM(J2351:J2383)","v":0},0,0,0,0,0,0,0,0,0,0,0,{"$f":"SUM(V2351:V2383)","v":0},0,0,0,0,0,0,0,0,0,0,0,0,0,0,0,0,{"v":7515230,"d":"7,515,230"},0]
[null,"CIRUGIA  OBSTETRICA Y PARTOS                         "]
[2004001,"Aborto retenido, vaciamiento de (incluye la inducción en los casos que corresponda)","MAI",{"$f":"SUM(E2386+H2386)","v":0},{"$f":"SUM(F2386:G2386)","v":0},{"$nulls":32},"Proc",{"v":111780,"d":"111,780"},{"$f":"AM2386*F2386","v":0}]
[2004002,"Raspado uterino diagnóstico o terapéutico por metrorragia o por restos de aborto","MAI",{"$f":"SUM(E2387+H2387)","v":0},{"$f":"SUM(F2387:G2387)","v":0},{"$nulls":32},"Proc",{"v":107330,"d":"107,330"},{"$f":"AM2387*F2387","v":0}]
[2004006,"Cesárea c/s salpingoligadura o salpingectomía","MAI",{"$f":"SUM(J2388:O2388)","v":0},{"$nulls":4},{"$f":"+J2388+K2388","v":0},{"$nulls":6},{"$f":"SUM(Q2388:R2388)","v":0},null,null,{"$f":"SUM(T2388:U2388)","v":0},null,null,{"$f":"SUM(W2388:X2388)","v":0},null,null,{"$f":"SUM(Z2388:AA2388)","v":0},{"$nulls":12},"Cmay",{"v":142010,"d":"142,010"},{"$f":"AM2388*I2388","v":0},{"$f":"IF(D2388>=P2388 + S2388+ V2388 + Y2388,\"\",\"La suma no puede ser mayor al total\")","v":""}]
[2004005,"Cesárea con histerectomía","MAI",{"$f":"SUM(J2389:O2389)","v":0},{"$nulls":4},0,{"$nulls":6},{"$f":"SUM(Q2389:R2389)","v":0},null,null,{"$f":"SUM(T2389:U2389)","v":0},null,null,{"$f":"SUM(W2389:X2389)","v":0},null,null,{"$f":"SUM(Z2389:AA2389)","v":0},{"$nulls":12},"Cmay",{"v":279040,"d":"279,040"},{"$f":"AM2389*I2389","v":0},""]
[2004103,"Parto normal","MAI",{"$f":"SUM(E2390+H2390)","v":0},{"$f":"SUM(F2390:G2390)","v":0},{"$nulls":32},"Cmay",{"v":142000,"d":"142,000"},{"$f":"AM2390*F2390","v":0},""]
[2004113,"Parto distósico vaginal","MAI",{"$f":"SUM(E2391+H2391)","v":0},{"$f":"SUM(F2391:G2391)","v":0},{"$nulls":32},"Cmay",{"v":149400,"d":"149,400"},{"$f":"AM2391*F2391","v":0},""]
[null,"TOTAL",null,{"$f":"SUM(D2386:D2391)","v":0},{"$f":"SUM(E2386:E2391)","v":0},{"$f":"SUM(F2386:F2391)","v":0},0,0,{"$f":"SUM(I2388:I2389)","v":0},{"$f":"SUM(J2388:J2389)","v":0},0,0,0,0,0,{"$f":"SUM(P2388:P2389)","v":0},{"$f":"SUM(Q2388:Q2389)","v":0},0,{"$f":"SUM(S2388:S2389)","v":0},{"$f":"SUM(T2388:T2389)","v":0},0,{"$f":"SUM(V2388:V2389)","v":0},{"$f":"SUM(W2388:W2389)","v":0},0,{"$f":"SUM(Y2388:Y2389)","v":0},{"$f":"SUM(Z2388:Z2389)","v":0},0,0,0,0,0,0,0,0,0,0,0,0,{"v":931560,"d":"931,560"},0]
["GRUPO 21 :  PROCEDIMIENTOS DE TRAUMATOLOGÍA  "]
[2101001,"Infiltracion local medicamentos (bursas, tendones, yuxtaarticulares y/o intraarticulares","MLE",{"$f":"SUM(E2394+H2394)","v":0},{"$f":"SUM(F2394:G2394)","v":0},{"$nulls":32},"Proc"]
[2101002,"Procedimiento para exploraciones radiologicas (incluye maniobra e inyeccion del medio de contraste)  BM18A  Revisar en BM Colocación valva","MLE",0,0,{"$nulls":32},"Proc"]
[2101003,"Movilizacion articular bajo anestesia general.","MLE",0,0,{"$nulls":32},"Proc"]
[2105001,"Calzon corto de yeso","MLE",0,0,{"$nulls":32},"Proc"]
[2105002,"Corbata tipo schantz","MLE",0,0,{"$nulls":32},"Proc"]
[2105003,"Minerva de yeso","MLE",0,0,{"$nulls":32},"Proc"]
[2105004,"Rodillera, bota larga o corta de yeso","MLE",0,0,{"$nulls":32},"Proc"]
[2105005,"Velpeau","MLE",0,0,{"$nulls":32},"Proc"]
[2105006,"Yeso antebraquial c/s ferula digital","MLE",0,0,{"$nulls":32},"Proc"]
[2105007,"Yeso braquicarpiano","MLE",0,0,{"$nulls":32},"Proc"]
[2105008,"Yeso pelvipedio bilateral","MLE",0,0,{"$nulls":32},"Proc"]
[2105009,"Yeso pelvipedio unilateral","MLE",0,0,{"$nulls":32},"Proc"]
[2105010,"Yeso toracobraquial","MLE",0,0,{"$nulls":32},"Proc"]
[2105011,"Corsets de milwaukee o similares (incluye la toma de molde )","MLE",0,0,{"$nulls":32},"Proc"]
[2105012,"Corsets de risser o similares","MLE",0,0,{"$nulls":32},"Proc"]
[2105013,"Corsets de yeso simple (tipo watson jones)","MLE",0,0,{"$nulls":32},"Proc"]
[5099114,"Infiltración intraarticular",null,{"$f":"SUM(E2410+H2410)","v":0},{"$f":"SUM(F2410:G2410)","v":0},{"$nulls":32},"Proc"]
[null,"TOTAL",null,{"$f":"SUM(D2394:D2410)","v":0},0,0,0,0,{"$nulls":19},0,0,0,0,0,0,0,0,0,0,0]
[null,"CIRUGÍA TRAUMATOLÓGICA            "]
[2104001,"Artroscopía diagnóstica c/s biopsia, c/s sección de bridas, extracción de cuerpo extraño","MAI",{"$f":"SUM(J2413:O2413)","v":0},{"$nulls":4},{"$f":"+J2413+K2413","v":0},{"$nulls":28},"CMen",{"v":144020,"d":"144,020"},{"$f":"AM2413*I2413","v":0}]
[2104002,"Exostosis u osteocondroma, trat. quir.","MAI",{"$f":"SUM(J2414:O2414)","v":0},{"$nulls":4},0,{"$nulls":28},"CMen",{"v":143160,"d":"143,160"},{"$f":"AM2414*I2414","v":0}]
[2104003,"Quistes sinoviales de vainas flexoras, bursas","MAI",{"$f":"SUM(J2415:O2415)","v":0},{"$nulls":4},0,{"$nulls":28},"CMen",{"v":117310,"d":"117,310"},0]
[2104004,"Tracción halocraneana o estribo-craneana (proc. aut.)","MAI",0,{"$nulls":4},0,{"$nulls":28},"CMen",{"v":37180,"d":"37,180"},0]
[2104005,"Tracción halocráneo-femoral","MAI",0,{"$nulls":4},0,{"$nulls":28},"CMen",{"v":117310,"d":"117,310"},0]
[2104006,"Tracción transesquelética o de partes blandas en adultos o en niños (proc. aut.)","MAI",0,{"$nulls":4},0,{"$nulls":28},"CMen",{"v":24820,"d":"24,820"},0]
[2104007,"Artrodesis codo o muñeca, c/u","MAI",0,{"$nulls":4},0,{"$nulls":28},"CMen",{"v":151570,"d":"151,570"},0]
[2104008,"Artrodesis hombro, cadera, rodilla, tobillo o sacroilíaca, c/u","MAI",0,{"$nulls":4},0,{"$nulls":6},{"$f":"SUM(Q2420:R2420)","v":0},null,null,{"$f":"SUM(T2420:U2420)","v":0},null,null,{"$f":"SUM(W2420:X2420)","v":0},null,null,{"$f":"SUM(Z2420:AA2420)","v":0},{"$nulls":12},"Cmay",{"v":215340,"d":"215,340"},0,{"$f":"IF(D2420>=P2420 + S2420+ V2420 + Y2420,\"\",\"La suma no puede ser mayor al total\")","v":""}]
[2104009,"Artrodesis mano o pie c/u","MAI",0,{"$nulls":4},0,{"$nulls":28},"CMen",{"v":151570,"d":"151,570"},0]
[2104010,"Artrodesis brazo, antebrazo,  muslo y pierna, c/u","MAI",0,{"$nulls":4},0,{"$nulls":6},0,null,null,{"$f":"SUM(T2422:U2422)","v":0},null,null,0,null,null,{"$f":"SUM(Z2422:AA2422)","v":0},{"$nulls":12},"Cmay",{"v":236030,"d":"236,030"},0,{"$f":"IF(D2422>=P2422 + S2422+ V2422 + Y2422,\"\",\"La suma no puede ser mayor al total\")","v":""}]
[2104011,"Artrodesis de mano o pie, c/u","MAI",0,{"$nulls":4},0,{"$nulls":6},0,null,null,0,null,null,0,null,null,0,{"$nulls":12},"Cmay",{"v":161090,"d":"161,090"},0,""]
[2104012,"Osteítis, raspado, c/s secuestrectomía","MAI",0,{"$nulls":4},0,{"$nulls":6},0,null,null,0,null,null,0,null,null,0,{"$nulls":12},"Cmay",{"v":161060,"d":"161,060"},0,""]
[2104013,"Osteomielitis aguda hematógena, drenaje quirúrgico, c/s dispositivos de osteoclisis","MAI",0,{"$nulls":4},0,{"$nulls":6},0,null,null,0,null,null,0,null,null,0,{"$nulls":12},"Cmay",{"v":172950,"d":"172,950"},0,""]
[2104014,"Osteomielitis crónica huesos largos, legrado óseo,  c/s osteosíntesis o aparato de yeso","MAI",0,{"$nulls":4},0,{"$nulls":6},0,null,null,0,null,null,0,null,null,0,{"$nulls":12},"Cmay",{"v":172950,"d":"172,950"},0,""]
[2104015,"Artrotomía hombro o cadera c/u","MAI",0,{"$nulls":4},0,{"$nulls":6},0,null,null,0,null,null,0,null,null,0,{"$nulls":12},"Cmay",{"v":172950,"d":"172,950"},0,""]
[2104016,"Artrotomía otras articulaciones, c/u","MAI",0,{"$nulls":4},0,{"$nulls":6},0,null,null,0,null,null,0,null,null,0,{"$nulls":12},"Cmay",{"v":161060,"d":"161,060"},0,""]
[2104017,"Pseudoartrosis  infectada huesos largos, trat. quir. cualquier técnica, c/s dispositivo de osteoclisis, c/s osteosíntesis o aparato de yeso","MAI",0,{"$nulls":4},0,{"$nulls":6},0,null,null,0,null,null,0,null,null,0,{"$nulls":12},"Cmay",{"v":227170,"d":"227,170"},0,""]
[2104018,"Autotrasplante óseo microquirúrgico","MAI",0,{"$nulls":4},0,{"$nulls":6},0,null,null,0,null,null,0,null,null,0,{"$nulls":12},"Cmay",{"v":576690,"d":"576,690"},0,""]
[2104019,"Injerto esponjoso metafisiario","MAI",0,{"$nulls":4},0,{"$nulls":28},"CMen",{"v":151570,"d":"151,570"},0]
[2104020,"Injertos esponjosos o córtico-esponjosos de cresta ilíaca","MAI",0,{"$nulls":4},0,{"$nulls":28},"CMen",{"v":151570,"d":"151,570"},0]
[2104021,"Trasplante óseo (auto u homotrasplante)","MAI",0,{"$nulls":4},0,{"$nulls":6},0,null,null,0,null,null,0,null,null,0,{"$nulls":12},"Cmay",{"v":341630,"d":"341,630"},0,{"$f":"IF(D2433>=P2433 + S2433+ V2433 + Y2433,\"\",\"La suma no puede ser mayor al total\")","v":""}]
[2104022,"Lesiones quísticas con fractura patológica: legrado óseo, c/s relleno injerto esponjoso, c/s osteosíntesis y/o aparato de inmovilización postoperatoria","MAI",0,{"$nulls":4},0,{"$nulls":6},0,null,null,0,null,null,0,null,null,0,{"$nulls":12},"Cmay",{"v":243750,"d":"243,750"},0,""]
[2104023,"Lesiones quísticas: legrado óseo, c/s relleno de injertos esponjosos","MAI",0,{"$nulls":4},0,{"$nulls":6},0,null,null,0,null,null,0,null,null,0,{"$nulls":12},"Cmay",{"v":189440,"d":"189,440"},0,""]
[2104024,"Metástasis ósea c/s fractura patológica, legrado tumoral, relleno cemento quirúrgico y osteosíntesis","MAI",0,{"$nulls":4},0,{"$nulls":6},0,null,null,0,null,null,0,null,null,0,{"$nulls":12},"Cmay",{"v":243750,"d":"243,750"},0,""]
[2104025,"Tumor óseo, resección en bloque, c/s osteosíntesis y/o aparato inmovilización postoperatorio","MAI",0,{"$nulls":4},0,{"$nulls":6},0,null,null,0,null,null,0,null,null,0,{"$nulls":12},"Cmay",{"v":243750,"d":"243,750"},0,""]
[2104026,"Tumores o quistes o lesiones pseudoquísticas o musculares y/o tendíneas, trat. quir.-TMP","MAI",0,{"$nulls":4},0,{"$nulls":6},0,null,null,0,null,null,0,null,null,0,{"$nulls":12},"Cmay",{"v":195710,"d":"195,710"},0,""]
[2104027,"Tumores óseos: resección en bloque, epifisiaria c/artrodesis o diafisiaria-TMP","MAI",0,{"$nulls":4},0,{"$nulls":6},0,null,null,0,null,null,0,null,null,0,{"$nulls":12},"Cmay",{"v":264520,"d":"264,520"},0,""]
[2104028,"Tumores primarios o metastásicos vertebrales: corporectomía, reemplazo por cemento quir. o injerto óseo, c/s osteosíntesis-TMP","MAI",0,{"$nulls":4},0,{"$nulls":6},0,null,null,0,null,null,0,null,null,0,{"$nulls":12},"Cmay",{"v":636060,"d":"636,060"},0,""]
[2104029,"Codo o muñeca o metacarpofalángicas, c/u","MAI",0,{"$nulls":4},0,{"$nulls":6},0,null,null,0,null,null,0,null,null,0,{"$nulls":12},"Cmay",{"v":135180,"d":"135,180"},0,""]
[2104030,"Rodilla o cadera u hombro, c/u-TMP","MAI",0,{"$nulls":4},0,{"$nulls":6},0,null,null,0,null,null,0,null,null,0,{"$nulls":12},"Cmay",{"v":172940,"d":"172,940"},0,""]
[2104031,"Epineurorrafia microquirúrgica con magnificación cualquier tronco nervioso (con excepción nervios digitales)","MAI",0,{"$nulls":4},0,{"$nulls":6},0,null,null,0,null,null,0,null,null,0,{"$nulls":12},"Cmay",{"v":298760,"d":"298,760"},0,""]
[2104033,"Biopsia ósea por punción","MAI",0,{"$nulls":4},0,{"$nulls":28},"CMen",{"v":31860,"d":"31,860"},0]
[2104034,"Biopsia ósea quirúrgica","MAI",0,{"$nulls":4},0,{"$nulls":6},0,null,null,0,null,null,0,null,null,0,{"$nulls":12},"Cmay",{"v":135180,"d":"135,180"},0,{"$f":"IF(D2445>=P2445 + S2445+ V2445 + Y2445,\"\",\"La suma no puede ser mayor al total\")","v":""}]
[2104035,"Biopsia sinovial o muscular por punción","MAI",0,{"$nulls":4},0,{"$nulls":28},"CMen",{"v":30150,"d":"30,150"},0]
[2104036,"Biopsia sinovial o muscular quirúrgica","MAI",0,{"$nulls":4},0,{"$nulls":28},"CMen",{"v":45680,"d":"45,680"},0]
[2104037,"Biopsia vertebral por punción","MAI",0,{"$nulls":4},0,{"$nulls":28},"CMen",{"v":61650,"d":"61,650"},0]
[2104038,"Muñón de amputación, regularización de","MAI",0,{"$nulls":4},0,{"$nulls":28},"CMen",{"v":151570,"d":"151,570"},0]
[2104039,"Osteocondrosis o epifisitis, trat. quir.","MAI",0,{"$nulls":4},0,{"$nulls":6},0,null,null,0,null,null,0,null,null,0,{"$nulls":12},"Cmay",{"v":161060,"d":"161,060"},0,{"$f":"IF(D2450>=P2450 + S2450+ V2450 + Y2450,\"\",\"La suma no puede ser mayor al total\")","v":""}]
[2104040,"Amputación interescápulo-torácica","MAI",0,{"$nulls":4},0,{"$nulls":6},0,null,null,0,null,null,0,null,null,0,{"$nulls":12},"Cmay",{"v":458000,"d":"458,000"},0,""]
[2104041,"Desarticulación escápulo-humeral","MAI",0,{"$nulls":4},0,{"$nulls":6},0,null,null,0,null,null,0,null,null,0,{"$nulls":12},"Cmay",{"v":319190,"d":"319,190"},0,""]
[2104042,"Endoprótesis total, cualquier técnica","MAI",0,{"$nulls":4},0,{"$nulls":6},0,null,null,0,null,null,0,null,null,0,{"$nulls":12},"Cmay",{"v":328100,"d":"328,100"},0,""]
[2104043,"Fijación de escápula","MAI",0,{"$nulls":4},0,{"$nulls":6},0,null,null,0,null,null,0,null,null,0,{"$nulls":12},"Cmay",{"v":243750,"d":"243,750"},0,""]
[2104044,"Fractura cuello humeral, trat. quir.","MAI",0,{"$nulls":4},0,{"$nulls":6},0,null,null,0,null,null,0,null,null,0,{"$nulls":12},"Cmay",{"v":243750,"d":"243,750"},0,""]
[2104045,"Fractura de clavícula, osteosíntesis","MAI",0,{"$nulls":4},0,{"$nulls":6},0,null,null,0,null,null,0,null,null,0,{"$nulls":12},"Cmay",{"v":135230,"d":"135,230"},0,""]
[2104046,"Fractura escápula, osteosíntesis","MAI",0,{"$nulls":4},0,{"$nulls":6},0,null,null,0,null,null,0,null,null,0,{"$nulls":12},"Cmay",{"v":172940,"d":"172,940"},0,""]
[2104047,"Luxación acromio-clavicular o esterno-clavicular, reducción o plastía cápsuloligamentosa y osteosíntesis","MAI",0,{"$nulls":4},0,{"$nulls":6},0,null,null,0,null,null,0,null,null,0,{"$nulls":12},"Cmay",{"v":189440,"d":"189,440"},0,""]
[2104048,"Luxación recidivante, trat. quir.","MAI",0,{"$nulls":4},0,{"$nulls":6},0,null,null,0,null,null,0,null,null,0,{"$nulls":12},"Cmay",{"v":227170,"d":"227,170"},0,""]
[2104049,"Luxación traumática, reducción cruenta","MAI",0,{"$nulls":4},0,{"$nulls":6},0,null,null,0,null,null,0,null,null,0,{"$nulls":12},"Cmay",{"v":161060,"d":"161,060"},0,""]
[2104050,"Luxofractura, reducción y osteosíntesis","MAI",0,{"$nulls":4},0,{"$nulls":6},0,null,null,0,null,null,0,null,null,0,{"$nulls":12},"Cmay",{"v":243750,"d":"243,750"},0,""]
[2104051,"Ruptura manguito rotadores, trat. quir. c/s acromiectomía","MAI",0,{"$nulls":4},0,{"$nulls":6},0,null,null,0,null,null,0,null,null,0,{"$nulls":12},"Cmay",{"v":243750,"d":"243,750"},0,""]
[2104052,"Transposiciones musculares","MAI",0,{"$nulls":4},0,{"$nulls":6},0,null,null,0,null,null,0,null,null,0,{"$nulls":12},"Cmay",{"v":172940,"d":"172,940"},0,""]
[2104053,"Amputación brazo","MAI",0,{"$nulls":4},0,{"$nulls":6},0,null,null,0,null,null,0,null,null,0,{"$nulls":12},"Cmay",{"v":195710,"d":"195,710"},0,""]
[2104054,"Fractura supracondílea niño; tracción esquelética, c/s osteosíntesis y aparato de yeso","MAI",0,{"$nulls":4},0,{"$nulls":6},0,null,null,0,null,null,0,null,null,0,{"$nulls":12},"Cmay",{"v":179120,"d":"179,120"},0,""]
[2104055,"Osteosíntesis diafisiaria (cualquier técnica)","MAI",0,{"$nulls":4},0,{"$nulls":6},0,null,null,0,null,null,0,null,null,0,{"$nulls":12},"Cmay",{"v":172940,"d":"172,940"},0,""]
[2104056,"Osteosíntesis supra o intercondílea (cualquier técnica)","MAI",0,{"$nulls":4},0,{"$nulls":6},0,null,null,0,null,null,0,null,null,0,{"$nulls":12},"Cmay",{"v":179120,"d":"179,120"},0,""]
[2104057,"Osteotomía (cualquier técnica)","MAI",0,{"$nulls":4},0,{"$nulls":6},0,null,null,0,null,null,0,null,null,0,{"$nulls":12},"Cmay",{"v":172940,"d":"172,940"},0,""]
[2104058,"Pseudoartrosis c/s osteosíntesis c/s yeso","MAI",0,{"$nulls":4},0,{"$nulls":6},0,null,null,0,null,null,0,null,null,0,{"$nulls":12},"Cmay",{"v":172940,"d":"172,940"},0,""]
[2104059,"Artroplastía con fascia","MAI",0,{"$nulls":4},0,{"$nulls":6},0,null,null,0,null,null,0,null,null,0,{"$nulls":12},"Cmay",{"v":195700,"d":"195,700"},0,""]
[2104060,"Cúpula radial, resección","MAI",0,{"$nulls":4},0,{"$nulls":6},0,null,null,0,null,null,0,null,null,0,{"$nulls":12},"Cmay",{"v":172890,"d":"172,890"},0,""]
[2104061,"Cúpula radial, resección con implante de silastic o similar","MAI",0,{"$nulls":4},0,{"$nulls":6},0,null,null,0,null,null,0,null,null,0,{"$nulls":12},"Cmay",{"v":189440,"d":"189,440"},0,""]
[2104062,"Endoprótesis total (cualquier técnica)","MAI",0,{"$nulls":4},0,{"$nulls":6},0,null,null,0,null,null,0,null,null,0,{"$nulls":12},"Cmay",{"v":328100,"d":"328,100"},0,""]
[2104063,"Epicondilitis, trat. quir. (cualquier técnica)","MAI",0,{"$nulls":4},0,{"$nulls":6},0,null,null,0,null,null,0,null,null,0,{"$nulls":12},"Cmay",{"v":179110,"d":"179,110"},0,""]
[2104064,"Luxación, reducción cruenta","MAI",0,{"$nulls":4},0,{"$nulls":6},0,null,null,0,null,null,0,null,null,0,{"$nulls":12},"Cmay",{"v":161090,"d":"161,090"},0,""]
[2104065,"Luxofractura, reducción cruenta c/s resección cúpula radial","MAI",0,{"$nulls":4},0,{"$nulls":6},0,null,null,0,null,null,0,null,null,0,{"$nulls":12},"Cmay",{"v":172950,"d":"172,950"},0,""]
[2104066,"Osteosíntesis epitroclea-epicóndilo (cualquier técnica)","MAI",0,{"$nulls":4},{"$f":"+J2477+K2477","v":0},{"$nulls":6},0,null,null,0,null,null,0,null,null,0,{"$nulls":12},"Cmay",{"v":172940,"d":"172,940"},0,""]
[2104067,"Osteosíntesis olécranon u osteosíntesis de cúpula radial (proc. aut.) (cualquier técnica)","MAI",0,{"$nulls":4},0,{"$nulls":6},0,null,null,0,null,null,0,null,null,0,{"$nulls":12},"Cmay",{"v":172940,"d":"172,940"},{"$f":"AM2478*I2478","v":0},""]
[2104068,"Traslocación nervio cubital (proc. aut.)","MAI",{"$f":"SUM(J2479:O2479)","v":0},{"$nulls":4},0,{"$nulls":6},{"$f":"SUM(Q2479:R2479)","v":0},null,null,0,null,null,0,null,null,0,{"$nulls":12},"Cmay",{"v":217100,"d":"217,100"},0,""]
[2104069,"Operación de salvataje radio-procúbito","MAI",0,{"$nulls":4},0,{"$nulls":6},0,null,null,0,null,null,0,null,null,0,{"$nulls":12},"Cmay",{"v":195710,"d":"195,710"},0,""]
[2104070,"Amputación antebrazo","MAI",0,{"$nulls":4},0,{"$nulls":6},0,null,null,0,null,null,0,null,null,0,{"$nulls":12},"Cmay",{"v":195710,"d":"195,710"},0,""]
[2104071,"Extirpación metáfisis distal del cúbito y artrodesis radiocubital inferior","MAI",0,{"$nulls":4},0,{"$nulls":6},0,null,null,0,null,null,{"$f":"SUM(W2482:X2482)","v":0},null,null,0,{"$nulls":12},"Cmay",{"v":172940,"d":"172,940"},0,""]
[2104072,"Luxofracturas (Monteggia-Galeazzi), reducc. y osteosíntesis","MAI",0,{"$nulls":4},0,{"$nulls":6},0,null,null,0,null,null,0,null,null,0,{"$nulls":12},"Cmay",{"v":172940,"d":"172,940"},0,""]
[2104073,"Osteosíntesis, fract. cerrada cubito y/o radio (cualq. técn.)","MAI",0,{"$nulls":4},0,{"$nulls":6},0,null,null,0,null,null,0,null,null,0,{"$nulls":12},"Cmay",{"v":172940,"d":"172,940"},0,""]
[2104074,"Osteotomía uno o ambos huesos, c/s ostesíntesis c/s yeso o trat. quir. Enf. de Kienbock","MAI",0,{"$nulls":4},0,{"$nulls":6},0,null,null,{"$f":"SUM(T2485:U2485)","v":0},null,null,0,null,null,{"$f":"SUM(Z2485:AA2485)","v":0},{"$nulls":12},"Cmay",{"v":172940,"d":"172,940"},0,""]
[2104075,"Pseudoartrosis  cúbito y/o radio c/s osteosíntesis c/s yeso","MAI",0,{"$nulls":4},0,{"$nulls":6},0,null,null,0,null,null,0,null,null,0,{"$nulls":12},"Cmay",{"v":172940,"d":"172,940"},0,""]
[2104076,"Sinostosis radio-cubital, trat. quir., c/s injerto","MAI",0,{"$nulls":4},0,{"$nulls":6},0,null,null,0,null,null,0,null,null,0,{"$nulls":12},"Cmay",{"v":179120,"d":"179,120"},0,""]
[2104077,"Trasplantes músculo-tendinosos","MAI",0,{"$nulls":4},0,{"$nulls":6},0,null,null,0,null,null,0,null,null,0,{"$nulls":12},"Cmay",{"v":227170,"d":"227,170"},0,""]
[2104078,"Contractura isquem. de Volkmann: descenso muscular, neurolisis","MAI",0,{"$nulls":4},0,{"$nulls":6},0,null,null,0,null,null,0,null,null,0,{"$nulls":12},"Cmay",{"v":227170,"d":"227,170"},0,""]
[2104079,"Endoprótesis total (cualquier técnica)","MAI",0,{"$nulls":4},0,{"$nulls":6},0,null,null,0,null,null,0,null,null,0,{"$nulls":12},"Cmay",{"v":328100,"d":"328,100"},0,""]
[2104080,"Estiloides cubital, radial, resección de.","MAI",0,{"$nulls":4},0,{"$nulls":6},0,null,null,0,null,null,0,null,null,0,{"$nulls":12},"Cmay",{"v":161060,"d":"161,060"},0,""]
[2104081,"Fractura o pseudoartrosis escafoides, trat. quir. cualq. técn.","MAI",0,{"$nulls":4},0,{"$nulls":6},0,null,null,0,null,null,0,null,null,0,{"$nulls":12},"Cmay",{"v":161090,"d":"161,090"},0,""]
[2104082,"Implante silastic o similares (escafoides, semilunar)","MAI",0,{"$nulls":4},0,{"$nulls":6},0,null,null,0,null,null,0,null,null,0,{"$nulls":12},"Cmay",{"v":172950,"d":"172,950"},0,""]
[2104083,"Luxación radiocarpiana, trat. quir.","MAI",0,{"$nulls":4},0,{"$nulls":6},0,null,null,0,null,null,0,null,null,0,{"$nulls":12},"Cmay",{"v":161060,"d":"161,060"},0,""]
[2104084,"Luxación semilunar ,escafoidea, reducción y osteosíntesis semicruenta o cruenta","MAI",0,{"$nulls":4},0,{"$nulls":6},0,null,null,0,null,null,0,null,null,0,{"$nulls":12},"Cmay",{"v":161090,"d":"161,090"},0,""]
[2104085,"Osteosíntesis radio, (cualquier técnica)","MAI",0,{"$nulls":4},0,{"$nulls":6},0,null,null,0,null,null,0,null,null,0,{"$nulls":12},"Cmay",{"v":172940,"d":"172,940"},0,""]
[2104086,"Tendovaginosis de De Quervain, trat. quir.","MAI",0,{"$nulls":4},0,{"$nulls":6},0,null,null,0,null,null,0,null,null,0,{"$nulls":12},"Cmay",{"v":172940,"d":"172,940"},0,""]
[2104087,"Amputación dedos (tres o más)","MAI",0,{"$nulls":4},0,{"$nulls":6},0,null,null,0,null,null,0,null,null,0,{"$nulls":12},"Cmay",{"v":174330,"d":"174,330"},0,""]
[2104088,"Amputación dedos (uno o dos)","MAI",0,{"$nulls":4},0,{"$nulls":28},"CMen",{"v":127750,"d":"127,750"},0]
[2104089,"Amputación mano o del pulgar","MAI",0,{"$nulls":4},0,{"$nulls":6},0,null,null,0,null,null,0,null,null,0,{"$nulls":12},"Cmay",{"v":200520,"d":"200,520"},0,{"$f":"IF(D2500>=P2500 + S2500+ V2500 + Y2500,\"\",\"La suma no puede ser mayor al total\")","v":""}]
[2104090,"Amputación pulpejos (plastía Kutler o similares)","MAI",0,{"$nulls":4},0,{"$nulls":28},"CMen",{"v":151570,"d":"151,570"},0]
[2104091,"Contractura Dupuytren, trat. quir., cada tiempo","MAI",0,{"$nulls":4},0,{"$nulls":6},0,null,null,0,null,null,0,null,null,0,{"$nulls":12},"Cmay",{"v":161060,"d":"161,060"},0,{"$f":"IF(D2502>=P2502 + S2502+ V2502 + Y2502,\"\",\"La suma no puede ser mayor al total\")","v":""}]
[2104092,"Contusión-compresión grave, trat. quir. incluye incisiones liberadoras y/o fasciotomía y/o escarectomía y/o injertos piel inmediatos y síntesis percutánea","MAI",0,{"$nulls":4},0,{"$nulls":6},0,null,null,0,null,null,0,null,null,0,{"$nulls":12},"Cmay",{"v":161090,"d":"161,090"},0,""]
[2104093,"Dedos en gatillo, trat. quir., cualquier número","MAI",0,{"$nulls":4},0,{"$nulls":28},"CMen",{"v":151570,"d":"151,570"},0]
[2104094,"Flegmón mano, trat. quir.","MAI",0,{"$nulls":4},0,{"$nulls":28},"CMen",{"v":143160,"d":"143,160"},0]
[2104095,"Luxofractura metacarpofalángica o interfalángica, trat. quir.","MAI",0,{"$nulls":4},0,{"$nulls":28},"CMen",{"v":151570,"d":"151,570"},0]
[2104096,"Mano reumática en ráfaga: traslocaciones tendinosas, plastías capsulares, tenotomías, inmovilización postoperatoria","MAI",0,{"$nulls":4},0,{"$nulls":6},0,null,null,0,null,null,0,null,null,0,{"$nulls":12},"Cmay",{"v":182650,"d":"182,650"},0,{"$f":"IF(D2507>=P2507 + S2507+ V2507 + Y2507,\"\",\"La suma no puede ser mayor al total\")","v":""}]
[2104097,"Mano reumática: implant. silastic, cualq. número (proc. aut.)","MAI",0,{"$nulls":4},0,{"$nulls":6},0,null,null,0,null,null,0,null,null,0,{"$nulls":12},"Cmay",{"v":199270,"d":"199,270"},0,""]
[2104098,"Mutilación grave, aseo. quir. completo c/s osteosíntesis, c/s injertos","MAI",0,{"$nulls":4},0,{"$nulls":6},0,null,null,0,null,null,0,null,null,0,{"$nulls":12},"Cmay",{"v":170470,"d":"170,470"},0,""]
[2104099,"Osteosíntesis metacarpianas o de falanges, cualquier técnica","MAI",0,{"$nulls":4},0,{"$nulls":28},"CMen",{"v":151570,"d":"151,570"},0]
[2104100,"Panadizo, trat. quir.","MAI",0,{"$nulls":4},0,{"$nulls":28},"CMen",{"v":23420,"d":"23,420"},0]
[2104101,"Pulgarización dedo (índice o anular)","MAI",0,{"$nulls":4},0,{"$nulls":6},0,null,null,0,null,null,0,null,null,0,{"$nulls":12},"Cmay",{"v":252640,"d":"252,640"},0,{"$f":"IF(D2512>=P2512 + S2512+ V2512 + Y2512,\"\",\"La suma no puede ser mayor al total\")","v":""}]
[2104102,"Reimplante mano o dedo(s)","MAI",0,{"$nulls":4},0,{"$nulls":6},0,null,null,0,null,null,0,null,null,0,{"$nulls":12},"Cmay",{"v":618300,"d":"618,300"},0,""]
[2104103,"Reparación flexores: primer tiempo espaciador silastic","MAI",0,{"$nulls":4},0,{"$nulls":6},0,null,null,0,null,null,0,null,null,0,{"$nulls":12},"Cmay",{"v":172890,"d":"172,890"},0,""]
[2104104,"Reparación nervio digital con injerto interfascicular: cualquier número","MAI",0,{"$nulls":4},0,{"$nulls":6},0,null,null,0,null,null,0,null,null,0,{"$nulls":12},"Cmay",{"v":275970,"d":"275,970"},0,""]
[2104105,"Rupturas cerradas cápsulo-ligament. o tendinosas, trat. quir.","MAI",0,{"$nulls":4},0,{"$nulls":6},0,null,null,0,null,null,0,null,null,0,{"$nulls":12},"Cmay",{"v":161060,"d":"161,060"},0,""]
[2104106,"Sutura nervio(s) digital(es); microcirugía","MAI",0,{"$nulls":4},0,{"$nulls":6},0,null,null,0,null,null,0,null,null,0,{"$nulls":12},"Cmay",{"v":219060,"d":"219,060"},0,""]
[2104107,"Tenorrafia extensores","MAI",0,{"$nulls":4},0,{"$nulls":6},0,null,null,0,null,null,0,null,null,0,{"$nulls":12},"Cmay",{"v":161060,"d":"161,060"},0,""]
[2104108,"Tenorrafia o injertos flexores","MAI",0,{"$nulls":4},0,{"$nulls":6},0,null,null,0,null,null,0,null,null,0,{"$nulls":12},"Cmay",{"v":161060,"d":"161,060"},0,""]
[2104109,"Tenosinovitis séptica, trat. quir.","MAI",0,{"$nulls":4},0,{"$nulls":28},"CMen",{"v":50370,"d":"50,370"},0]
[2104110,"Trasplante microquirúrgico para pulgar","MAI",0,{"$nulls":4},0,{"$nulls":6},0,null,null,0,null,null,0,null,null,0,{"$nulls":12},"Cmay",{"v":475780,"d":"475,780"},0,{"$f":"IF(D2521>=P2521 + S2521+ V2521 + Y2521,\"\",\"La suma no puede ser mayor al total\")","v":""}]
[2104111,"Transposiciones tendinosas flexoras o extensoras","MAI",0,{"$nulls":4},0,{"$nulls":6},0,null,null,0,null,null,0,null,null,0,{"$nulls":12},"Cmay",{"v":161060,"d":"161,060"},0,""]
[2104112,"Diastematomielia, resección espolón c/s instrumentación","MAI",0,{"$nulls":4},0,{"$nulls":6},0,null,null,0,null,null,0,null,null,0,{"$nulls":12},"Cmay",{"v":488240,"d":"488,240"},0,""]
[2104113,"Escoliosis, trat. quir., cualquier vía de abordaje, e instrumentación de Harrington,  Luque, Dwyer o similares (no inclute material de fijación de columna)","MAI",0,{"$nulls":4},0,{"$nulls":6},0,null,null,0,null,null,0,null,null,0,{"$nulls":12},"Cmay",{"v":694570,"d":"694,570"},0,""]
[2104213,"Escoliosis, trat. quir., cualquier vía de abordaje, con instrumentación (incluye elementos de osteosíntesis)","MAI",0,{"$nulls":4},0,{"$nulls":6},0,null,null,0,null,null,0,null,null,0,{"$nulls":12},"Cmay",{"v":3368050,"d":"3,368,050"},0,""]
[2104114,"Espondilodiscitis vertebral (TBC u otra), trat. quir. del foco, c/s artrodesis","MAI",0,{"$nulls":4},0,{"$nulls":6},0,null,null,0,null,null,0,null,null,0,{"$nulls":12},"Cmay",{"v":299740,"d":"299,740"},0,""]
[2104115,"Fractura apófisis espinosa, trat. quir.","MAI",0,{"$nulls":4},0,{"$nulls":6},0,null,null,0,null,null,0,null,null,0,{"$nulls":12},"Cmay",{"v":189440,"d":"189,440"},0,""]
[2104116,"Luxaciones, luxofracturas vertebrales (cervical, dorsal, lumbar), reducción cruenta, cualquier vía de abordaje, cualquier número","MAI",0,{"$nulls":4},0,{"$nulls":6},0,null,null,0,null,null,0,null,null,0,{"$nulls":12},"Cmay",{"v":375560,"d":"375,560"},0,""]
[2104117,"Osteotomías vertebrales correctoras, c/s instrumentación, c/s injertos óseos, c/s artrodesis","MAI",0,{"$nulls":4},0,{"$nulls":6},0,null,null,0,null,null,0,null,null,0,{"$nulls":12},"Cmay",{"v":569240,"d":"569,240"},0,""]
[2104118,"Plastías costales, cualquier número","MAI",0,{"$nulls":4},0,{"$nulls":6},0,null,null,0,null,null,0,null,null,0,{"$nulls":12},"Cmay",{"v":161060,"d":"161,060"},0,""]
[2104119,"Reemplazo cuerpo vertebral con artrodesis c/s osteosíntesis c/s instrumentación","MAI",0,{"$nulls":4},0,{"$nulls":6},0,null,null,0,null,null,0,null,null,0,{"$nulls":12},"Cmay",{"v":712010,"d":"712,010"},0,""]
[2104120,"Resección arco neural (operación de Gill o similares)","MAI",0,{"$nulls":4},0,{"$nulls":6},0,null,null,0,null,null,0,null,null,0,{"$nulls":12},"Cmay",{"v":275970,"d":"275,970"},0,""]
[2104121,"Resección del coxis","MAI",0,{"$nulls":4},0,{"$nulls":6},0,null,null,0,null,null,0,null,null,0,{"$nulls":12},"Cmay",{"v":161060,"d":"161,060"},0,""]
[2104122,"Diástasis pubiana, trat. quir.","MAI",0,{"$nulls":4},0,{"$nulls":6},0,null,null,0,null,null,0,null,null,0,{"$nulls":12},"Cmay",{"v":254990,"d":"254,990"},0,""]
[2104123,"Fractura, osteosíntesis quir.","MAI",0,{"$nulls":4},0,{"$nulls":6},0,null,null,0,null,null,0,null,null,0,{"$nulls":12},"Cmay",{"v":275970,"d":"275,970"},0,""]
[2104124,"Osteotomía pelviana (Salter, Chiari o similares)","MAI",0,{"$nulls":4},0,{"$nulls":6},0,null,null,0,null,null,0,null,null,0,{"$nulls":12},"Cmay",{"v":281970,"d":"281,970"},0,""]
[2104125,"Triple osteotomía de pelvis","MAI",0,{"$nulls":4},0,{"$nulls":6},0,null,null,0,null,null,0,null,null,0,{"$nulls":12},"Cmay",{"v":299740,"d":"299,740"},0,""]
[2104126,"Amputación inter-ilio abdominal","MAI",0,{"$nulls":4},0,{"$nulls":6},0,null,null,0,null,null,0,null,null,0,{"$nulls":12},"Cmay",{"v":516790,"d":"516,790"},0,""]
[2104127,"Desarticulación cadera","MAI",0,{"$nulls":4},0,{"$nulls":6},0,null,null,0,null,null,0,null,null,0,{"$nulls":12},"Cmay",{"v":418450,"d":"418,450"},0,""]
[2104128,"Endoprótesis parcial c/s cementación (cualquier técnica) (no incluye prótesis)","MAI",0,{"$nulls":4},0,{"$nulls":6},0,null,null,0,null,null,0,null,null,0,{"$nulls":12},"Cmay",{"v":300980,"d":"300,980"},0,""]
[2104228,"Endoprótesis parcial c/s cementación (cualquier técnica) (incluye prótesis)","MAI",0,{"$nulls":4},{"$f":"+J2541+K2541","v":0},{"$nulls":6},0,null,null,0,null,null,0,null,null,0,{"$nulls":12},"Cmay",{"v":700560,"d":"700,560"},0,""]
[2104129,"Endoprótesis total de cadera  (no incluye prótesis)","MAI",0,{"$nulls":4},0,{"$nulls":6},0,null,null,0,null,null,0,null,null,0,{"$nulls":12},"Cmay",{"v":465830,"d":"465,830"},{"$f":"AM2542*I2542","v":0},""]
[2104229,"Endoprótesis total de cadera (incluye prótesis)","MAI",{"$f":"SUM(J2543:O2543)","v":0},{"$nulls":4},0,{"$nulls":6},{"$f":"SUM(Q2543:R2543)","v":0},null,null,0,null,null,0,null,null,0,{"$nulls":12},"Cmay",{"v":1374990,"d":"1,374,990"},0,""]
[2104130,"Epifisiolisis lenta o aguda, trat. quir.","MAI",0,{"$nulls":4},0,{"$nulls":6},0,null,null,0,null,null,0,null,null,0,{"$nulls":12},"Cmay",{"v":267070,"d":"267,070"},0,""]
[2104131,"Fractura de cuello de fémur, osteosíntesis, cualquier técnica (no incluye elementos de osteosíntesis)","MAI",0,{"$nulls":4},0,{"$nulls":6},0,null,null,0,null,null,0,null,null,0,{"$nulls":12},"Cmay",{"v":316200,"d":"316,200"},0,""]
[2104231,"Fractura de cuello de fémur, osteosíntesis, cualquier técnica (incluye elementos de osteosíntesis)","MAI",0,{"$nulls":4},0,{"$nulls":6},0,null,null,0,null,null,{"$f":"SUM(W2546:X2546)","v":0},null,null,0,{"$nulls":12},"Cmay",{"v":506760,"d":"506,760"},0,""]
[2104132,"Fractura de cuello de fémur, resección epífisis femoral","MAI",0,{"$nulls":4},0,{"$nulls":6},0,null,null,0,null,null,0,null,null,0,{"$nulls":12},"Cmay",{"v":267070,"d":"267,070"},0,""]
[2104133,"Luxación traumática, reducción cruenta","MAI",0,{"$nulls":4},0,{"$nulls":6},0,null,null,0,null,null,0,null,null,0,{"$nulls":12},"Cmay",{"v":243750,"d":"243,750"},0,""]
[2104134,"Luxofractura acetabular, trat. quir.","MAI",0,{"$nulls":4},0,{"$nulls":6},0,null,null,{"$f":"SUM(T2549:U2549)","v":0},null,null,0,null,null,{"$f":"SUM(Z2549:AA2549)","v":0},{"$nulls":12},"Cmay",{"v":281970,"d":"281,970"},0,""]
[2104135,"Operación de salvataje cadera, columna o similares","MAI",0,{"$nulls":4},0,{"$nulls":6},0,null,null,0,null,null,0,null,null,0,{"$nulls":12},"Cmay",{"v":411120,"d":"411,120"},0,""]
[2104136,"Osteotomías femorales","MAI",0,{"$nulls":4},0,{"$nulls":6},0,null,null,0,null,null,0,null,null,0,{"$nulls":12},"Cmay",{"v":267070,"d":"267,070"},0,""]
[2104137,"Reducción cruenta en luxación congénita o traumática","MAI",0,{"$nulls":4},0,{"$nulls":6},0,null,null,0,null,null,0,null,null,0,{"$nulls":12},"Cmay",{"v":243750,"d":"243,750"},0,""]
[2104138,"Reducción cruenta y acetabuloplastía femoral c/s osteotomía femoral","MAI",0,{"$nulls":4},0,{"$nulls":6},0,null,null,0,null,null,0,null,null,0,{"$nulls":12},"Cmay",{"v":328490,"d":"328,490"},0,""]
[2104139,"Reducción cruenta y osteotomía femoral","MAI",0,{"$nulls":4},0,{"$nulls":6},0,null,null,0,null,null,0,null,null,0,{"$nulls":12},"Cmay",{"v":267070,"d":"267,070"},0,""]
[2104140,"Tenotomía aductores c/s botas, con yugo (proc. aut.)","MAI",0,{"$nulls":4},0,{"$nulls":6},0,null,null,0,null,null,0,null,null,0,{"$nulls":12},"Cmay",{"v":189440,"d":"189,440"},0,""]
[2104141,"Trocanteroplastías","MAI",0,{"$nulls":4},0,{"$nulls":6},0,null,null,0,null,null,0,null,null,0,{"$nulls":12},"Cmay",{"v":267070,"d":"267,070"},0,""]
[2104142,"Amputación muslo","MAI",0,{"$nulls":4},0,{"$nulls":6},0,null,null,0,null,null,0,null,null,0,{"$nulls":12},"Cmay",{"v":199290,"d":"199,290"},0,""]
[2104143,"Epifisiodesis (fémur y/o tibia)","MAI",0,{"$nulls":4},0,{"$nulls":6},0,null,null,0,null,null,0,null,null,0,{"$nulls":12},"Cmay",{"v":219060,"d":"219,060"},0,""]
[2104144,"Osteosíntesis diafisiaria o metafisiaria (cualquier técnica)","MAI",0,{"$nulls":4},0,{"$nulls":6},0,null,null,0,null,null,0,null,null,0,{"$nulls":12},"Cmay",{"v":219580,"d":"219,580"},0,""]
[2104145,"Osteotomía correctora","MAI",0,{"$nulls":4},0,{"$nulls":6},0,null,null,0,null,null,0,null,null,0,{"$nulls":12},"Cmay",{"v":219060,"d":"219,060"},0,""]
[2104146,"Osteotomía de alargamiento o acortamiento con osteosíntesis inmediata o distracción instrumental progresiva","MAI",0,{"$nulls":4},0,{"$nulls":6},0,null,null,0,null,null,0,null,null,0,{"$nulls":12},"Cmay",{"v":292860,"d":"292,860"},0,""]
[2104147,"Osteotomía en rosario con enclavijamiento clavo telescópico","MAI",0,{"$nulls":4},0,{"$nulls":6},0,null,null,0,null,null,0,null,null,0,{"$nulls":12},"Cmay",{"v":319190,"d":"319,190"},0,""]
[2104148,"Pseudoartrosis, trat. quir. (cualquier técnica)","MAI",0,{"$nulls":4},0,{"$nulls":6},0,null,null,0,null,null,0,null,null,0,{"$nulls":12},"Cmay",{"v":278350,"d":"278,350"},0,""]
[2104149,"Ruptura y/o hernia muscular, trat. quir.","MAI",0,{"$nulls":4},0,{"$nulls":6},0,null,null,0,null,null,0,null,null,0,{"$nulls":12},"Cmay",{"v":161060,"d":"161,060"},0,""]
[2104150,"Artrotomía por cuerpos libres, osteocondritis (proc. aut)","MAI",0,{"$nulls":4},0,{"$nulls":6},0,null,null,0,null,null,0,null,null,0,{"$nulls":12},"Cmay",{"v":172940,"d":"172,940"},0,""]
[2104151,"Desarticulación rodilla","MAI",0,{"$nulls":4},0,{"$nulls":6},0,null,null,0,null,null,0,null,null,0,{"$nulls":12},"Cmay",{"v":271120,"d":"271,120"},0,""]
[2104152,"Disfunción patelo-femoral, realineamiento (cualquier técnica)","MAI",0,{"$nulls":4},0,{"$nulls":6},0,null,null,0,null,null,0,null,null,0,{"$nulls":12},"Cmay",{"v":200520,"d":"200,520"},0,""]
[2104153,"Endoprótesis total (cualquier técnica)","MAI",0,{"$nulls":4},0,{"$nulls":6},0,null,null,0,null,null,0,null,null,0,{"$nulls":12},"Cmay",{"v":488240,"d":"488,240"},0,""]
[2104154,"Fractura rótula: osteosíntesis o patelectomía parc. o total","MAI",0,{"$nulls":4},0,{"$nulls":6},0,null,null,0,null,null,0,null,null,0,{"$nulls":12},"Cmay",{"v":172940,"d":"172,940"},0,""]
[2104155,"Fracturas condíleas o de platillos tibiales, reducción, osteosíntesis  (cualquier técnica)","MAI",0,{"$nulls":4},0,{"$nulls":6},0,null,null,0,null,null,0,null,null,0,{"$nulls":12},"Cmay",{"v":205220,"d":"205,220"},0,""]
[2104156,"Inestabilidad crónica de rodilla, reconstrucción cápsuloligamentosa (cualquier técnica)","MAI",0,{"$nulls":4},0,{"$nulls":6},0,null,null,0,null,null,0,null,null,0,{"$nulls":12},"Cmay",{"v":264520,"d":"264,520"},0,""]
[2104157,"Luxación o rotura ligamentos, trat. quir. cápsulo-ligamentoso","MAI",0,{"$nulls":4},0,{"$nulls":6},0,null,null,0,null,null,0,null,null,0,{"$nulls":12},"Cmay",{"v":172950,"d":"172,950"},0,""]
[2104158,"Meniscectomía quirúrgica, interna y/o externa","MAI",0,{"$nulls":4},0,{"$nulls":6},0,null,null,0,null,null,0,null,null,0,{"$nulls":12},"Cmay",{"v":172950,"d":"172,950"},0,""]
[2104159,"Meniscectomía u otras intervenciones por vía artroscópica (incluye artroscopía diagnóstica)","MAI",0,{"$nulls":4},0,{"$nulls":6},0,null,null,0,null,null,0,null,null,0,{"$nulls":12},"Cmay",{"v":247940,"d":"247,940"},0,""]
[2104160,"Quiste poplíteo, trat. quir.","MAI",0,{"$nulls":4},0,{"$nulls":28},"CMen",{"v":151570,"d":"151,570"},0]
[2104161,"Reconstrucción aparato extensor","MAI",0,{"$nulls":4},0,{"$nulls":6},0,null,null,0,null,null,0,null,null,0,{"$nulls":12},"Cmay",{"v":172950,"d":"172,950"},0,{"$f":"IF(D2576>=P2576 + S2576+ V2576 + Y2576,\"\",\"La suma no puede ser mayor al total\")","v":""}]
[2104162,"Reparación quirúrgica ligamentos colaterales y/o cruzados","MAI",0,{"$nulls":4},0,{"$nulls":6},0,null,null,0,null,null,0,null,null,0,{"$nulls":12},"Cmay",{"v":227170,"d":"227,170"},0,""]
[2104163,"Traslocaciones músculo-tendinosas en rodilla paralítica o espástica","MAI",0,{"$nulls":4},0,{"$nulls":6},0,null,null,0,null,null,0,null,null,0,{"$nulls":12},"Cmay",{"v":227170,"d":"227,170"},0,""]
[2104164,"Amputación pierna","MAI",0,{"$nulls":4},0,{"$nulls":6},0,null,null,0,null,null,0,null,null,0,{"$nulls":12},"Cmay",{"v":222580,"d":"222,580"},0,""]
[2104165,"Colgajo cruzado de pierna, trat. quir. completo","MAI",0,{"$nulls":4},0,{"$nulls":6},0,null,null,0,null,null,0,null,null,0,{"$nulls":12},"Cmay",{"v":264150,"d":"264,150"},0,""]
[2104166,"Fasciotomía por síndrome compartamental","MAI",0,{"$nulls":4},0,{"$nulls":6},0,null,null,0,null,null,0,null,null,0,{"$nulls":12},"Cmay",{"v":161060,"d":"161,060"},0,""]
[2104167,"Osteosíntesis tibio-peroné  (cualquier técnica)","MAI",0,{"$nulls":4},0,{"$nulls":6},0,null,null,0,null,null,0,null,null,0,{"$nulls":12},"Cmay",{"v":172940,"d":"172,940"},0,""]
[2104168,"Osteotomía correctora de ejes  (cualquier técnica)","MAI",0,{"$nulls":4},0,{"$nulls":6},0,null,null,0,null,null,0,null,null,0,{"$nulls":12},"Cmay",{"v":179120,"d":"179,120"},0,""]
[2104169,"Osteotomía de alargamiento o acortamiento con osteosíntesis inmediata o distracción instrumental progresiva","MAI",0,{"$nulls":4},0,{"$nulls":6},0,null,null,0,null,null,0,null,null,0,{"$nulls":12},"Cmay",{"v":292860,"d":"292,860"},0,""]
[2104170,"Osteotomía del peroné","MAI",0,{"$nulls":4},0,{"$nulls":6},0,null,null,0,null,null,0,null,null,0,{"$nulls":12},"Cmay",{"v":161060,"d":"161,060"},0,""]
[2104171,"Peroné protibia","MAI",0,{"$nulls":4},0,{"$nulls":6},0,null,null,0,null,null,0,null,null,0,{"$nulls":12},"Cmay",{"v":199270,"d":"199,270"},0,""]
[2104172,"Pseudoartrosis, c/s osteosíntesis  (cualquier técnica)","MAI",0,{"$nulls":4},0,{"$nulls":6},0,null,null,0,null,null,0,null,null,0,{"$nulls":12},"Cmay",{"v":179120,"d":"179,120"},0,""]
[2104173,"Desarticulación tobillo","MAI",0,{"$nulls":4},0,{"$nulls":6},0,null,null,0,null,null,0,null,null,0,{"$nulls":12},"Cmay",{"v":247810,"d":"247,810"},0,""]
[2104174,"Endoprótesis total  (cualquier técnica)","MAI",0,{"$nulls":4},0,{"$nulls":6},0,null,null,0,null,null,0,null,null,0,{"$nulls":12},"Cmay",{"v":345810,"d":"345,810"},0,""]
[2104175,"Esguince grave, trat. quir. cápsulo-ligamentoso","MAI",0,{"$nulls":4},0,{"$nulls":6},0,null,null,0,null,null,0,null,null,0,{"$nulls":12},"Cmay",{"v":172940,"d":"172,940"},0,""]
[2104176,"Fractura astrágalo y/o calcáneo, osteosíntesis (cualq. técn.)","MAI",0,{"$nulls":4},0,{"$nulls":6},0,null,null,0,null,null,0,null,null,0,{"$nulls":12},"Cmay",{"v":195710,"d":"195,710"},0,""]
[2104177,"Huesos supernumerarios, extirpación, uno o más del mismo lado","MAI",0,{"$nulls":4},0,{"$nulls":6},0,null,null,0,null,null,0,null,null,0,{"$nulls":12},"Cmay",{"v":161060,"d":"161,060"},0,""]
[2104178,"Luxación tibio-astrág.-calcán., reducc. cruenta y osteosínt.","MAI",0,{"$nulls":4},0,{"$nulls":6},0,null,null,0,null,null,0,null,null,0,{"$nulls":12},"Cmay",{"v":172950,"d":"172,950"},0,""]
[2104179,"Luxofractura tobillo, cualquier tipo, osteosíntesis y reparación cápsulo-ligamentosa","MAI",0,{"$nulls":4},0,{"$nulls":6},0,null,null,0,null,null,0,null,null,0,{"$nulls":12},"Cmay",{"v":217100,"d":"217,100"},0,""]
[2104180,"Osteoplastía tibio-calcánea","MAI",0,{"$nulls":4},0,{"$nulls":6},0,null,null,0,null,null,0,null,null,0,{"$nulls":12},"Cmay",{"v":195710,"d":"195,710"},0,""]
[2104181,"Ruptura tendón de Aquiles o tibial posterior, tenorrafia primaria y/o transposiciones tendinosas","MAI",0,{"$nulls":4},0,{"$nulls":6},0,null,null,0,null,null,0,null,null,0,{"$nulls":12},"Cmay",{"v":179120,"d":"179,120"},0,""]
[2104182,"Ruptura tibial anterior u otros, tenorrafia","MAI",0,{"$nulls":4},0,{"$nulls":6},0,null,null,0,null,null,0,null,null,0,{"$nulls":12},"Cmay",{"v":172940,"d":"172,940"},0,""]
[2104183,"Tenorrafia extensores o tenotomía de alargamiento de tendón de Aquiles","MAI",0,{"$nulls":4},0,{"$nulls":6},0,null,null,0,null,null,0,null,null,0,{"$nulls":12},"Cmay",{"v":161090,"d":"161,090"},0,""]
[2104184,"Traslocación tendinosa","MAI",0,{"$nulls":4},0,{"$nulls":6},0,null,null,0,null,null,0,null,null,0,{"$nulls":12},"Cmay",{"v":172950,"d":"172,950"},0,""]
[2104185,"Amputación transmetatarsiana","MAI",0,{"$nulls":4},0,{"$nulls":6},0,null,null,0,null,null,0,null,null,0,{"$nulls":12},"Cmay",{"v":195710,"d":"195,710"},0,""]
[2104186,"Astrágalo vertical, trat. quir.","MAI",0,{"$nulls":4},0,{"$nulls":6},0,null,null,0,null,null,0,null,null,0,{"$nulls":12},"Cmay",{"v":179110,"d":"179,110"},0,""]
[2104187,"Espolón calcáneo, trat. quir.","MAI",0,{"$nulls":4},0,{"$nulls":6},0,null,null,0,null,null,0,null,null,0,{"$nulls":12},"Cmay",{"v":161060,"d":"161,060"},0,""]
[2104188,"Exostosis 5° metatarsiano, (\"juanetillo\")  trat. quir.","MAI",0,{"$nulls":4},0,{"$nulls":6},0,null,null,0,null,null,0,null,null,0,{"$nulls":12},"Cmay",{"v":161060,"d":"161,060"},0,""]
[2104189,"Fasciotomía plantar (proc. aut.)","MAI",0,{"$nulls":4},0,{"$nulls":6},0,null,null,0,null,null,0,null,null,0,{"$nulls":12},"Cmay",{"v":161060,"d":"161,060"},0,""]
[2104190,"Hallux valgus o rígidus, trat.quir. completo (cualquier téc.)","MAI",0,{"$nulls":4},{"$f":"+J2605+K2605","v":0},{"$nulls":6},0,null,null,0,null,null,0,null,null,0,{"$nulls":12},"Cmay",{"v":161090,"d":"161,090"},0,""]
[2104191,"Luxaciones, luxofracturas, fracturas, reducción cruenta","MAI",0,{"$nulls":4},0,{"$nulls":6},0,null,null,0,null,null,0,null,null,0,{"$nulls":12},"Cmay",{"v":172950,"d":"172,950"},{"$f":"AM2606*I2606","v":0},""]
[2104192,"Mal perforante plantar, trat. quir.","MAI",{"$f":"SUM(J2607:O2607)","v":0},{"$nulls":4},0,{"$nulls":6},{"$f":"SUM(Q2607:R2607)","v":0},null,null,0,null,null,0,null,null,0,{"$nulls":12},"Cmay",{"v":172950,"d":"172,950"},0,""]
[2104193,"Neuroma de Morton, trat. quir.","MAI",0,{"$nulls":4},0,{"$nulls":6},0,null,null,0,null,null,0,null,null,0,{"$nulls":12},"Cmay",{"v":161060,"d":"161,060"},0,""]
[2104194,"Ortejos en garra, trat. quir., cualq. número (cualq. técnica)","MAI",0,{"$nulls":4},0,{"$nulls":6},0,null,null,0,null,null,0,null,null,0,{"$nulls":12},"Cmay",{"v":161060,"d":"161,060"},0,""]
[2104195,"Ortejos, amputación, uno o más del mismo pie","MAI",0,{"$nulls":4},0,{"$nulls":6},0,null,null,0,null,null,{"$f":"SUM(W2610:X2610)","v":0},null,null,0,{"$nulls":12},"Cmay",{"v":161060,"d":"161,060"},0,""]
[2104196,"Pie bot u otras malformaciones congénitas, trat. quir. (cualquier técnica)","MAI",0,{"$nulls":4},0,{"$nulls":6},0,null,null,0,null,null,0,null,null,0,{"$nulls":12},"Cmay",{"v":179110,"d":"179,110"},0,""]
[2104197,"Pie cavo, trat. quir. (cualquier técnica)","MAI",0,{"$nulls":4},0,{"$nulls":6},0,null,null,0,null,null,0,null,null,0,{"$nulls":12},"Cmay",{"v":161090,"d":"161,090"},0,""]
[2104198,"Pie plano, trat. quir. (cualquier técnica)","MAI",0,{"$nulls":4},0,{"$nulls":6},0,null,null,{"$f":"SUM(T2613:U2613)","v":0},null,null,0,null,null,{"$f":"SUM(Z2613:AA2613)","v":0},{"$nulls":12},"Cmay",{"v":161090,"d":"161,090"},0,""]
[2104199,"Pie reumatoídeo, trat. quir. completo (cualquier técnica)","MAI",0,{"$nulls":4},0,{"$nulls":6},0,null,null,0,null,null,0,null,null,0,{"$nulls":12},"Cmay",{"v":182650,"d":"182,650"},0,""]
[2104200,"Sesamoídeos, extirpación de uno o más del mismo pie","MAI",0,{"$nulls":4},0,{"$nulls":6},0,null,null,0,null,null,0,null,null,0,{"$nulls":12},"Cmay",{"v":161090,"d":"161,090"},0,""]
[2104201,"Tenorrafia extensores","MAI",0,{"$nulls":4},0,{"$nulls":6},0,null,null,0,null,null,0,null,null,0,{"$nulls":12},"Cmay",{"v":161060,"d":"161,060"},0,""]
[2104202,"Transplantes tendinosos (cualquier técnica)","MAI",0,{"$nulls":4},0,{"$nulls":6},0,null,null,0,null,null,0,null,null,0,{"$nulls":12},"Cmay",{"v":172950,"d":"172,950"},0,""]
[null,"Total ARANCEL MAI",null,{"$f":"SUM(D2413:D2617)","v":0},{"$nulls":4},{"$f":"SUM(I2413:I2617)","v":0},0,0,0,0,0,0,{"$f":"SUM(P2413:P2617)","v":0},0,0,0,0,0,0,0,0,0,0,0,0,0,0,0,0,0,0,0,0,0,0,{"v":49797420,"d":"49,797,420"},0]
[null,"Sinoviortesis en paciente hemofílico ",null,0,{"$nulls":4},0,{"$nulls":6},0,null,null,0,null,null,0,null,null,0,{"$nulls":12},"Cmay",null,null,{"$f":"IF(D2619>=P2619 + S2619+ V2619 + Y2619,\"\",\"La suma no puede ser mayor al total\")","v":""}]
[null,"Otras cirugías periarticulares hemofilicos ",null,0,{"$nulls":4},0,{"$nulls":6},{"$f":"SUM(Q2620:R2620)","v":0},null,null,0,null,null,0,null,null,0,{"$nulls":12},"Cmay",null,null,""]
[null,"Amputaciones pie diabético",null,0,{"$nulls":4},{"$f":"+J2621","v":0},{"$nulls":6},0,null,null,0,null,null,0,null,null,0,{"$nulls":12},"Cmay",null,null,""]
[null,"Amputación de ortejo(s) por pie diabético ",null,0,{"$nulls":4},{"$f":"+J2622","v":0},{"$nulls":6},0,null,null,0,null,null,0,null,null,0,{"$nulls":12},"Cmay",null,null,""]
[null,"Amputación de pie completo por pie diabético ",null,0,{"$nulls":4},{"$f":"+J2623","v":0},{"$nulls":6},{"$f":"SUM(Q2623:R2623)","v":0},null,null,0,null,null,0,null,null,0,{"$nulls":12},"Cmay",null,null,""]
[null,"TOTAL ARANCEL MLE Y NO ARANCELADO",null,{"$f":"SUM(D2619:D2623)","v":0},{"$nulls":4},{"$f":"SUM(I2619:I2623)","v":0},0,0,0,0,0,0,0,0,0,0,0,0,0,0,0,0,0,0,0,0,0,0,0,0,0,0,0,0]
[null,"TOTAL PRODUCCION",null,{"$f":"SUM(D2618+D2624)","v":0},{"$nulls":4},{"$f":"SUM(I2618+I2624)","v":0},0,0,0,0,0,0,0,0,0,0,0,0,0,0,0,0,0,0,0,0,0,0,0,0,0,0,0,0,0,{"v":49797420,"d":"49,797,420"},0]
[null,"RETIRO DE ELEMENTOS DE OSTEOSINTESIS             "]
[2106001,"Retiro de endoprótesis u osteosíntesis internas articulares o de columna vertebral","MAI",{"$f":"SUM(J2627:O2627)","v":0},{"$nulls":4},{"$f":"+J2627+K2627","v":0},{"$nulls":6},{"$f":"SUM(Q2627:R2627)","v":0},null,null,{"$f":"SUM(T2627:U2627)","v":0},null,null,{"$f":"SUM(W2627:X2627)","v":0},null,null,{"$f":"SUM(Z2627:AA2627)","v":0},{"$nulls":12},"Cmay",{"v":212790,"d":"212,790"},{"$f":"AM2627*I2627","v":0},{"$f":"IF(D2627>=P2627 + S2627+ V2627 + Y2627,\"\",\"La suma no puede ser mayor al total\")","v":""}]
[2106002,"Retiro de placas rectas o anguladas","MAI",{"$f":"SUM(J2628:O2628)","v":0},{"$nulls":4},0,{"$nulls":6},{"$f":"SUM(Q2628:R2628)","v":0},null,null,{"$f":"SUM(T2628:U2628)","v":0},null,null,{"$f":"SUM(W2628:X2628)","v":0},null,null,{"$f":"SUM(Z2628:AA2628)","v":0},{"$nulls":12},"Cmay",{"v":118570,"d":"118,570"},{"$f":"AM2628*I2628","v":0},""]
[2106003,"Retiro de tornillos, clavos, agujas de osteosíntesis o similares","MAI",{"$f":"SUM(J2629:O2629)","v":0},{"$nulls":4},0,{"$nulls":6},{"$f":"SUM(Q2629:R2629)","v":0},null,null,{"$f":"SUM(T2629:U2629)","v":0},null,null,{"$f":"SUM(W2629:X2629)","v":0},null,null,{"$f":"SUM(Z2629:AA2629)","v":0},{"$nulls":12},"Cmay",{"v":59390,"d":"59,390"},{"$f":"AM2629*I2629","v":0},""]
[null,"TOTAL",null,{"$f":"SUM(D2627:D2629)","v":0},{"$nulls":4},{"$f":"SUM(I2627:I2629)","v":0},0,0,0,0,0,0,0,0,0,0,0,0,0,0,0,0,0,0,0,0,0,0,0,0,0,0,0,0,0,{"v":390750,"d":"390,750"},0]
[null,"Procedimientos Ortopédicos"]
[2107001,"Luxaciones de articulaciones medianas (hombro, codo, rodilla, tobillo, muñeca, tarso y esternoclavicular)","MAI",{"$f":"SUM(E2632+H2632)","v":0},{"$f":"SUM(F2632:G2632)","v":0},{"$nulls":32},"Proc",{"v":66930,"d":"66,930"},{"$f":"AM2632*F2632","v":0}]
[2107002,"Luxaciones de articulaciones  mayores (columna, cadera, pelvis)","MAI",0,0,{"$nulls":32},"Proc",{"v":82380,"d":"82,380"},0]
[2107003,"Luxaciones de articulaciones menores (el resto)      ","MAI",0,0,{"$nulls":32},"Proc",{"v":29490,"d":"29,490"},0]
[2107004,"Fracturas mayores (columna, pelvis, supracondílea, codo, epífisis femorales)","MAI",0,0,{"$nulls":32},"Proc",{"v":115270,"d":"115,270"},0]
[2107005,"Fracturas medianas (diáfisis humeral, radial, cubital, diáfisis femoral, tibial, peroneal, clavicular, platillos tibiales)","MAI",0,0,{"$nulls":32},"Proc",{"v":92640,"d":"92,640"},0]
[2107006,"Fracturas menores (el resto)","MAI",0,0,{"$nulls":32},"Proc",{"v":46330,"d":"46,330"},0]
[2107007,"Tto.funcional c/técnica Sarmiento y similares- Extremidad inferior","MAI",0,0,{"$nulls":32},"Proc",{"v":93550,"d":"93,550"},0]
[2107008,"Tto.funcional c/técnica Sarmiento y similares- Extremidad superior","MAI",0,0,{"$nulls":32},"Proc",{"v":83410,"d":"83,410"},0]
[2107009,"Luxación congénita de cadera, trat. ortopédico completo (uni o bilateral)","MAI",0,0,{"$nulls":32},"Proc",{"v":85990,"d":"85,990"},0]
[2107010,"Pie bot, cada pie, hasta 10 cambios de yeso","MAI",0,0,{"$nulls":32},"Proc",{"v":85990,"d":"85,990"},0]
[null,"TOTAL",null,{"$f":"SUM(D2632:D2641)","v":0},{"$f":"SUM(E2632:E2641)","v":0},0,0,0,{"$nulls":19},0,0,0,0,0,0,0,0,0,0,0,{"v":781980,"d":"781,980"},0]
["PROTESIS  Y ORTESIS"]
[2301002,"Ortesis cervicales (collares blandos y duros)","MLE",0,0,{"$nulls":32},"Proc"]
[2301008,"Braguero (Hernia Umbilical o Inguinal)","MLE",0,0,{"$nulls":32},"Proc"]
[2301011,"Faja Ortopédica (Contensión de Abdomen o Columna Dorsolumbar)","MLE",0,0,{"$nulls":32},"Proc"]
[2301020,"Ortesis Muslo-Pie o Isquiopedio","MLE",0,0,{"$nulls":32},"Proc"]
[2301021,"Arnés de Prótesis (Extremidad Superior)","MLE",0,0,{"$nulls":32},"Proc"]
[2301022,"Bastón canadiense o trípode, c/u","MLE",0,0,{"$nulls":32},"Proc"]
[2301024,"Rodillera","MLE",0,0,{"$nulls":32},"Proc"]
[2301029,"Cojín de abducción o Paulik","MLE",0,0,{"$nulls":32},"Proc"]
[2301030,"Correa de ortesis","MLE",0,0,{"$nulls":32},"Proc"]
[2301031,"Correa de Muley (Prótesis bajo rodilla)","MLE",0,0,{"$nulls":32},"Proc"]
[2301032,"Ortesis de columna (Milwaukee, Taylor o similares)","MLE",0,0,{"$nulls":32},"Proc"]
[2301033,"Ortesis lumbosacra (Corset de Knight)","MLE",0,0,{"$nulls":32},"Proc"]
[2301034,"Ortesis palmar activa (UCLA)","MLE",0,0,{"$nulls":32},"Proc"]
[2301035,"Ortesis radial de posición","MLE",0,0,{"$nulls":32},"Proc"]
[2301036,"Ortesis corta de posición (digitales) c/u","MLE",0,0,{"$nulls":32},"Proc"]
[2301037,"Ortesis de uso nocturno de miembro inferior","MLE",0,0,{"$nulls":32},"Proc"]
[2301038,"Ortesis Larga de Posición (Extremidad Superior)","MLE",0,0,{"$nulls":32},"Proc"]
[2301040,"Muletas (par)","MLE",0,0,{"$nulls":32},"Proc"]
[2301041,"Ortesis Larga bilateral con cinturón pélvico (Extremidades Inferiores)","MLE",0,0,{"$nulls":32},"Proc"]
[2301042,"Ortesis Larga unilateral (Extremidad Inferior)","MLE",0,0,{"$nulls":32},"Proc"]
[2301043,"Ortesis mano-muñeca pasiva","MLE",0,0,{"$nulls":32},"Proc"]
[2301044,"Ortesis para rodilla","MLE",0,0,{"$nulls":32},"Proc"]
[2301045,"Ortesis tobillo-pie","MLE",0,0,{"$nulls":32},"Proc"]
[2301067,"Talonera goma (par)","MLE",0,0,{"$nulls":32},"Proc"]
[5099074,"Ortesis parálisis cubital",null,0,0,{"$nulls":32},"Proc"]
[5099075,"Ortesis tendones flexores",null,0,0,{"$nulls":32},"Proc"]
[5099076,"Ortesis digital dinámica",null,{"$f":"SUM(E2670+H2670)","v":0},{"$f":"SUM(F2670:G2670)","v":0},{"$nulls":32},"Proc"]
[5099065,"Canaletas  bipedestación",null,0,0,{"$nulls":32},"Proc"]
[5099066,"Correas desrotadoras ",null,0,0,{"$nulls":32},"Proc"]
[5099067,"Correa dorsiflexion pie",null,0,0,{"$nulls":32},"Proc"]
[5099068,"Férula abducción hombro",null,0,0,{"$nulls":32},"Proc"]
[5099069,"Férula extension codo",null,0,0,{"$nulls":32},"Proc"]
[5099070,"Férula extension muñeca",null,0,0,{"$nulls":32},"Proc"]
[5099071,"Férula flexion muñeca",null,0,0,{"$nulls":32},"Proc"]
[5099072,"Palmeta extensión muñeca y dedos",null,0,0,{"$nulls":32},"Proc"]
[5099073,"Correas desrotadoras parálisis braquial obstétrica",null,0,0,{"$nulls":32},"Proc"]
[5099077,"Camiseta manga larga ",null,0,0,{"$nulls":32},"Proc"]
[5099078,"Camiseta manga corta",null,0,0,{"$nulls":32},"Proc"]
[5099079,"Manga larga ",null,0,0,{"$nulls":32},"Proc"]
[5099080,"Manga corta",null,0,0,{"$nulls":32},"Proc"]
[5099081,"Pantalón largo ",null,0,0,{"$nulls":32},"Proc"]
[5099082,"Pantalón corto ",null,0,0,{"$nulls":32},"Proc"]
[5099083,"Media larga",null,0,0,{"$nulls":32},"Proc"]
[5099084,"Media corta",null,0,0,{"$nulls":32},"Proc"]
[5099085,"Media tipo calcetín",null,0,0,{"$nulls":32},"Proc"]
[5099086,"Guante tipo mitón",null,0,0,{"$nulls":32},"Proc"]
[5099087,"Guante con dedos",null,0,0,{"$nulls":32},"Proc"]
[5099088,"Máscara",null,0,0,{"$nulls":32},"Proc"]
[5099089,"Mentonera",null,0,0,{"$nulls":32},"Proc"]
[5099090,"Cintillo",null,0,0,{"$nulls":32},"Proc"]
[5099061,"Collar cervical semirígido",null,0,0,{"$nulls":32},"Proc"]
[5099062,"Collar cervical blando",null,0,0,{"$nulls":32},"Proc"]
[null,"Canaletas  bipedestación ",null,0,0,{"$nulls":32},"Proc"]
[null,"TOTAL",null,{"$f":"SUM(D2644:D2696)","v":0},{"$f":"SUM(E2644:E2696)","v":0},0,0,0,{"$nulls":19},0,0,0,0,0,0,0,0,0,0]
[null,"GRUPO 22 : ANESTESIA                                             "]
[2201102,"Anestesia peridural o epidural  continua para partos","MAI",0,0,{"$nulls":32},"Proc",{"v":30800,"d":"30,800"},{"$f":"AM2699*F2699","v":0}]
[null,"TOTAL",null,{"$f":"D2699","v":0},{"$f":"E2699","v":0},{"$f":"F2699","v":0},0,0,{"$nulls":19},0,0,0,0,0,0,0,0,0,0,null,{"v":30800,"d":"30,800"},0]
[null,"OTROS PROCEDIMIENTOS ANESTÉSICOS"]
[2201001,"Anestesia general o regional otorgada por médico diferente al primer cirujano (en intervenciones o procedimientos diagnósticos o terapéuticos)","MLE",0,0,{"$nulls":32},"Proc"]
[2201002,"Anestesia peridural continua, proc. aut.","MLE",0,0,{"$nulls":32},"Proc"]
[null,"Intubación nasotraqueal/orotraqueal",null,0,0,{"$nulls":32},"Proc"]
[null,"Anestesia general como apoyo a resonancia magnética",null,0,0,{"$nulls":32},"Proc"]
[null,"Anestesia general como apoyo a tomografía computada",null,0,0,{"$nulls":32},"Proc"]
[null,"Sedación como apoyo a examen y/o procedimiento",null,0,0,{"$nulls":32},"Proc"]
[null,"Anestesia regional o local infiltrativa administrada por cirujano",null,0,0,{"$nulls":32},"Proc"]
[null,"TOTAL",null,{"$f":"SUM(D2702:D2708)","v":0},{"$f":"SUM(E2702:E2708)","v":0},{"$f":"SUM(F2702:F2708)","v":0},{"$f":"SUM(G2702:G2708)","v":0},0,{"$nulls":19},0,0,0,0,0,0,0,0,0,0,0]
[null,"GRUPO 24 : RESCATES, TRASLADOS Y RONDAS RURALES  "]
[2401061,"Rescate simple y/o traslado en móvil 1","MAI",0,0,{"$nulls":32},"Proc",{"v":20290,"d":"20,290"},{"$f":"AM2711*F2711","v":0}]
[2401062,"Rescate profesionalizado y/o traslado paciente complejo móvil 2","MAI",0,0,{"$nulls":32},"Proc",{"v":63840,"d":"63,840"},0]
[2401063,"Rescate medicalizado y/o traslado paciente critico en móvil 3","MAI",0,0,{"$nulls":32},"Proc",{"v":79130,"d":"79,130"},0]
[2401064,"Traslado en ambulancia","MAI",0,0,{"$nulls":32},"Proc",{"v":2780,"d":"2,780"},0]
[2401065,"Ronda rural terrestre, c/ km recorrido","MAI",0,0,{"$nulls":32},"Proc",70,0]
[2401066,"Ronda rural aérea, c/ hora de vuelo","MAI",0,0,{"$nulls":32},"Proc",{"v":168000,"d":"168,000"},0]
[2401067,"Ronda rural marítima, c/ hora de navegación","MAI",0,0,{"$nulls":32},"Proc",{"v":11420,"d":"11,420"},0]
[null,"TOTAL",null,{"$f":"SUM(D2711:D2717)","v":0},{"$f":"SUM(E2711:E2717)","v":0},{"$f":"SUM(F2711:F2717)","v":0},{"$f":"SUM(G2711:G2717)","v":0},0,{"$nulls":19},0,0,0,0,0,0,0,0,0,0,0,{"v":345530,"d":"345,530"},0]
[null,"GRUPO 27 : ATENCION ODONTOLOGICA                             ",{"$nulls":22},{"$f":"AM2719*F2719","v":0}]
[null,"NIVEL PRIMARIO                                              "]
[2701001,"Aplicación de sellantes","MAI",{"$f":"SUM(E2721+H2721)","v":0},{"$f":"SUM(F2721:G2721)","v":0},{"$nulls":32},"Proc",{"v":4850,"d":"4,850"},{"$f":"AM2721*F2721","v":0}]
[2701002,"Desgastes selectivos","MAI",{"$f":"SUM(E2722+H2722)","v":0},{"$f":"SUM(F2722:G2722)","v":0},{"$nulls":32},"Proc",{"v":3980,"d":"3,980"},0]
[2701003,"Destartraje y pulido coronario","MAI",0,0,{"$nulls":32},"Proc",{"v":7560,"d":"7,560"},0]
[2701007,"Fluoración tópica","MAI",0,0,{"$nulls":32},"Proc",{"v":2700,"d":"2,700"},0]
[2701008,"Mantenedores de espacio","MAI",0,0,{"$nulls":32},"Proc",{"v":15790,"d":"15,790"},0]
[2701011,"Pulpotomía","MAI",0,0,{"$nulls":32},"Proc",{"v":2770,"d":"2,770"},0]
[2701013,"Examen de salud oral","MAI",0,0,{"$nulls":32},"Proc",{"v":3400,"d":"3,400"},0]
[2701017,"Barniz de Flúor","MAI",0,0,{"$nulls":32},"Proc",{"v":9920,"d":"9,920"},0]
[2701004,"Educación grupal","MAI",0,0,{"$nulls":32},"Proc",{"v":10350,"d":"10,350"},0]
[2701014,"Trabajo comunitario","MAI",0,0,{"$nulls":32},"Proc",{"v":5850,"d":"5,850"},0]
[2701005,"Exodoncia simple diente permanente","MAI",0,0,{"$nulls":32},"Proc",{"v":4410,"d":"4,410"},0]
[2701006,"Exodoncia diente primario","MAI",0,0,{"$nulls":32},"Proc",{"v":2770,"d":"2,770"},0]
[2701009,"Obturación amalgama ","MAI",0,0,{"$nulls":32},"Proc",{"v":10720,"d":"10,720"},0]
[2701010,"Obturación composite","MAI",0,0,{"$nulls":32},"Proc",{"v":10200,"d":"10,200"},0]
[2701012,"Urgencias","MAI",0,0,{"$nulls":32},"Proc",{"v":4860,"d":"4,860"},0]
[2701015,"Radiografía retroalveolar y Bite-Wing (por placa)","MAI",0,0,{"$nulls":32},"Proc",{"v":3100,"d":"3,100"},0]
[2701016,"Obturación Vidrio Ionómero","MAI",0,0,{"$nulls":32},"Proc",{"v":6320,"d":"6,320"},0]
[null,"TOTAL",null,{"$f":"SUM(D2721:D2737)","v":0},{"$f":"SUM(E2721:E2737)","v":0},0,0,0,{"$nulls":19},0,0,0,0,0,0,0,0,0,0,0,{"v":109550,"d":"109,550"},0]
[null,"NIVEL SECUNDARIO                                        "]
[2702001,"Cirugía bucal","MAI",{"$f":"SUM(E2740+H2740)","v":0},{"$f":"SUM(F2740:G2740)","v":0},{"$nulls":32},"Proc",{"v":12320,"d":"12,320"},{"$f":"AM2740*F2740","v":0}]
[2702004,"Obturación Inlay metal (incluye materiales no preciosos, no incluye oro)","MAI",0,0,{"$nulls":32},"Proc",{"v":10530,"d":"10,530"},0]
[2702005,"Consulta especialidad Periodoncia","MAI",0,0,{"$nulls":32},"Proc",{"v":3690,"d":"3,690"},0]
[2702006,"Plano alivio oclusal","MAI",0,0,{"$nulls":32},"Proc",{"v":20140,"d":"20,140"},0]
[2702007,"Prótesis de restitución (fase clínica)","MAI",0,0,{"$nulls":32},"Proc",{"v":43690,"d":"43,690"},0]
[2702008,"Prótesis metálica","MAI",0,0,{"$nulls":32},"Proc",{"v":65650,"d":"65,650"},0]
[2702009,"Radiografía extraoral (por placa)","MAI",0,0,{"$nulls":32},"Proc",{"v":4400,"d":"4,400"},0]
[2702010,"Radiografía oclusal (por placa)","MAI",0,0,{"$nulls":32},"Proc",{"v":2510,"d":"2,510"},0]
[2702011,"Prótesis de restitución (fase laboratorio)","MAI",0,0,{"$nulls":32},"Proc",{"v":21750,"d":"21,750"},0]
[2702012,"Reparación compuesta de prótesis","MAI",0,0,{"$nulls":32},"Proc",{"v":8730,"d":"8,730"},0]
[2702013,"Reparación corona","MAI",0,0,{"$nulls":32},"Proc",{"v":6720,"d":"6,720"},0]
[2702014,"Reparación o reajuste prótesis","MAI",0,0,{"$nulls":32},"Proc",{"v":5260,"d":"5,260"},0]
[2702015,"Restitución por corona (combinada)","MAI",0,0,{"$nulls":32},"Proc",{"v":39440,"d":"39,440"},0]
[2702016,"Restitución por corona provisoria","MAI",0,0,{"$nulls":32},"Proc",{"v":20140,"d":"20,140"},0]
[2702017,"Sialografía (cada lado) (incluye el proc.)","MAI",0,0,{"$nulls":32},"Proc",{"v":28950,"d":"28,950"},0]
[2702019,"Tratamiento ortodoncia con aparatología removible  (incluye aparato)(año 1)","MAI",0,0,{"$nulls":32},"Proc",{"v":110640,"d":"110,640"},0]
[2702020,"Tratamiento ortodoncia con aparatologia fija (incluye aparato) (año 1)","MAI",0,0,{"$nulls":32},"Proc",{"v":134140,"d":"134,140"},0]
[2702021,"Tratamiento ortodoncia con aparatologia fija (incluye aparato) (año 2)","MAI",0,0,{"$nulls":32},"Proc",{"v":80110,"d":"80,110"},0]
[2702022,"Endodoncia Multirradicular","MAI",0,0,{"$nulls":32},"Proc",{"v":69300,"d":"69,300"},0]
[2702023,"Endodoncia birradicular","MAI",0,0,{"$nulls":32},"Proc",{"v":50650,"d":"50,650"},0]
[2702024,"Endodoncia unirradicular","MAI",0,0,{"$nulls":32},"Proc",{"v":45310,"d":"45,310"},0]
[2702025,"Telerradiografia","MAI",0,0,{"$nulls":32},"Proc",{"v":7710,"d":"7,710"},0]
[2702026,"Radiografía Panoramica (por placa)","MAI",0,0,{"$nulls":32},"Proc",{"v":16350,"d":"16,350"},0]
[2702027,"Tomografia Computacional Maxilo Facial Cone Beam","MAI",0,0,{"$nulls":32},"Proc",{"v":29610,"d":"29,610"},0]
[null,"Total ARANCEL MAI",null,{"$f":"SUM(D2740:D2763)","v":0},{"$f":"SUM(E2740:E2763)","v":0},0,0,0,{"$nulls":19},0,0,0,0,0,0,0,0,0,0,0,{"v":837740,"d":"837,740"},0]
[null,"Sutura intraoral ",null,{"$f":"SUM(J2765:O2765)","v":0},{"$nulls":4},{"$f":"+J2765+K2765","v":0},{"$nulls":28},"Cmen"]
[null,"Tratamiento quirúrgico pseudoquiste y quiste odontológico ",null,{"$f":"SUM(J2766:O2766)","v":0},{"$nulls":4},0,{"$nulls":28},"Cmen"]
[null,"Tratamiento quirúrgico tumor odontológico ",null,0,{"$nulls":4},0,{"$nulls":28},"Cmen"]
[5099022,"Frenectomia ",null,0,{"$nulls":4},0,{"$nulls":28},"Cmen"]
[5099023,"Fenestracion",null,0,{"$nulls":4},0,{"$nulls":28},"Cmen"]
[5099024,"Drenaje Abceso intra-extroral",null,0,{"$nulls":4},0,{"$nulls":28},"Cmen"]
[5099025,"Cirugía preprotesica ",null,0,{"$nulls":4},0,{"$nulls":28},"Cmen"]
[" 5099056 ","Desobturacion de conductos ",null,0,{"$nulls":4},0,{"$nulls":28},"Cmen"]
[null,"Cirugía ortognática",null,0,{"$nulls":4},0,{"$nulls":28},"Cmen"]
[null,"TOTAL ARANCEL MLE Y NO ARANCELADO",null,{"$f":"SUM(D2765:D2773)","v":0},{"$nulls":4},{"$f":"SUM(I2765:I2773)","v":0},0,0,0,0,0,0,0,0,0,0,0,0,0,0,0,0,0,0,0,0,0,0,0,0,0,0,0,0,0]
[null,"TOTAL PRODUCCION",null,{"$f":"SUM(D2764,D2774)","v":0},{"$nulls":4},{"$f":"SUM(I2764,I2774)","v":0},0,0,0,0,0,0,0,0,0,0,0,0,0,0,0,0,0,0,0,0,0,0,0,0,0,0,0,0,0,{"v":837740,"d":"837,740"},0]
[null,"NIVEL TERCIARIO                                         "]
[2703001,"Cirugía de enfermedad periodontal (por grupo)","MAI",{"$f":"SUM(J2777:O2777)","v":0},{"$nulls":4},{"$f":"+J2777+K2777","v":0},{"$nulls":28},"CMen",{"v":13170,"d":"13,170"},{"$f":"AM2777*I2777","v":0}]
[2703002,"Corticotomía","MAI",{"$f":"SUM(J2778:O2778)","v":0},{"$nulls":4},0,{"$nulls":6},{"$f":"SUM(Q2778:R2778)","v":0},null,null,{"$f":"SUM(T2778:U2778)","v":0},null,null,{"$f":"SUM(W2778:X2778)","v":0},null,null,{"$f":"SUM(Z2778:AA2778)","v":0},{"$nulls":12},"Cmay",{"v":73020,"d":"73,020"},{"$f":"AM2778*I2778","v":0},{"$f":"IF(D2778>=P2778 + S2778+ V2778 + Y2778,\"\",\"La suma no puede ser mayor al total\")","v":""}]
[2703003,"Disyunción palatina quirúrgica","MAI",{"$f":"SUM(J2779:O2779)","v":0},{"$nulls":4},0,{"$nulls":6},{"$f":"SUM(Q2779:R2779)","v":0},null,null,{"$f":"SUM(T2779:U2779)","v":0},null,null,{"$f":"SUM(W2779:X2779)","v":0},null,null,{"$f":"SUM(Z2779:AA2779)","v":0},{"$nulls":12},"Cmay",{"v":136160,"d":"136,160"},0,{"$f":"IF(D2779>=P2779 + S2779+ V2779 + Y2779,\"\",\"La suma no puede ser mayor al total\")","v":""}]
[2703004,"Extirpación de pseudoquistes, quistes y tumores","MAI",0,{"$nulls":4},0,{"$nulls":6},{"$f":"SUM(Q2780:R2780)","v":0},null,null,{"$f":"SUM(T2780:U2780)","v":0},null,null,0,null,null,0,{"$nulls":12},"Cmay",{"v":102300,"d":"102,300"},0,""]
[2703005,"Glosectomías","MAI",0,{"$nulls":4},0,{"$nulls":6},0,null,null,0,null,null,0,null,null,0,{"$nulls":12},"Cmay",{"v":156580,"d":"156,580"},0,""]
[2703006,"Implante endodóntico intraóseo","MAI",0,{"$nulls":4},0,{"$nulls":28},"CMen",{"v":41530,"d":"41,530"},0]
[2703007,"Implantes subperiósticos","MAI",0,{"$nulls":4},0,{"$nulls":6},0,null,null,0,null,null,0,null,null,0,{"$nulls":12},"Cmay",{"v":157430,"d":"157,430"},0,{"$f":"IF(D2783>=P2783 + S2783+ V2783 + Y2783,\"\",\"La suma no puede ser mayor al total\")","v":""}]
[2703008,"Exodoncia de dientes retenidos","MAI",0,{"$nulls":4},0,{"$nulls":28},"CMen",{"v":33700,"d":"33,700"},0]
[2703009,"Injertos en boca","MAI",0,{"$nulls":4},0,{"$nulls":6},0,null,null,0,null,null,0,null,null,0,{"$nulls":12},"Cmay",{"v":136160,"d":"136,160"},0,{"$f":"IF(D2785>=P2785 + S2785+ V2785 + Y2785,\"\",\"La suma no puede ser mayor al total\")","v":""}]
[2703010,"Elevación de piso del seno maxilar","MAI",0,{"$nulls":4},0,{"$nulls":6},0,null,null,0,null,null,0,null,null,0,{"$nulls":12},"Cmay",{"v":118560,"d":"118,560"},0,""]
[2703011,"Plastía de fístula salival","MAI",0,{"$nulls":4},0,{"$nulls":28},"CMen",{"v":47010,"d":"47,010"},0]
[2703012,"Preparación quirúrgica de los maxilares con fines protésicos","MAI",0,{"$nulls":4},0,{"$nulls":28},"CMen",{"v":31160,"d":"31,160"},0]
[2703013,"Profundización de vestíbulo o reconstrucción de rebordes, con o sin injerto","MAI",0,{"$nulls":4},0,{"$nulls":6},0,null,null,0,null,null,0,null,null,0,{"$nulls":12},"Cmay",{"v":149940,"d":"149,940"},0,{"$f":"IF(D2789>=P2789 + S2789+ V2789 + Y2789,\"\",\"La suma no puede ser mayor al total\")","v":""}]
[2703014,"Reimplante y trasplante dentario","MAI",0,{"$nulls":4},0,{"$nulls":28},"CMen",{"v":33700,"d":"33,700"},0]
[2703015,"Remoción de cuerpo extraño y secuestrectomía","MAI",0,{"$nulls":4},0,{"$nulls":28},"CMen",{"v":33700,"d":"33,700"},0]
[2703016,"Sutura completa de herida mayor","MAI",0,{"$nulls":4},0,{"$nulls":28},"CMen",{"v":64360,"d":"64,360"},0]
[2703017,"Sutura completa de herida menor","MAI",0,{"$nulls":4},0,{"$nulls":28},"CMen",{"v":55950,"d":"55,950"},0]
[2703018,"Sutura simple de herida","MAI",0,{"$nulls":4},0,{"$nulls":28},"CMen",{"v":33700,"d":"33,700"},0]
[2703019,"Tratamiento quirúrgico fracturas maxilar superior","MAI",0,{"$nulls":4},0,{"$nulls":6},0,null,null,0,null,null,0,null,null,0,{"$nulls":12},"Cmay",{"v":179350,"d":"179,350"},0,{"$f":"IF(D2795>=P2795 + S2795+ V2795 + Y2795,\"\",\"La suma no puede ser mayor al total\")","v":""}]
[2703020,"Tratamiento quirúrgico de fracturas en maxilar inferior","MAI",0,{"$nulls":4},0,{"$nulls":6},0,null,null,0,null,null,0,null,null,0,{"$nulls":12},"Cmay",{"v":179350,"d":"179,350"},0,""]
[2703021,"Tratamiento de traumatismo dento alveolar simple","MAI",{"$f":"SUM(F2797:H2797)","v":0},{"$f":"SUM(F2797:G2797)","v":0},{"$nulls":32},"Proc",{"v":33700,"d":"33,700"},{"$f":"AM2797*F2797","v":0}]
[2703022,"Tratamiento de traumatismo dento alveolar complejo","MAI",{"$f":"SUM(F2798:H2798)","v":0},0,{"$nulls":32},"Proc",{"v":61990,"d":"61,990"},{"$f":"AM2798*F2798","v":0}]
[2703023,"Implante oseointegrado","MAI",0,{"$nulls":4},0,{"$nulls":6},0,null,null,0,null,null,0,null,null,0,{"$nulls":12},"Cmay",{"v":70120,"d":"70,120"},0,{"$f":"IF(D2799>=P2799 + S2799+ V2799 + Y2799,\"\",\"La suma no puede ser mayor al total\")","v":""}]
[2703024,"Pilar Protésico sobre Implantes","MAI",0,{"$nulls":4},0,{"$nulls":6},0,null,null,0,null,null,0,null,null,0,{"$nulls":12},"Cmay",{"v":31990,"d":"31,990"},0,""]
[null,"TOTAL",null,{"$f":"SUM(D2777:D2800)","v":0},{"$f":"SUM(E2777:E2800)","v":0},0,0,0,{"$f":"SUM(I2777:I2800)","v":0},0,0,0,0,0,0,0,0,0,0,0,0,0,0,0,0,0,0,0,0,0,0,0,0,0,0,0,0,0,{"v":1974630,"d":"1,974,630"},0]
[null,"Otras prestaciones odontológicas"]
[5099026,"Bloqueo Anestesico",null,{"$f":"SUM(E2803+H2803)","v":0},{"$f":"SUM(F2803:G2803)","v":0},{"$nulls":32},"Proc"]
[null,"Odontologia general",null,0,0]
[5099028,"Actividad interseptiva de anomalias dentomaxilares OPI",null,0,0,{"$nulls":32},"Act"]
[5099029,"Instalacion de aparato intercepcion de anomalias dentomaxilares",null,0,0,{"$nulls":32},"Proc"]
[5099030,"Examen diagnostico OPI",null,0,0,{"$nulls":32},"Exam"]
[5099031,"Alta mantencion ",null,0,0,{"$nulls":32},"Ctrl"]
[null,"Odontopediatria",null,0,0]
[5099032,"Corona metalica",null,{"$f":"SUM(E2810+H2810)","v":0},{"$f":"SUM(F2810:G2810)","v":0},{"$nulls":32},"Proc"]
[null,"Atención de niño discapacitado en sillón (acción de odontopediatría)",null,0,0,{"$nulls":32},"Aten"]
[null,"Atención de niño discapacitado en pabellón (acción de odontopediatría)",null,0,0,{"$nulls":32},"Aten"]
[null,"Ortodoncia",null,0,0]
[5099033,"Instalacion aparato removible ",null,0,0,{"$nulls":32},"Proc"]
[5099034,"Instalacion aparato ortopedia prequirurgica (fisura labiopalatina)",null,0,0,{"$nulls":32},"Proc"]
[5099035,"Ortopedia prequirurgica actividad (fisura labiopalatina)",null,0,0,{"$nulls":32},"Proc"]
[null,"Instalación Aparato Fijo en Ortodoncia. (Brackets)",null,0,0,{"$nulls":32},"Proc"]
[null,"Endodoncia",null,0,0]
[5099036,"Tratamiento de induccion al cierre",null,0,0,{"$nulls":32},"Proc"]
[5099037,"Desobturacion de conductos",null,0,0,{"$nulls":32},"Proc"]
[null,"Medicación intraconducto (acción de endodoncia)",null,0,0,{"$nulls":32},"Proc"]
[null,"Periodoncia",null,0,0]
[5099038,"Terapia articular especifica",null,0,0,{"$nulls":32},"Proc"]
[null,"Férula Periodoncia",null,0,0,{"$nulls":32},"Proc"]
[null,"Radiologia",null,0,0]
[5099041,"Telerradiografia perfil",null,0,0,{"$nulls":32},"ExIma"]
[5099042,"Telerradiografia frente",null,0,0,{"$nulls":32},"ExIma"]
[5099043,"Radiografia articulacion temporo mandibular",null,0,0,{"$nulls":32},"ExIma"]
[null,"Protesis",null,0,0]
[5099057,"instalacion aparotologia fija",null,0,0,{"$nulls":32},"Proc"]
[5099058,"instalacion protesis removible",null,0,0,{"$nulls":32},"Proc"]
[null,"Prótesis Removible Acrílica",null,0,0,{"$nulls":32},"Proc"]
[null,"Prótesis Removible Metálica",null,0,0,{"$nulls":32},"Proc"]
[null,"Instalación Aparato de Contención. ",null,0,0,{"$nulls":32},"Proc"]
[null,"Reparación de Prótesis. ",null,0,0,{"$nulls":32},"Proc"]
[null,"Prótesis Fija Provisoria (unitaria o Plural)",null,0,0,{"$nulls":32},"Proc"]
[null,"Tratamiento Traumatismo Dentoalveolar ",null,0,0,{"$nulls":32},"Proc"]
[null,"Instalación de Implante Endo-Oseo Oseointegrable. ",null,0,0,{"$nulls":32},"Proc"]
[null,"Tratamiento Temporo Mandibular ",null,0,0,{"$nulls":32},"Proc"]
[null,"Prevención odontológica niño discapacitado ",null,0,0,{"$nulls":32},"Proc"]
[null,"Tratamiento aparatología fija niños de 12 a 14 años año 1 ",null,0,0,{"$nulls":32},"Proc"]
[null,"Tratamiento aparatología fija niños de 12 a 14 años año 2 ",null,0,0,{"$nulls":32},"Proc"]
[null,"Obturaciones de vidrio Ionomero en diente temporal",null,0,0,{"$nulls":32},"Proc"]
[null,"Destartraje subgingival y Pulido radicular por Sextante",null,0,0,{"$nulls":32},"Proc"]
[null,"Desinfección Bucal Total",null,0,0,{"$nulls":32},"Proc"]
[null,"Traumatologia Maxilofacial",null,0,0]
[5099059,"Examen y diagnostico ttm eje I  ",null,0,0,{"$nulls":32},"ExIma"]
[5099060,"Examen y diagnostico ttm eje I y II montaje",null,0,0,{"$nulls":32},"ExIma"]
[null,"Trastornos Temporomandibular y dolor orofacial",null,0,0]
[5099039,"Terapia cognitiva conductual y autocontrol TTM (trastornos temporomandibulares)",null,0,0,{"$nulls":32},"Act"]
[null,"TOTAL",null,{"$f":"SUM(D2803:D2850)","v":0},{"$f":"SUM(E2803:E2850)","v":0},0,0,0,{"$nulls":19},0,0,0,0,0,0,0,0,0,0]
[null,"GRUPO 30 : LENTES,AUDIFONOS"]
[null,"LENTES Y AUDIFONOS                                          "]
[3001001,"Lentes ópticos","MAI",0,0,{"$nulls":32},"Act",{"v":21270,"d":"21,270"},{"$f":"AM2854*F2854","v":0}]
[3001002,"Audífonos","MAI",0,0,{"$nulls":32},"Act",{"v":266550,"d":"266,550"},{"$f":"AM2855*F2855","v":0}]
[null,"TOTAL",null,{"$f":"SUM(D2854:D2855)","v":0},{"$f":"SUM(E2854:E2855)","v":0},0,0,0,{"$nulls":19},0,0,0,0,0,0,0,0,0,0,0,{"v":287820,"d":"287,820"},0]
[null,"PROGRAMA NACIONAL DE DROGAS                              "]
[3002001,"Linfoma de Hodgkin","MAI",0,0,{"$nulls":32},"Proc",{"v":272260,"d":"272,260"},{"$f":"AM2858*F2858","v":0}]
[3002002,"Linfoma No Hodgkin no agresivo","MAI",0,0,{"$nulls":32},"Proc",{"v":38680,"d":"38,680"},0]
[3002003,"Linfoma No Hodgkin Intermedio","MAI",0,0,{"$nulls":32},"Proc",{"v":145940,"d":"145,940"},0]
[3002004,"Linfoma No Hodgkin, agresivo","MAI",0,0,{"$nulls":32},"Proc",{"v":145940,"d":"145,940"},0]
[3002005,"Leucemia linfoblastica","MAI",0,0,{"$nulls":32},"Proc",{"v":265680,"d":"265,680"},0]
[3002006,"Leucemia Aguda No linfática aguda y Leucemia Promielocítica","MAI",0,0,{"$nulls":32},"Proc",{"v":407720,"d":"407,720"},0]
[3002007,"Cáncer de Testículo y  Germinales extragonadales","MAI",0,0,{"$nulls":32},"Proc",{"v":695540,"d":"695,540"},0]
[3002008,"Enfermedad Trofoblástica Gestacional","MAI",0,0,{"$nulls":32},"Proc",{"v":144870,"d":"144,870"},0]
[3002033,"Rescate de Linfomas y Leucemias","MAI",0,0,{"$nulls":32},"Proc",{"v":390450,"d":"390,450"},0]
[3002034,"Cáncer de mama etapa I y II","MAI",0,0,{"$nulls":32},"Proc",{"v":164400,"d":"164,400"},0]
[3002135,"Cáncer de mama etapa III","MAI",0,0,{"$nulls":32},"Proc",{"v":142860,"d":"142,860"},0]
[3002136,"Cáncer de mama etapa IV","MAI",0,0,{"$nulls":32},"Proc",{"v":217200,"d":"217,200"},0]
[3002137,"Cáncer de mama etapa IV metástasis ósea","MAI",0,0,{"$nulls":32},"Proc",{"v":57150,"d":"57,150"},0]
[3002036,"Cáncer cervico uterino ","MAI",0,0,{"$nulls":32},"Proc",{"v":42710,"d":"42,710"},0]
[3002009,"Linfoma de Hodgkin","MAI",0,0,{"$nulls":32},"Proc",{"v":234230,"d":"234,230"},0]
[3002010,"Linfoma B y LLA-B","MAI",{"$f":"SUM(E2873+H2873)","v":0},{"$f":"SUM(F2873:G2873)","v":0},{"$nulls":32},"Proc",{"v":1393350,"d":"1,393,350"},0]
[3002011,"Linfoma Linfoblástico","MAI",0,0,{"$nulls":32},"Proc",{"v":210220,"d":"210,220"},0]
[3002012,"Leucemia linfoblástica aguda","MAI",0,0,{"$nulls":32},"Proc",{"v":185900,"d":"185,900"},0]
[3002013,"Leucemia Mieloide Aguda","MAI",0,0,{"$nulls":32},"Proc",{"v":377380,"d":"377,380"},0]
[3002014,"Neuroblastoma","MAI",0,0,{"$nulls":32},"Proc",{"v":1254930,"d":"1,254,930"},0]
[3002015,"Osteosarcoma","MAI",0,0,{"$nulls":32},"Proc",{"v":1289650,"d":"1,289,650"},0]
[3002016,"Sarcoma partes blandas","MAI",0,0,{"$nulls":32},"Proc",{"v":1021120,"d":"1,021,120"},0]
[3002017,"Ewing","MAI",0,0,{"$nulls":32},"Proc",{"v":1076160,"d":"1,076,160"},0]
[3002107,"Tumores germinales Extra Sistema Nerviso Central (Extra SNC)","MAI",0,0,{"$nulls":32},"Proc",{"v":424550,"d":"424,550"},0]
[3002020,"Tumor de Wilms","MAI",0,0,{"$nulls":32},"Proc",{"v":101670,"d":"101,670"},0]
[3002021,"Retinoblastoma","MAI",0,0,{"$nulls":32},"Proc",{"v":303320,"d":"303,320"},0]
[3002022,"Histiocitosis","MAI",0,0,{"$nulls":32},"Proc",{"v":85770,"d":"85,770"},0]
[3002024,"Recaída tumores sólidos","MAI",0,0,{"$nulls":32},"Proc",{"v":1473700,"d":"1,473,700"},0]
[3002025,"Hepatoblastomas","MAI",0,0,{"$nulls":32},"Proc",{"v":344590,"d":"344,590"},0]
[3002026,"Leucemias mieloide crónica","MAI",0,0,{"$nulls":32},"Proc",{"v":1154370,"d":"1,154,370"},0]
[3002126,"Recidiva de Leucemia Mieloide","MAI",0,0,{"$nulls":32},"Proc",{"v":706700,"d":"706,700"},0]
[3002027,"Recidiva de leucemias Linfoblasticas","MAI",0,0,{"$nulls":32},"Proc",{"v":576720,"d":"576,720"},0]
[3002028,"Méduloblastomas","MAI",0,0,{"$nulls":32},"Proc",{"v":310880,"d":"310,880"},{"$f":"AM2890*F2890","v":0}]
[3002029,"Tumores en < de 3 años","MAI",0,0,{"$nulls":32},"Proc",{"v":181250,"d":"181,250"},0]
[3002030,"Glioma","MAI",0,0,{"$nulls":32},"Proc",{"v":437960,"d":"437,960"},0]
[3002031,"Astrocitoma","MAI",0,0,{"$nulls":32},"Proc",{"v":453850,"d":"453,850"},0]
[3002032,"Tumor Germinal SNC","MAI",0,0,{"$nulls":32},"Proc",{"v":283600,"d":"283,600"},0]
[3002023,"Cuidados Paliativos y Alivio del Dolor en Cáncer Terminal (en adultos o niños)","MAI",0,0,{"$nulls":32},"Proc",{"v":38560,"d":"38,560"},0]
[null,"TOTAL",null,{"$f":"SUM(D2858:D2895)","v":0},{"$f":"SUM(E2858:E2895)","v":0},0,0,0,{"$nulls":19},0,0,0,0,0,0,0,0,0,0,0,{"v":17051830,"d":"17,051,830"},0]
[null,"Programa cáncer"]
[null,"Test Inmunoquímico de Deposiciones",null,0,0,{"$nulls":32},"Proc"]
[null,"Yodoterapia",null,0,0,{"$nulls":32},"Proc"]
[null," Braquiterapia alta tasa en dosis (HDR)",null,0,0,{"$nulls":32},"Proc"]
[null," Braquiterapia baja tasa en dosis (LDR)",null,0,0,{"$nulls":32},"Proc"]
[null," Teleterapia de alta complejidad con acelerador lineal (3D)",null,0,0,{"$nulls":32},"Proc"]
[null," Teleterapia estándar (3D) con acelerador lineal ",null,0,0,{"$nulls":32},"Proc"]
[null," Telecobaltoterapia con acelerador lineal",null,0,0,{"$nulls":32},"Proc"]
[null,"TOTAL",null,{"$f":"SUM(D2898:D2904)","v":0},{"$f":"SUM(E2898:E2904)","v":0},0,0,0,{"$nulls":19},0,0,0,0,0,0,0,0,0,0]
[null,"OTROS"]
[3002037," Recidiva cáncer cervicouterino ",null,0,0,{"$nulls":32},"Proc"]
[3002040," Cáncer colon recidiva ",null,0,0,{"$nulls":32},"Proc"]
[3002042," Cáncer anal ",null,0,0,{"$nulls":32},"Proc"]
[3002134," Cáncer rectal ",null,0,0,{"$nulls":32},"Proc"]
[3002160," Mieloma múltiple ",null,0,0,{"$nulls":32},"Proc"]
[3002205," Leucemia linfoblástica crónica",null,0,0,{"$nulls":32},"Proc"]
[3002234," Cáncer colon   ",null,0,0,{"$nulls":32},"Proc"]
[3002401," Cáncer gástrico  pre-operatorio  ",null,0,0,{"$nulls":32},"Proc"]
[3002402," Cáncer gástrico  post-operatorio ",null,0,0,{"$nulls":32},"Proc"]
[3102136," Cáncer ovario epitelial ",null,0,0,{"$nulls":32},"Proc"]
[3102138," Cáncer ovario recurrente resistente a platino ",null,0,0,{"$nulls":32},"Proc"]
[3104002," Mama hormonoterapia ",null,0,0,{"$nulls":32},"Proc"]
[3106002," Hormonoterapia  reemplazo ",null,0,0,{"$nulls":32},"Proc"]
[3106102," Cáncer próstata ",null,0,0,{"$nulls":32},"Proc"]
[3201137," Cáncer vesical ",null,0,0,{"$nulls":32},"Proc"]
[8014001," Cáncer mama trastuzumab",null,0,0,{"$nulls":32},"Proc"]
[null," Quimioterapia Intervencional",null,0,0,{"$nulls":32},"Proc"]
[null," Quimioterapia Intratecal",null,0,0,{"$nulls":32},"Proc"]
[null,"TOTAL",null,{"$f":"SUM(D2907:D2924)","v":0},{"$f":"SUM(E2907:E2924)","v":0},0,0,0,{"$nulls":19},0,0,0,0,0,0,0,0,0,0,0]
[null,"TRATAMIENTO ABREVIADO DE LA TUBERCULOSIS     "]
[3003001,"TBC, esquema primario (mensual)","MAI",0,0,{"$nulls":32},"Proc",{"v":7590,"d":"7,590"},{"$f":"AM2927*F2927","v":0}]
[3003002,"TBC, esquema primario simplificado (mensual)","MAI",0,0,{"$nulls":32},"Proc",{"v":4040,"d":"4,040"},{"$f":"AM2928*F2928","v":0}]
[3003003,"TBC, esquema secundario (mensual)","MAI",0,0,{"$nulls":32},"Proc",{"v":15220,"d":"15,220"},{"$f":"AM2929*F2929","v":0}]
[3003004,"TBC, esquema normado de retratamiento (mensual)","MAI",0,0,{"$nulls":32},"Proc",{"v":156140,"d":"156,140"},{"$f":"AM2930*F2930","v":0}]
[3003005,"TBC, esquema especial de retratamiento (mensual)","MAI",0,0,{"$nulls":32},"Proc",{"v":857590,"d":"857,590"},{"$f":"AM2931*F2931","v":0}]
[null,"TOTAL",null,{"$f":"SUM(D2927:D2931)","v":0},{"$f":"SUM(E2927:E2931)","v":0},0,0,0,{"$nulls":19},0,0,0,0,0,0,0,0,0,0,0,{"v":1040580,"d":"1,040,580"},0]
[null,"Otros Exámenes  de Laboratorio"]
[5099117,"Examen: Carga viral Hepatitis B por técnica de PCR",null,0,0,{"$nulls":32},"ExLab"]
[5099118,"Examen: Carga Viral Hepatitis C por técnica de PCR",null,0,0,{"$nulls":32},"ExLab"]
[5099119,"Examen: Carga Viral VIH por técnica de PCR",null,0,0,{"$nulls":32},"ExLab"]
[5099120,"Examen: PCR detección y genotipo Virus papiloma huma (HPV)",null,0,0,{"$nulls":32},"ExLab"]
[5099121,"Examen: PCR Traslocación t(9:22) cromosoma Filadelfia",null,0,0,{"$nulls":32},"ExLab"]
[5099122,"Examen: PCR Traslocación t(15:17) gen de fusión PML-RARA",null,0,0,{"$nulls":32},"ExLab"]
[5099123,"Examen: PCR Bordetella Pertussis",null,0,0,{"$nulls":32},"ExLab"]
[5099124,"Examen: PCR Mycoplasma",null,{"$f":"SUM(E2941+H2941)","v":0},{"$f":"SUM(F2941:G2941)","v":0},{"$nulls":32},"ExLab"]
[5099125,"Examen: PCR Chlamydia",null,0,0,{"$nulls":32},"ExLab"]
[5099126,"Examen: PCR Clostridium difficile",null,0,0,{"$nulls":32},"ExLab"]
[5099127,"Examen: PCR otros virus respiratorios: Metaneumovirus, Bocavirus, VRS, Coronavirus, Enterovirus, Parainfluenza A, Parainfluenza B, Rhinovirus, Adenovirus. ",null,0,0,{"$nulls":32},"ExLab"]
[5099128,"Examen: Detección genes BRCA1 y BRCA2 (cáncer de mamas)",null,0,0,{"$nulls":32},"ExLab"]
[5099129,"Examen: Determinación Toxina Clostridium difficile",null,0,0,{"$nulls":32},"ExLab"]
[5099130,"Examen: Virus HANTA (Técnica de PCR)",null,0,0,{"$nulls":32},"ExLab"]
[5099131,"Examen: Virus HANTA (Detección de IgM))",null,0,0,{"$nulls":32},"ExLab"]
[5099132,"Examen: HELICOBACTER PILORY (test de ureasa)",null,0,0,{"$nulls":32},"ExLab"]
[5099133,"Examen: Anticuerpos anti Helicobacter pylori",null,0,0,{"$nulls":32},"ExLab"]
[5099134,"Examen: Bartonella (Anticuerpos IgG e IgM)",null,0,0,{"$nulls":32},"ExLab"]
[5099135,"Examen: SEROTIPICACION (ESCHERICHIA COLI, SALMONELLA, SHIGELLA)",null,0,0,{"$nulls":32},"ExLab"]
[5099136,"Examen: BORDETELLA POR  Inmunofluorescencia",null,0,0,{"$nulls":32},"ExLab"]
[5099137,"Examen: Prealbúmina",null,0,0,{"$nulls":32},"ExLab"]
[5099138,"Examen: Mioglobina",null,0,0,{"$nulls":32},"ExLab"]
[5099139,"Examen: NT-proBNP",null,0,0,{"$nulls":32},"ExLab"]
[5099140,"Examen: Procalcitonina",null,0,0,{"$nulls":32},"ExLab"]
[5099141,"Examen: Aminoácidos en sangre",null,0,0,{"$nulls":32},"ExLab"]
[5099142,"Examen: Plomo ",null,0,0,{"$nulls":32},"ExLab"]
[5099143,"Examen: Oxalatos en orina",null,0,0,{"$nulls":32},"ExLab"]
[5099144,"Examen: Citratos en orina",null,0,0,{"$nulls":32},"ExLab"]
[5099145,"Examen: Aminoácidos en orina (cuantitativa)",null,0,0,{"$nulls":32},"ExLab"]
[5099146,"Examen: Viscosidad sanguínea",null,0,0,{"$nulls":32},"ExLab"]
[5099147,"Examen: INR capilar por técnica electroquímica",null,0,0,{"$nulls":32},"ExLab"]
[5099148,"Examen: Péptido C",null,0,0,{"$nulls":32},"ExLab"]
[5099149,"Examen: Anticuerpos antiendomiso",null,0,0,{"$nulls":32},"ExLab"]
[5099150,"Examen: Anticuerpos antigliadina",null,0,0,{"$nulls":32},"ExLab"]
[5099151,"Examen: MIELOPEROXIDASA (MPO)",null,0,0,{"$nulls":32},"ExLab"]
[5099152,"Examen: PROTEINASA (PR3)",null,0,0,{"$nulls":32},"ExLab"]
[5099153,"Examen: ANTI-B2 GLICOPROTEINA I IgG",null,0,0,{"$nulls":32},"ExLab"]
[5099154,"Examen: ANTIC. ANTI PEROXIDASA",null,0,0,{"$nulls":32},"ExLab"]
[5099155,"Examen: OXCARBAZEPINA",null,0,0,{"$nulls":32},"ExLab"]
[5099156,"Examen: COCAINA-MARIHUANA-ANFETAMINAS c/u",null,0,0,{"$nulls":32},"ExLab"]
[5099157,"Examen: ANT.ANTIPEPTIDO CITRULINADO",null,0,0,{"$nulls":32},"ExLab"]
[5099158,"Examen: Calcitonina",null,0,0,{"$nulls":32},"ExLab"]
[5099159,"Examen: Enolasa (NSE)",null,0,0,{"$nulls":32},"ExLab"]
[5099160,"Examen: Antígeno inhibidor del melanoma (MIA)",null,0,0,{"$nulls":32},"ExLab"]
[5099161,"Examen: Antígeno asociado a los carcinomas escamosos (SCCA- y SSCA-2)",null,0,0,{"$nulls":32},"ExLab"]
[5099162,"Examen: CYFRA  21.1",null,0,0,{"$nulls":32},"ExLab"]
[5099163,"Examen: HER-2/neu",null,0,0,{"$nulls":32},"ExLab"]
[5099164,"Examen: He4 Proteína 4 Del Epididimo Humano",null,0,0,{"$nulls":32},"ExLab"]
[5099165,"Examen: Ki65",null,0,0,{"$nulls":32},"ExLab"]
[5099166,"Examen: TAG-72 Glicoproteína 72 asociada a tumores",null,0,0,{"$nulls":32},"ExLab"]
[5099167,"Examen: TRAB.=ANTIC.ANTIRECEPTOR TSH",null,0,0,{"$nulls":32},"ExLab"]
[5099168,"Examen: ANTI-B2 GLICOPROTEINA I IgM",null,0,0,{"$nulls":32},"ExLab"]
[5099169,"Examen: Dímero D",null,0,0,{"$nulls":32},"ExLab"]
[5099170,"Examen: Marcadores inmunológicos en Diabetes (anticuerpo anti-islote pancreatico: ICA, Ac. Antiinsulina, Antic. Antidecarboxilasa del ác. Glutamico,  Antic. Anti ICA512",null,0,0,{"$nulls":32},"ExLab"]
[5099171,"Examen: Parvovirus B19 IgG, Ig M",null,0,0,{"$nulls":32},"ExLab"]
[5099172,"Examen: PCR parvovirus B19",null,0,0,{"$nulls":32},"ExLab"]
[5099173,"Examen: Metanefrinas (plasmáticas y urinarias)",null,0,0,{"$nulls":32},"ExLab"]
[5099174,"Examen: Antígeno prostático Libre",null,0,0,{"$nulls":32},"ExLab"]
[5099175,"Examen: Anticuerpos antifosfolípidos",null,0,0,{"$nulls":32},"ExLab"]
[5099176,"Examen: Anticuerpos antiplaquetarios",null,0,0,{"$nulls":32},"ExLab"]
[5099177,"Examen: Homocysteina total ",null,0,0,{"$nulls":32},"ExLab"]
[5099178,"Examen: Anticuerpo antiproteína P ribosomal",null,0,0,{"$nulls":32},"ExLab"]
[5099179,"Examen: Antifungigrama para levaduras",null,0,0,{"$nulls":32},"ExLab"]
[5099180,"Examen: Anticuerpo antineumococo",null,0,0,{"$nulls":32},"ExLab"]
[5099181,"Examen: Anticuerpo antisaccharomyces cerevisiae (ASCA)",null,0,0,{"$nulls":32},"ExLab"]
[5099182,"Examen: Antigeno Urinario para Legionella y Neumococo",null,0,0,{"$nulls":32},"ExLab"]
[5099183,"Examen: Triptasa serica",null,0,0,{"$nulls":32},"ExLab"]
[5099184,"Examen: Test de nugent (cortisol serico post dexametasona)",null,0,0,{"$nulls":32},"ExLab"]
[5099185,"Examen: PCR Toxoplasmosis",null,0,0,{"$nulls":32},"ExLab"]
[5099186,"Examen: PCR Streptococcus Agalactiae",null,0,0,{"$nulls":32},"ExLab"]
[5099187,"Examen: Arilsulfatasa (A y B)",null,0,0,{"$nulls":32},"ExLab"]
[5099188,"Examen: Hexosaminidasa  (A y B)",null,{"$f":"SUM(E3005+H3005)","v":0},{"$f":"SUM(F3005:G3005)","v":0},{"$nulls":32},"ExLab"]
[5099189,"Examen: Hexosaminidasa  Total",null,0,0,{"$nulls":32},"ExLab"]
[null,"Cobre orina",null,0,0,{"$nulls":32},"ExLab"]
[null,"Dihidrotestosterona",null,0,0,{"$nulls":32},"ExLab"]
[null,"Factor II protrombina 20210 G>A, mutación",null,0,0,{"$nulls":32},"ExLab"]
[null,"Factor V Leiden, mutación",null,0,0,{"$nulls":32},"ExLab"]
[null,"Oxalato sangre",null,0,0,{"$nulls":32},"ExLab"]
[null,"Hepatitis B, detección por PCR-RT",null,0,0,{"$nulls":32},"ExLab"]
[null,"Pneumocystis Jirovecii (carinii) por PCR-RT",null,0,0,{"$nulls":32},"ExLab"]
[null,"Neisseria gonorrhoeae por PCR-RT",null,0,0,{"$nulls":32},"ExLab"]
[null,"Virus papiloma humano PCR",null,0,0,{"$nulls":32},"ExLab"]
[null,"Bordetella parapertussis por PCR-RT",null,0,0,{"$nulls":32},"ExLab"]
[null,"Streptococcus grupo B (Agalactiae) por PCR-RT",null,0,0,{"$nulls":32},"ExLab"]
[null,"Mycobacterium tuberculosis por PCR-RT",null,0,0,{"$nulls":32},"ExLab"]
[null,"Toxoplasmosis Gondii por PCR-RT",null,0,0,{"$nulls":32},"ExLab"]
[null,"Zinc en sangre",null,0,0,{"$nulls":32},"ExLab"]
[null,"Zinc en orina",null,0,0,{"$nulls":32},"ExLab"]
[null,"Procalcitonina",null,0,0,{"$nulls":32},"ExLab"]
[null,"Quimico de líquido ascítico",null,0,0,{"$nulls":32},"ExLab"]
[null,"Quimico en líquido cefalorraquídeo",null,0,0,{"$nulls":32},"ExLab"]
[null,"Translocación t(9;22) bcr/abl p210, diagnóstico",null,0,0,{"$nulls":32},"ExLab"]
[null,"Translocacion t(9;22) bcr/abl p190, diagnóstico",null,0,0,{"$nulls":32},"ExLab"]
[null,"Translocación t(15;17) pml/rara, diagnóstico",null,0,0,{"$nulls":32},"ExLab"]
[null,"Translocacion t(12;21) tel- aml1, diagnóstico",null,0,0,{"$nulls":32},"ExLab"]
[null,"Translocación t(8;21) aml1/eto, diagnóstico",null,0,0,{"$nulls":32},"ExLab"]
[null,"Translocacion inv(16) cbfb-myh11, diagnóstico",null,0,0,{"$nulls":32},"ExLab"]
[null,"Translocación t(4;11) mll/af4, diagnóstico  ",null,0,0,{"$nulls":32},"ExLab"]
[null,"Translocación t(1;19) e2a/pbx-1,diagnóstico   ",null,0,0,{"$nulls":32},"ExLab"]
[null,"Mutación jak-2 (v617f)",null,0,0,{"$nulls":32},"ExLab"]
[null,"Mutación flt3-itd",null,0,0,{"$nulls":32},"ExLab"]
[null,"Mutación a del exón 12 de npm1",null,0,0,{"$nulls":32},"ExLab"]
[null," Mutación t315i",null,0,0,{"$nulls":32},"ExLab"]
[null,"Translocación t(9;22) bcr/abl p210, seguimiento, cuantitativa",null,0,0,{"$nulls":32},"ExLab"]
[null,"5-hiaa urinario 24 horas con creatinina ",null,0,0,{"$nulls":32},"ExLab"]
[null,"Calcitonina",null,0,0,{"$nulls":32},"ExLab"]
[null,"Peptido Natriurético Tipo B  ( PRO-BNP)",null,0,0,{"$nulls":32},"ExLab"]
[null,"Peptido c basal",null,0,0,{"$nulls":32},"ExLab"]
[null,"Cortisol post acth",null,0,0,{"$nulls":32},"ExLab"]
[null,"Cortisol post dexametasona",null,0,0,{"$nulls":32},"ExLab"]
[null,"Cortisol salival",null,0,0,{"$nulls":32},"ExLab"]
[null,"Indice androgénico libre",null,0,0,{"$nulls":32},"ExLab"]
[null,"Pneumocystis jiroveci en lavado bronco alveolar",null,0,0,{"$nulls":32},"ExLab"]
[null,"Elispot para tbc",null,0,0,{"$nulls":32},"ExLab"]
[null,"Galactomanano",null,0,0,{"$nulls":32},"ExLab"]
[null,"Serologia bartonella ",null,0,0,{"$nulls":32},"ExLab"]
[null,"Dimero D",null,0,0,{"$nulls":32},"ExLab"]
[null,"Pre albumina ",null,0,0,{"$nulls":32},"ExLab"]
[null,"Toxina clostridium difficile",null,0,0,{"$nulls":32},"ExLab"]
[null,"Cartridge para Troponina",null,0,0,{"$nulls":32},"ExLab"]
[null,"Cartridge Multiple",null,0,0,{"$nulls":32},"ExLab"]
[null,"TOTAL",null,{"$f":"SUM(D2934:D3052)","v":0},{"$f":"SUM(E2934:E3052)","v":0},{"$f":"SUM(F2934:F3052)","v":0},{"$f":"SUM(G2934:G3052)","v":0},{"$f":"SUM(H2934:H3052)","v":0},{"$nulls":19},{"$f":"SUM(AB2934:AB3052)","v":0},{"$f":"SUM(AC2934:AC3052)","v":0},{"$f":"SUM(AD2934:AD3052)","v":0},{"$f":"SUM(AE2934:AE3052)","v":0},0,0,0,0,0,0]

{"sheet":"B17","index":2,"n_rows":512,"n_cols":28,"rows_kept":512,"merged":[[7,0,7,2],[68,0,68,1],[69,0,69,1],[75,0,78,0],[83,0,83,1],[87,0,90,0],[94,0,94,4],[122,0,122,1],[196,0,197,0],[212,0,212,1],[257,0,257,1],[267,0,267,1],[272,0,272,1],[279,0,279,1],[291,0,291,1],[318,0,320,1],[318,2,320,2],[318,3,318,6],[318,7,318,9],[318,10,318,12],[318,13,320,13],[318,14,318,15],[318,16,320,16],[319,3,320,3],[319,4,319,5],[319,6,320,6],[319,7,320,7],[319,8,320,8],[319,9,320,9],[319,10,320,10],[319,11,320,11],[319,12,320,12],[319,14,320,14],[319,15,320,15],[321,0,321,1],[327,0,330,0],[335,0,335,1],[339,0,342,0],[346,0,346,1],[348,0,350,1],[348,2,350,2],[348,3,348,6],[348,7,348,9],[348,10,348,12],[348,13,350,13],[348,14,348,15],[348,16,350,16],[349,3,350,3],[349,4,349,5],[349,6,350,6],[349,7,350,7],[349,8,350,8],[349,9,350,9],[349,10,350,10],[349,11,350,11],[349,12,350,12],[349,14,350,14],[349,15,350,15],[353,0,353,1],[354,0,354,1],[356,0,356,1],[358,0,358,1],[359,0,359,1],[360,0,360,1],[361,0,361,1],[363,0,365,1],[363,2,365,2],[363,3,363,6],[363,7,363,9],[363,10,363,12],[363,13,365,13],[363,14,363,15],[363,16,365,16],[364,3,365,3],[364,4,364,5],[364,6,365,6],[364,7,365,7],[364,8,365,8],[364,9,365,9],[364,10,365,10],[364,11,365,11],[364,12,365,12],[364,14,365,14],[364,15,365,15],[374,0,374,1],[375,0,375,1],[376,0,378,1],[376,2,378,2],[376,3,378,3],[376,4,376,9],[376,10,378,10],[376,11,377,13],[376,14,378,14],[376,15,377,16],[376,17,378,17],[377,4,377,6],[377,7,377,9],[392,0,395,0],[399,0,399,1],[400,0,400,5],[401,0,402,1],[401,2,402,2],[401,3,402,3],[401,4,402,4],[401,5,402,5],[403,0,403,1],[404,0,404,1],[405,0,406,0],[407,0,407,1],[408,0,409,1],[408,2,409,2],[408,3,409,3],[410,0,410,1],[411,0,411,1],[412,0,412,1],[413,0,415,1],[413,2,415,2],[413,3,413,6],[413,7,413,9],[413,10,413,12],[413,13,415,13],[413,14,413,15],[413,16,415,16],[414,3,415,3],[414,4,414,5],[414,6,415,6],[414,7,415,7],[414,8,415,8],[414,9,415,9],[414,10,415,10],[414,11,415,11],[414,12,415,12],[414,14,415,14],[414,15,415,15],[416,0,418,0],[423,0,425,0],[426,0,428,0],[430,0,432,0],[433,0,435,0],[437,0,439,0],[441,0,443,1],[441,2,443,2],[441,3,443,3],[444,0,444,1],[445,0,445,1],[446,0,446,1],[447,0,447,1],[448,0,448,1],[449,0,449,1],[450,0,450,1],[451,0,451,1],[452,0,452,1],[453,0,453,1],[454,0,454,1],[455,0,455,1],[457,0,458,1],[457,2,458,2],[459,0,459,1],[462,0,463,0],[464,0,464,1],[466,0,467,1],[466,2,467,2],[466,3,466,8],[466,9,467,9],[468,0,468,1],[469,0,469,1],[470,0,470,1],[472,0,472,1],[473,0,475,0],[477,0,477,1],[478,0,478,1],[479,0,479,1],[482,0,483,1],[482,2,483,2],[482,3,483,3],[482,4,483,4],[484,0,484,1],[503,0,504,1],[503,2,504,2],[503,3,504,3],[505,0,505,1],[506,0,506,1],[507,0,507,1],[508,0,508,1],[509,0,509,1],[510,0,510,1],[511,0,511,1]]}
["SERVICIO DE SALUD / ESTABLECIMIENTO MUNICIPAL"]
[{"$f":"CONCATENATE(\"COMUNA: \",NOMBRE!B2,\" - \",\"( \",NOMBRE!C2,NOMBRE!D2,NOMBRE!E2,NOMBRE!F2,NOMBRE!G2,\" )\")","v":"COMUNA:  - (  )"}]
[{"$f":"CONCATENATE(\"ESTABLECIMIENTO/ESTRATEGIA: \",NOMBRE!B3,\" - \",\"( \",NOMBRE!C3,NOMBRE!D3,NOMBRE!E3,NOMBRE!F3,NOMBRE!G3,NOMBRE!H3,\" )\")","v":"ESTABLECIMIENTO/ESTRATEGIA:  - (  )"}]
[{"$f":"CONCATENATE(\"MES: \",NOMBRE!B6,\" - \",\"( \",NOMBRE!C6,NOMBRE!D6,\" )\")","v":"MES:  - (  )"}]
[{"$f":"CONCATENATE(\"AÑO: \",NOMBRE!B7)","v":"AÑO: 2017"}]
[{"$nulls":3},"REM-B17.   ACTIVIDADES DE APOYO DIAGNOSTICO y TERAPEUTICO"]
["PARTE I"]
["SECCION A: ATENCIONES ABIERTAS "]
["CODIGOS","IDENTIFICACION DE PRESTACIONES","TOTAL PRODUCCIÓN","TOTAL BENEFICIARIOS MAI","PAGO POR PRESTACIONES ($)"]
[null,"CONSULTAS Y ATENCION MEDICA ",{"$f":"SUM(C11:C23)","v":0},{"$f":"SUM(D11:D23)","v":0},{"$f":"SUM(E11:E23)","v":0}]
["0101101","Consulta o control médico integral en atención primaria",{"$f":"VLOOKUP(A11,tabla1,4,FALSE)","v":0},{"$f":"VLOOKUP(A11,tabla3,6,FALSE)","v":0},{"$f":"VLOOKUP(A11,tabla1,40,FALSE)","v":0}]
["0101102","Consulta o control médico integral en especialidades (Hosp. Mediana Complejidad)",{"$f":"VLOOKUP(A12,tabla1,4,FALSE)","v":0},0,0]
["0101103","Consulta médica integral en servicio de urgencia (Hosp. Alta Complejidad)",0,0,0]
["0101104","Consulta médica integral en C.R.S.",0,0,0]
["0101105","Consulta médica integral en servicio de urgencia (Hosp. Mediana Complejidad)",0,0,0]
["0101106","Asistencia de cardiólogo a cirugías no cardíacas",0,0,0]
["0101107","Atención médica del recién nacido",0,0,0]
["0101108","Consulta integral de especialidades en Cirugía, Ginecología y Obstetricia, Ortopedia y Traumatología (en CDT)",0,0,0]
["0101109","Consulta integral de especialidades en Urología, Otorrinolaringología, Medicina Fisica y Rehabilitación, Dermatología, Pediatría y Subespecialidades (en CDT)",0,0,0]
["0101110","Consulta integral de especialidades en Medicina Interna y Subespecialidades, Oftalmología, Neurología, Oncología (en CDT)",0,0,0]
["0101111","Consulta integral de especialidades en Cirugía, Ginecología y Obstetricia, Ortopedia y Traumatología (Hosp. Alta Complejidad)",0,0,0]
["0101112","Consulta integral de especialidades en Urología, Otorrinolaringología, Medicina Física y Rehabilitación, Dermatología, Pediatría y Subespecialidades (Hosp. Alta Complejidad)",0,0,0]
["0101113","Consulta integral de especialidades en Medicina Interna y Subespecialidades, Oftalmología, Neurología, Oncología (Hosp. Alta Complejidad)",0,0,0]
["0903006","Consultoría de salud mental por psiquiatra (sesión 4 hrs.) (mínimo 8 pacientes)",{"$f":"B!D1108","v":0},{"$f":"B!F1108","v":0},{"$f":"B!AN1108","v":0}]
[null,"OTRAS CONSULTAS Y ATENCION MEDICA",{"$f":"SUM(C26:C30)","v":0}]
["0101001","Consulta médica general",{"$f":"VLOOKUP(B26,tabla2,3,FALSE)","v":0}]
[null,"Consultas de urgencia en Hospitales de baja complejidad",{"$f":"VLOOKUP(B27,tabla2,3,FALSE)","v":0}]
[null,"Consultas de especialidad en hospitales de baja complejidad y establecimientos de APS",{"$f":"VLOOKUP(B28,tabla2,3,FALSE)","v":0}]
[null,"Otras consulta médica de especialidades ",{"$f":"VLOOKUP(B29,tabla2,3,FALSE)","v":0}]
[null,"Consulta médica de especialidad en servicio de urgencia",{"$f":"VLOOKUP(B30,tabla2,3,FALSE)","v":0}]
[null,"CONSULTAS POR OTROS PROFESIONALES DE LA SALUD",{"$f":"SUM(C32:C42)","v":0},{"$f":"SUM(D32:D42)","v":0},{"$f":"SUM(E32:E47)","v":0}]
["0102001","Consulta o control por enfermera, matrona o nutricionista",{"$f":"B!$D$27","v":0},{"$f":"B!$F$27","v":0},{"$f":"B!$AN$27","v":0}]
["0102002","Control de salud niño con EDP por enfermera",{"$f":"B!$D$28","v":0},{"$f":"B!$F$28","v":0},{"$f":"B!$AN$28","v":0}]
["0102003","Consulta o control por auxiliar de enfermería",{"$f":"B!$D$29","v":0},{"$f":"B!$F$29","v":0},{"$f":"B!$AN$29","v":0}]
["0102005","Consulta por fonoaudiólogo",{"$f":"B!$D$30","v":0},{"$f":"B!$F$30","v":0},{"$f":"B!$AN$30","v":0}]
["0102006","Atención kinesiológica integral ambulatoria",{"$f":"B!$D$31","v":0},{"$f":"B!$F$31","v":0},{"$f":"B!$AN$31","v":0}]
["0102007","Atención integral por terapeuta ocupacional",{"$f":"B!$D$32","v":0},{"$f":"B!$F$32","v":0},{"$f":"B!$AN$32","v":0}]
["0903002","Consulta o control psicológico clínico",{"$f":"B!$D$1104","v":0},{"$f":"B!$F$1104","v":0},{"$f":"B!$AN$1104","v":0}]
["0903003","Consulta de salud mental por otros profesionales",{"$f":"B!$D$1105","v":0},{"$f":"B!$F$1105","v":0},{"$f":"B!$AN$1105","v":0}]
["0903004","Intervención psicosocial grupal (4 a 8 pacientes, familiares o cuidadores)",{"$f":"B!$D$1106","v":0},{"$f":"B!$F$1106","v":0},{"$f":"B!$AN$1106","v":0}]
["0903005","Psicoterapia de grupo (por psicólogo o psiquiatra) (4 a 8 pacientes)",{"$f":"B!$D$1107","v":0},{"$f":"B!$F$1107","v":0},{"$f":"B!$AN$1107","v":0}]
["0903001","Consulta de psiquiatría",{"$f":"B!$D$1103","v":0},{"$f":"B!$F$1103","v":0},{"$f":"B!$AN$1103","v":0}]
[null,"OTRAS CONSULTAS Y ATENCION MEDICA",{"$f":"SUM(C44:C47)","v":0}]
[null,"Consulta por otros profesionales ",{"$f":"B!$D$34","v":0}]
[null,"Consultas/ Controles de Especialidades Odontológica",{"$f":"B!$D$35","v":0}]
[null,"Consultas de morbilidad odontológica",{"$f":"B!$D$36","v":0}]
[null,"Consultas de urgencia odontológica",{"$f":"B!$D$37","v":0}]
[null,"PROGRAMAS DE REHABILITACION",{"$f":"SUM(C49:C50)","v":0},{"$f":"SUM(D49:D50)","v":0},{"$f":"SUM(E49:E50)","v":0}]
["0903007","Programa de rehabilitación tipo 1 (mensual, grupo 6 a 10 pers.)",{"$f":"B!$D$1109","v":0},{"$f":"B!$F$1109","v":0},{"$f":"B!$AN$1109","v":0}]
["0903008","Programa de rehabilitación tipo 2 (mensual, grupo 5 a 7 pers.)",{"$f":"B!$D$1110","v":0},{"$f":"B!$F$1110","v":0},{"$f":"B!$AN$1110","v":0}]
[null,"OTROS PROGRAMAS",{"$f":"C52","v":0}]
["0901003","Electroshocks e insulino-terapia (efectuada y controlada por el médico psiquiatra, incluye trat. de las complicaciones medicas, c/s miorrelajantes); cada sesión (max.6)",{"$f":"B!$D$1081","v":0}]
[null,"EDUCACION DE GRUPO",{"$f":"SUM(C54:C57)","v":0},{"$f":"SUM(D54:D57)","v":0},{"$f":"SUM(E54:E57)","v":0}]
["0103001","Educación de grupo por médico",{"$f":"B!$D$41","v":0},{"$f":"B!$F$41","v":0},{"$f":"B!$AN$41","v":0}]
["0103002","Educación de grupo por enfermera, matrona o nutricionista",{"$f":"B!$D$42","v":0},{"$f":"B!$F$42","v":0},{"$f":"B!$AN$42","v":0}]
["0103003","Educación de grupo por asistente social",{"$f":"B!$D$43","v":0},{"$f":"B!$F$43","v":0},{"$f":"B!$AN$43","v":0}]
["0103004","Educación de grupo por auxiliar de enfermería",{"$f":"B!$D$44","v":0},{"$f":"B!$F$44","v":0},{"$f":"B!$AN$44","v":0}]
[null,"OTRA EDUCADION DE GRUPO",{"$f":"C59","v":0}]
[null,"Educación de grupo por otro integrante del equipo de salud",{"$f":"B!$D$46","v":0}]
[null,"VISITAS DOMICILIARIAS",{"$f":"SUM(C61:C63)","v":0},{"$f":"SUM(D61:D63)","v":0},{"$f":"SUM(E61:E63)","v":0}]
["0104001","Visita a domicilio por enfermera, matrona o nutricionista",{"$f":"B!$D$50","v":0},{"$f":"B!$F$50","v":0},{"$f":"B!$AN$50","v":0}]
["0104002","Visita a domicilio por asistente social",{"$f":"B!$D$51","v":0},{"$f":"B!$F$51","v":0},{"$f":"B!$AN$51","v":0}]
["0104003","Visita a domicilio por auxiliar de enfermería",{"$f":"B!$D$52","v":0},{"$f":"B!$F$52","v":0},{"$f":"B!$AN$52","v":0}]
[null,"OTRAS VISITAS DOMICILIARIAS",{"$f":"SUM(C65:C66)","v":0}]
[null,"Visita a domicilio por otro integrante del equipo de salud",{"$f":" B!$D$54","v":0}]
[null,"Visita domiciaria por profesional y técnico paramédico",{"$f":"B!$D$55","v":0}]
[null,"TOTAL ",{"$f":"C10+C31+C48+C53+C60+C24+C25+C43+C51+C58+C64","v":0},{"$f":"D10+D31+D48+D53+D60+D24","v":0},{"$f":"E10+E31+E48+E53+E60+E24","v":0}]
["SECCION B: EXÁMENES DE DIAGNÓSTICO"]
["TIPO DE EXAMEN",null,"TOTAL PRODUCCIÓN","TOTAL BENEFICIARIOS MAI","PAGO POR PRESTACIONES ($)"]
["TOTAL EXAMENES LABORATORIO",null,{"$f":"SUM(C71:C76,C80:C83)","v":0},{"$f":"SUM(D71:D75,D76,D80:D82)","v":0},{"$f":"SUM(E71:E75,E76,E80:E82)","v":0}]
["I  ","HEMATOLOGICOS",{"$f":"B!$D$236","v":0},{"$f":"B!$F$236","v":0},{"$f":"B!$AN$236","v":0}]
["II  ","BIOQUIMICOS",{"$f":"B!$D$312","v":0},{"$f":"SUM(B!F238:F241,B!F242:F300,B!F301:F311)","v":0},{"$f":"B!$AN$312","v":0}]
["III","HORMONALES",{"$f":"B!$D$363","v":0},{"$f":"B!$F$363","v":0},{"$f":"B!$AN$363","v":0}]
["IV","GENETICA",{"$f":"B!$D$371","v":0},{"$f":"B!$F$371","v":0},{"$f":"B!$AN$371","v":0}]
["V","INMUNOLOGICOS",{"$f":"B!$D$440","v":0},{"$f":"B!$F$440","v":0},{"$f":"B!$AN$440","v":0}]
["VI  ","MICROBIOLOGICOS",{"$f":"SUM(C77:C79)","v":0},{"$f":"SUM(D77:D79)","v":0},{"$f":"SUM(E77:E79)","v":0}]
[null,"a)   BACTERIAS Y HONGOS",{"$f":"B!$D$489","v":0},{"$f":"B!$F$489","v":0},{"$f":"B!$AN$489","v":0}]
[null,"b)   PARASITOS",{"$f":"B!$D$515","v":0},{"$f":"SUM(B!F491:F512,B!F513:F514)","v":0},{"$f":"B!$AN$515","v":0}]
[null,"c)   VIRUS",{"$f":"B!$D$535","v":0},{"$f":"B!$F$535","v":0},{"$f":"B!$AN$535","v":0}]
["VII","PROCEDIMIENTO O DETERMINACION DIRECTA C/PACIENTE",{"$f":"B!$D$547","v":0},{"$f":"B!$F$547","v":0},{"$f":"B!$AN$547","v":0}]
["VIII  ","EX.  DE DEPOSICIONES EXUDADOS. SECREC. Y OTROS LIQ.  ",{"$f":"B!$D$610","v":0},{"$f":"SUM(B!F565:F595,B!F596:F609)","v":0},{"$f":"B!$AN$610","v":0}]
["IX   ","ORINA",{"$f":"B!$D$645","v":0},{"$f":"B!$F$645","v":0},{"$f":"B!$AN$645","v":0}]
["X","OTROS EXAMENES DE LABORATORIO",{"$f":"B!$D$3055","v":0},{"$f":"B!$F$3055","v":0}]
["TOTAL EXAMENES IMAGENOLOGIA",null,{"$f":"+C85+C86+C87+C88+C92+C93","v":0},{"$f":"+D85+D86+D87+D88+D92","v":0},{"$f":"+E85+E86+E87+E88+E92","v":0}]
["I. a)","EX. RADIOLOGICOS SIMPLES",{"$f":"B!$D$705","v":0},{"$f":"SUM(B!F648:F649,B!F650,B!F651,B!F652:F662,B!F663:F669,B!F670:F678,B!F679,B!F680:F698,B!F699:F701)","v":0},{"$f":"B!$AN$705","v":0}]
["I. b)","EX. RADIOLOGICOS COMPLEJOS",{"$f":"B!$D$731","v":0},{"$f":"B!$F$731","v":0},{"$f":"B!$AN$731","v":0}]
["II.","TOMOGRAFIA AXIAL COMP.",{"$f":"B!$D$761","v":0},{"$f":"B!$F$761","v":0},{"$f":"B!$AN$761","v":0}]
["III","ULTRASONOGRAFIA",{"$f":"SUM(C89:C91)","v":0},{"$f":"SUM(D89:D91)","v":0},{"$f":"SUM(E89:E91)","v":0}]
[null,"Ecotomografias ( Sin Ecografía Obstetr. Y Abdominal )",{"$f":"B!$D$783-B!D763-B!D764","v":0},{"$f":"B!$F$783-B!F763-B!F764","v":0},{"$f":"B!$AN$783-B!$AN$763-B!$AN$764","v":0}]
[null,"Ecografías Obstétricas",{"$f":"B!$D$763","v":0},{"$f":"B!$F$763","v":0},{"$f":"B!$AN$763","v":0}]
[null,"Ecotomografias abdominal ",{"$f":"B!$D$764","v":0},{"$f":"B!$F$764","v":0},{"$f":"B!$AN$764","v":0}]
["IV","RESONANCIA MAGNÉTICA ",{"$f":"B!$D$817","v":0},{"$f":"B!$F$817","v":0},{"$f":"B!$AN$817","v":0}]
[null,"OTROS EXÁMENES DE IMÁGENES",{"$f":"B!$D$880","v":0},{"$f":"B!$F$880","v":0}]
[null,"TOTAL EXAMENES ANATOMIA PATOLOGICA",{"$f":"B!$D$1075","v":0},{"$f":"B!$F$1075","v":0},{"$f":"B!$AN$1075","v":0}]
["SECCION C: PROCEDIMIENTOS DE MEDICINA NUCLEAR , GINECOLOGÍA Y OBSTETRICIA, Y ORTOPEDIA"]
["CÓDIGOS","IDENTIFICACION DE PRESTACIONES","TOTAL PRODUCCIÓN","TOTAL BENEFICIARIOS MAI","PAGO POR PRESTACIONES ($)"]
["05","PROCEDIMIENTOS DE MEDICINA NUCLEAR",{"$f":"B!D887+B!D894+B!D898+B!D905+B!D914+B!D918+B!D922+B!D926+B!D937+B!D945+B!D950+B!D968+B!D986+B!D934","v":0},{"$f":"B!F887+B!F894+B!F898+B!F905+B!F914+B!F918+B!F922+B!F926+B!F937+B!F945+B!F950+B!F968+B!F986+B!F934","v":0},{"$f":"B!AN887+B!AN894+B!AN898+B!AN905+B!AN914+B!AN918+B!AN922+B!AN926+B!AN937+B!AN945+B!AN950+B!AN968+B!AN986+B!AN934","v":0}]
[2001,"PROCEDIMIENTOS DE GINECOLOGIA Y OBSTETRICIA",{"$f":"B!D2343+B!D2386+B!D2387","v":0},{"$f":"B!F2335+B!F2386+B!F2387","v":0},{"$f":"B!AN2335+B!AN2386+B!AN2387","v":0}]
["2107","PROCEDIMIENTOS DE ORTOPEDIA",{"$f":"B!D2642","v":0},{"$f":"B!F2642","v":0},{"$f":"B!AN2642","v":0}]
[null,"SUB-TOTAL FACTURACION SECCION C",{"$f":"SUM(C97:C99)","v":0},{"$f":"SUM(D97:D99)","v":0},{"$f":"SUM(E97:E99)","v":0}]
["SECCION D: INTERVENCIONES QUIRÚRGICAS "]
["CODIGOS","IDENTIFICACION DE PRESTACIONES","TOTAL PRODUCCIÓN","TOTAL BENEFICIARIOS MAI","PAGO POR PRESTACIONES ($)"]
["1103","I NEUROCIRUGIA",{"$f":"B!$D$1246","v":0},{"$f":"B!$J$1246","v":0},{"$f":"B!$AN$1246","v":0}]
["1202","II CIRUGIA OFTALMOLOGICA",{"$f":"B!D1383","v":0},{"$f":"B!J1383","v":0},{"$f":"B!$AN$1383","v":0}]
["1302","III CIRUGIA OTORRINOLOGICA",{"$f":"B!D1525","v":0},{"$f":"B!J1522","v":0},{"$f":"B!$AN$1522","v":0}]
["1402","IV CIRUGIA DE CABEZA Y CUELLO",{"$f":"B!D1589","v":0},{"$f":"B!J1589","v":0},{"$f":"B!AN1589","v":0}]
["1502","V CIRUGIA PLASTICA Y REPARADORA",{"$f":"B!$D$1658","v":0},{"$f":"B!$J$1658","v":0},{"$f":"B!$AN$1658","v":0}]
["1602","VI DERMATOLOGIA Y TEGUMENTOS",{"$f":"B!$D$1703","v":0},{"$f":"B!$J$1703","v":0},{"$f":"B!$AN$1703","v":0}]
["1703","VII CIRUGIA CARDIOVASCULAR",{"$f":"B!$D$1921","v":0},{"$f":"B!$J$1908","v":0},{"$f":"B!$AN$1908","v":0}]
["1704","VIII CIRUGIA TORAXICA",{"$f":"B!$D$1991","v":0},{"$f":"B!$J$1987","v":0},{"$f":"B!$AN$1987","v":0}]
["1802","IX CIRUGIA ABDOMINAL",{"$f":"B!$D$2153","v":0},{"$f":"B!$J$2146","v":0},{"$f":"B!$AN$2146","v":0}]
["1803","X CIRUGIA PROCTOLOGICA",{"$f":"B!D2192","v":0},{"$f":"B!J2192","v":0},{"$f":"B!AN2192","v":0}]
["1902","XI CIRUGIA UROLOGICA Y SUPRARRENAL",{"$f":"B!$D$2316","v":0},{"$f":"B!J2316","v":0},{"$f":"B!AN2316","v":0}]
["2002","XII CIRUGIA DE LA MAMA",{"$f":"B!$D$2349","v":0},{"$f":"B!J2349","v":0},{"$f":"B!$AN$2349","v":0}]
["2003","XIII CIRUGIA GINECOLOGICA",{"$f":"B!$D$2384","v":0},{"$f":"B!$J$2384","v":0},{"$f":"B!$AN$2384","v":0}]
["2004","XIV CIRUGIA OBSTETRICA",{"$f":"(C117+C118)","v":0},{"$f":"(D117+D118)","v":0},{"$f":"(E117+E118)","v":0}]
[null,"CESAREA CON HISTERECTOMIA  2004005",{"$f":"B!$D$2389","v":0},{"$f":"B!$J$2389","v":0},{"$f":"B!$AN$2389","v":0}]
[null,"CESAREA C/S SALPINGOLIGADURA O SALPINGECTOMIA  2004006",{"$f":"B!$D$2388","v":0},{"$f":"B!$J$2388","v":0},{"$f":"B!$AN$2388","v":0}]
[]
["2104 ","XV  TRAUMATOLOGIA ",{"$f":"B!$D$2625","v":0},{"$f":"B!$J$2618","v":0},{"$f":"B!$AN$2618","v":0}]
[2106,"XVI  RETIRO ELEMENTOS OSTEOSINTESIS",{"$f":"B!$D2630","v":0},{"$f":"B!$J2630","v":0},{"$f":"B!$AN2630","v":0}]
[null,"SUB-TOTAL FACTURACION SECCION D",{"$f":"SUM(C103:C116)+C120+C121","v":0},{"$f":"SUM(D103:D116)+D120+D121","v":0},{"$f":"SUM(E103:E116)+E120+E121","v":0}]
["SECCION E: ATENCION CERRADA, DIAS DE HOSPITALIZACION "]
["CODIGOS","IDENTIFICACION DE PRESTACIONES","TOTAL PRODUCCIÓN","TOTAL BENEFICIARIOS MAI","PAGO POR PRESTACIONES ($)"]
[null,"ATENCION CERRADA "]
["0203001","Día cama hospitalización integral medicina, cirugía, pediatría, obstetricia-ginecología y especialidades (sala 3 camas o más) (Hosp. Alta Complejidad)",{"$f":"B!$D$113","v":0},{"$f":"B!$F$113","v":0},{"$f":"B!$AN$113","v":0}]
["0203102","Día cama hospitalización integral medicina, cirugía, pediatría, obstetricia-ginecología y especialidades (sala 3 camas o más) (Hosp. Mediana Complejidad)",{"$f":"B!$D$114","v":0},{"$f":"B!$F$114","v":0},{"$f":"B!$AN$114","v":0}]
["0203103","Día cama hospitalización integral medicina, cirugía, pediatría, obstetricia-ginecología y especialidades (sala 3 camas o más) (Hosp. Baja Complejidad)",{"$f":"B!$D$115","v":0},{"$f":"B!$F$115","v":0},{"$f":"B!$AN$115","v":0}]
["0203002","Día cama hospitalización integral adulto en Unidad de Cuidado Intensivo (U.C.I.) ",{"$f":"B!$D$116","v":0},{"$f":"B!$F$116","v":0},{"$f":"B!$AN$116","v":0}]
["0203003","Día cama hospitalización integral pediátrica en Unidad de Cuidado Intensivo (U.C.I). ",{"$f":"B!$D$117","v":0},{"$f":"B!$F$117","v":0},{"$f":"B!$AN$117","v":0}]
["0203004","Día cama hospitalización integral neonatal en Unidad de Cuidado Intensivo (U.C.I.)",{"$f":"B!$D$118","v":0},{"$f":"B!$F$118","v":0},{"$f":"B!$AN$118","v":0}]
["0203005","Día cama hospitalización integral adulto en Unidad de Tratamiento Intermedio (U.T.I)",{"$f":"B!$D$119","v":0},{"$f":"B!$F$119","v":0},{"$f":"B!$AN$119","v":0}]
["0203006","Día cama hospitalización integral pediátrica en Unidad de Tratamiento Intermedio (U.T.I)",{"$f":"B!$D$120","v":0},{"$f":"B!$F$120","v":0},{"$f":"B!$AN$120","v":0}]
["0203007","Día cama hospitalización integral neonatal en Unidad de Tratamiento Intermedio (U.T.I)",{"$f":"B!$D$121","v":0},{"$f":"B!$F$121","v":0},{"$f":"B!$AN$121","v":0}]
["0203008","Día cama hospitalización integral incubadora",{"$f":"B!$D$122","v":0},{"$f":"B!$F$122","v":0},{"$f":"B!$AN$122","v":0}]
["0203009","Día cama hospitalización integral psiquiatría crónicos",{"$f":"B!$D$123","v":0},{"$f":"B!$F$123","v":0},{"$f":"B!$AN$123","v":0}]
["0203109","Día cama hosp. integral psiquiatría corta estadía",{"$f":"B!$D$124","v":0},{"$f":"B!$F$124","v":0},{"$f":"B!$AN$124","v":0}]
["0203209","Día cama hosp. integral desintoxicación alcohol y drogas",{"$f":"B!$D$125","v":0},{"$f":"B!$F$125","v":0},{"$f":"B!$AN$125","v":0}]
[null,"SUB TOTAL ATENCION CERRADA",{"$f":"SUM(C126:C138)","v":0},{"$f":"SUM(D126:D138)","v":0},{"$f":"SUM(E126:E138)","v":0}]
[null,"MISCELANEOS DIAS CAMA",{"$f":"SUM(C141:C150)","v":0},{"$f":"SUM(D141:D150)","v":0},{"$f":"SUM(E141:E150)","v":0}]
["0203010","Día cama integral psiquiátrico diurno",{"$f":"B!$D$128","v":0},{"$f":"B!$F$128","v":0},{"$f":"B!$AN$128","v":0}]
["0203110","Día cama hospitalización integral psiquiatría mediana estadía",{"$f":"B!$D$129","v":0},{"$f":"B!$F$129","v":0},{"$f":"B!$AN$129","v":0}]
["0203011","Día cama integral de observación o día cama integral ambulatorio diurno",{"$f":"B!$D$130","v":0},{"$f":"B!$F$130","v":0},{"$f":"B!$AN$130","v":0}]
["0203111","Camilla de observación en servicio de urgencia",{"$f":"B!$D$131","v":0},{"$f":"B!$F$131","v":0},{"$f":"B!$AN$131","v":0}]
["0203012","Día cama integral geriatría o crónicos",{"$f":"B!$D$132","v":0},{"$f":"B!$F$132","v":0},{"$f":"B!$AN$132","v":0}]
["0203013","Día estada en cámara hiperbárica",{"$f":"B!$D$133","v":0},{"$f":"B!$F$133","v":0},{"$f":"B!$AN$133","v":0}]
["0203014","Día cama hogar embarazada rural (del Servicio de Salud)",{"$f":"B!$D$134","v":0},{"$f":"B!$F$134","v":0},{"$f":"B!$AN$134","v":0}]
["0203015","Día cuna de hospitalización integral",{"$f":"B!$D$135","v":0},{"$f":"B!$F$135","v":0},{"$f":"B!$AN$135","v":0}]
["0203016","Día cama hospitalización integral urgencia H.U.A.P. (Sólo Hospital Urgencia Asistencia Pública)",{"$f":"B!$D$136","v":0},{"$f":"B!$F$136","v":0},{"$f":"B!$AN$136","v":0}]
["0203017","Día cama hogar protegido paciente psiquiátrico compensado",{"$f":"B!$D$137","v":0},{"$f":"B!$F$137","v":0},{"$f":"B!$AN$137","v":0}]
[null,"OTRO DIA CAMA",{"$f":"C152","v":0}]
["0203211","Día Cama Residencia Protegida",{"$f":"B!$D$139","v":0}]
[null,"TOTAL DIAS CAMA DE HOSPITALIZACION",{"$f":"(C139+C140+C151)","v":0},{"$f":"(D139+D140)","v":0},{"$f":"(E139+E140)","v":0}]
["SECCION F: ACTIVIDADES PROTECCION ESPECIFICA "]
["CODIGOS","IDENTIFICACION DE PRESTACIONES","TOTAL PRODUCCIÓN","TOTAL BENEFICIARIOS MAI","PAGO POR PRESTACIONES ($)"]
["0105001","Vacunaciones (sólo considera administración)",{"$f":"B!$D$59","v":0},{"$f":"B!$F$59","v":0},{"$f":"B!$AN$59","v":0}]
["0105002 y 003","Desparasitación sarna y pediculosis (cada persona)",{"$f":"SUM(B!$D$60+B!$D$61)","v":0},{"$f":"SUM(B!$F$60+B!$F$61)","v":0},{"$f":"SUM(B!$AN$60+B!$AN$61)","v":0}]
[null,"SUB-TOTAL FACTURACION SECCION F",{"$f":"SUM(C156:C157)","v":0},{"$f":"SUM(D156:D157)","v":0},{"$f":"SUM(E156:E157)","v":0}]
["SECCION G: PROCEDIMIENTOS DIAGNOSTICOS Y TERAPEUTICOS"]
["CODIGOS","IDENTIFICACION DE PRESTACIONES","TOTAL PRODUCCIÓN","TOTAL BENEFICIARIOS MAI","PAGO POR PRESTACIONES ($)"]
[1101004,"E.E.G. de 16 o más canales (incluye el cód. 11-01-006)",{"$f":"B!$D$1114","v":0},{"$f":"B!$F$1114","v":0},{"$f":"B!$AN$1114","v":0}]
[1101006,"Electroencefalograma (E.E.G.) standard y/o activado...., de 8 canales",{"$f":"B!$D$1115","v":0},{"$f":"B!$F$1115","v":0},{"$f":"B!$AN$1115","v":0}]
["1701001","E.C.G. de reposo (incluye mínimo 12 derivaciones y 4 complejos por derivación)",{"$f":"B!$D$1814","v":0},{"$f":"B!$F$1814","v":0},{"$f":"B!$AN$1814","v":0}]
["1701003","Ergometría (incluye E.C.G. antes, durante y después del ejercicio con monitoreo continuo y medición de la intensidad del esfuerzo)",{"$f":"B!$D$1815","v":0},{"$f":"B!$F$1815","v":0},{"$f":"B!$AN$1815","v":0}]
["1701006","E.C.G. continuo (test Holter o similares, por ej. variabilidad de la frecuencia cardíaca y/o alta resolución del ST y/o depolarización tardía); 20 a 24 horas de registro",{"$f":"B!$D$1816","v":0},{"$f":"B!$F$1816","v":0},{"$f":"B!$AN$1816","v":0}]
["1701007","Ecocardiograma Doppler, con registro (incluye cód.17.01.008)",{"$f":"B!$D$1817","v":0},{"$f":"B!$F$1817","v":0},{"$f":"B!$AN$1817","v":0}]
["1701045","Ecocardiograma Doppler color",{"$f":"B!$D$1818","v":0},{"$f":"B!$F$1818","v":0},{"$f":"B!$AN$1818","v":0}]
["1701008","Ecocardiograma bidimensional (incluye registro modo M, papel fotosensible y fotografía), en adultos o niños (proc. aut.)",{"$f":"B!$D$1819","v":0},{"$f":"B!$F$1819","v":0},{"$f":"B!$AN$1819","v":0}]
["1701010","Sondeo cardíaco derecho c/s termodilución, en adultos o niños",{"$f":"B!$D$1820","v":0},{"$f":"B!$F$1820","v":0},{"$f":"B!$AN$1820","v":0}]
["1701011","Sondeo cardíaco izquierdo y derecho, en adultos o niños",{"$f":"B!$D$1821","v":0},{"$f":"B!$F$1821","v":0},{"$f":"B!$AN$1821","v":0}]
["1701012","Sondeo cardíaco izquierdo, en adultos o niños",{"$f":"B!$D$1822","v":0},{"$f":"B!$F$1822","v":0},{"$f":"B!$AN$1822","v":0}]
["1701019","Cinecoronariografía derecha y/o izquierda (incluye sondeo cardíaco izq.  y ventriculografía izq.) ",{"$f":"B!$D$1823","v":0},{"$f":"B!$F$1823","v":0},{"$f":"B!$AN$1823","v":0}]
["1701020","Ventriculografía derecha, en adultos o niños (incl. proc. rad. y sondeo cardíaco derecho)",{"$f":"B!$D$1824","v":0},{"$f":"B!$F$1824","v":0},{"$f":"B!$AN$1824","v":0}]
["1701021","Ventriculografía izquierda, en adultos o niños (incl. proc. rad. y sondeo cardíaco izquierdo)",{"$f":"B!$D$1825","v":0},{"$f":"B!$F$1825","v":0},{"$f":"B!$AN$1825","v":0}]
["1701022","Aortografía, en adultos o niños (Incluye proc. rad.)",{"$f":"B!$D$1826","v":0},{"$f":"B!$F$1826","v":0},{"$f":"B!$AN$1826","v":0}]
["1701023","Arteriografía de extremidades, en adultos o niños (incluye proc. rad.)",{"$f":"B!$D$1827","v":0},{"$f":"B!$F$1827","v":0},{"$f":"B!$AN$1827","v":0}]
["1701024","Arteriografía selectiva o superselectiva (pulmonar, renal, tronco celíaco, etc)  en adultos o niños (incl. proc. rad.)  ",{"$f":"B!$D$1828","v":0},{"$f":"B!$F$1828","v":0},{"$f":"B!$AN$1828","v":0}]
["1701131","Angioplastía Intraluminal coronaria uno o mult. vasos(incl. proc. rad; balón, rotablator, Stent o similar)",{"$f":"B!$D$1829","v":0},{"$f":"B!$F$1829","v":0},{"$f":"B!$AN$1829","v":0}]
["1701132","Angioplastía Intraluminal periférica (incluye proc. rad., balón, Stent o similar)",{"$f":"B!$D$1830","v":0},{"$f":"B!$F$1830","v":0},{"$f":"B!$AN$1830","v":0}]
["1701043","Angioplastía de coartación aórtica (incl. proc. rad.) (proc. completo)",{"$f":"B!$D$1831","v":0},{"$f":"B!$F$1831","v":0},{"$f":"B!$AN$1831","v":0}]
["1701144","Angioplastía de arteria pulmonar o vena cava en niños (incluye proc. rad., balón, Stent o similar)",{"$f":"B!$D$1832","v":0},{"$f":"B!$F$1832","v":0},{"$f":"B!$AN$1832","v":0}]
["1701033","Biopsia endomiocárdica (proc. completo)",{"$f":"B!$D$1833","v":0},{"$f":"B!$F$1833","v":0},{"$f":"B!$AN$1833","v":0}]
["1701038","Septostomía de Rashkind",{"$f":"B!$D$1834","v":0},{"$f":"B!$F$1834","v":0},{"$f":"B!$AN$1834","v":0}]
["1701035","Colocación de sonda marcapaso transitorio (proc. completo)",{"$f":"B!$D$1835","v":0},{"$f":"B!$F$1835","v":0},{"$f":"B!$AN$1835","v":0}]
["1701141","Valvuloplastía mitral o tricúspide (incl. proc. radiológico,  incluye balón)",{"$f":"B!$D$1836","v":0},{"$f":"B!$F$1836","v":0},{"$f":"B!$AN$1836","v":0}]
["1701142","Valvuloplastía aórtica y pulmonar (incl. proc. radiológico,  incluye balón)",{"$f":"B!$D$1837","v":0},{"$f":"B!$F$1837","v":0},{"$f":"B!$AN$1837","v":0}]
[1801001,"Gastroduodenoscopía (incluye esofagoscopía)",{"$f":"B!$D$2058","v":0},{"$f":"B!$F$2058","v":0},{"$f":"B!$AN$2058","v":0}]
[1801003,"Yeyuno-ileoscopía (incluye esofago-gastro-duodenoscopía)",{"$f":"B!$D$2059","v":0},{"$f":"B!$F$2059","v":0},{"$f":"B!$AN$2059","v":0}]
[1801006,"Colonoscopía larga (incluye sigmoidoscopía y ....)",{"$f":"B!$D$2060","v":0},{"$f":"B!$F$2060","v":0},{"$f":"B!$AN$2060","v":0}]
[1401001,"Punción evacuadora de quiste tiroídeo c/s toma de muestra, c/s inyección de medicamentos",{"$f":"B!$D$1527","v":0},{"$f":"B!$F$1527","v":0},{"$f":"B!$AN$1527","v":0}]
[1101113,"Angiografía cerebral digital por cateterización femoral (incluye proc. Radiológico, medio de contraste e insumos)",{"$f":"B!$D$1116","v":0},{"$f":"B!$F$1116","v":0},{"$f":"B!$AN$1116","v":0}]
[1101140,"Esclerosis Múltiple Remitente Recurrente,  Tratamiento médico farmacológico  Anual (incluye inmunomoduladores)",{"$f":"B!$D$1117","v":0},{"$f":"B!$F$1117","v":0},{"$f":"B!$AN$1117","v":0}]
[1101141,"Esclerosis Múltiple Remitente Recurrente, Tratamiento rehabilitación",{"$f":"B!$D$1118","v":0},{"$f":"B!$F$1118","v":0},{"$f":"B!$AN$1118","v":0}]
[1101142,"Esclerosis Múltiple Remitente Recurrente,  Tratamiento Brote",{"$f":"B!$D$1119","v":0},{"$f":"B!$F$1119","v":0},{"$f":"B!$AN$1119","v":0}]
[null,"SUB-TOTAL FACTURACION SECCION G",{"$f":"SUM(C161:C194)","v":0},{"$f":"SUM(D161:D194)","v":0},{"$f":"SUM(E161:E194)","v":0}]
["SECCIÓN H:PROGRAMA NACIONAL DE DROGAS ANTINEOPLASICAS P.N.D.A. (SOLO SERVICIOS DE SALUD ACREDITADOS)"]
["CODIGOS",null,"TOTAL PRODUCCIÓN","TOTAL BENEFICIARIOS MAI","PAGO POR PRESTACIONES ($)"]
[null,"TUMORES DEL ADULTO",{"$f":"SUM(C199:C212)","v":0},{"$f":"SUM(D199:D212)","v":0},{"$f":"SUM(E199:E212)","v":0}]
["3002001","Linfoma de Hodgkin",{"$f":"B!$D$2858","v":0},{"$f":"B!$F$2858","v":0},{"$f":"B!$AN$2858","v":0}]
["3002002","Linfoma No Hodgkin no agresivo",{"$f":"B!$D$2859","v":0},{"$f":"B!$F$2859","v":0},{"$f":"B!$AN$2859","v":0}]
["3002003","Linfoma No Hodgkin intermedio",{"$f":"B!$D$2860","v":0},{"$f":"B!$F$2860","v":0},{"$f":"B!$AN$2860","v":0}]
["3002004","Linfoma No Hodgkin., agresivo",{"$f":"B!$D$2861","v":0},{"$f":"B!$F$2861","v":0},{"$f":"B!$AN$2861","v":0}]
["3002005","Leucemia linfoblastica",{"$f":"B!$D$2862","v":0},{"$f":"B!$F$2862","v":0},{"$f":"B!$AN$2862","v":0}]
["3002006","Leucemia Aguda No linfática aguda y Leucemia Promielocítica",{"$f":"B!$D$2863","v":0},{"$f":"B!$F$2863","v":0},{"$f":"B!$AN$2863","v":0}]
["3002007","Cáncer de Testículo y  Germinales extragonadales",{"$f":"B!$D$2864","v":0},{"$f":"B!$F$2864","v":0},{"$f":"B!$AN$2864","v":0}]
["3002008","Enfermedad Trofoblástica Gestacional",{"$f":"B!$D$2865","v":0},{"$f":"B!$F$2865","v":0},{"$f":"B!$AN$2865","v":0}]
["3002033","Rescate de Linfomas",{"$f":"B!$D$2866","v":0},{"$f":"B!$F$2866","v":0},{"$f":"B!$AN$2866","v":0}]
["3002034","Ca. Mama etapa I y II",{"$f":"B!$D$2867","v":0},{"$f":"B!$F$2867","v":0},{"$f":"B!$AN$2867","v":0}]
["3002135","Ca mama etapa III",{"$f":"B!$D$2868","v":0},{"$f":"B!$F$2868","v":0},{"$f":"B!$AN$2868","v":0}]
["3002136","Ca mama etapa IV",{"$f":"B!$D$2869","v":0},{"$f":"B!$F$2869","v":0},{"$f":"B!$AN$2869","v":0}]
["3002137","Ca mama etapa IV metástasis ósea",{"$f":"B!$D$2870","v":0},{"$f":"B!$F$2870","v":0},{"$f":"B!$AN$2870","v":0}]
["3002036","Ca. Cérvico Uterino",{"$f":"B!$D$2871","v":0},{"$f":"B!$F$2871","v":0},{"$f":"B!$AN$2871","v":0}]
["TUMORES INFANTILES",null,{"$f":"SUM(C214:C231)","v":0},{"$f":"SUM(D214:D231)","v":0},{"$f":"SUM(E214:E231)","v":0}]
["3002009","Linfoma de Hodgkin",{"$f":"B!$D$2872","v":0},{"$f":"B!$F$2872","v":0},{"$f":"B!$AN$2872","v":0}]
["3002010","Linfoma B y LLA-B",{"$f":"B!$D$2873","v":0},{"$f":"B!$F$2873","v":0},{"$f":"B!$AN$2873","v":0}]
["3002011","Linfoma Linfoblástico",{"$f":"B!$D$2874","v":0},{"$f":"B!$F$2874","v":0},{"$f":"B!$AN$2874","v":0}]
["3002012","Leucemia linfoblástica aguda",{"$f":"B!$D$2875","v":0},{"$f":"B!$F$2875","v":0},{"$f":"B!$AN$2875","v":0}]
["3002013","Leucemia Mieloide Aguda",{"$f":"B!$D$2876","v":0},{"$f":"B!$F$2876","v":0},{"$f":"B!$AN$2876","v":0}]
["3002014","Neuroblastoma",{"$f":"B!$D$2877","v":0},{"$f":"B!$F$2877","v":0},{"$f":"B!$AN$2877","v":0}]
["3002015","Osteosarcoma",{"$f":"B!$D$2878","v":0},{"$f":"B!$F$2878","v":0},{"$f":"B!$AN$2878","v":0}]
["3002016","Sarcoma partes blandas",{"$f":"B!$D$2879","v":0},{"$f":"B!$F$2879","v":0},{"$f":"B!$AN$2879","v":0}]
["3002017","Ewing",{"$f":"B!$D$2880","v":0},{"$f":"B!$F$2880","v":0},{"$f":"B!$AN$2880","v":0}]
["3002107","Tumores germinales Extra Sistema Nerviso Central (Extra SNC)",{"$f":"B!$D$2881","v":0},{"$f":"B!$F$2881","v":0},{"$f":"B!$AN$2881","v":0}]
["3002020","Tumor de Wilms",{"$f":"B!$D$2882","v":0},{"$f":"B!$F$2882","v":0},{"$f":"B!$AN$2882","v":0}]
["3002021","Retinoblastoma",{"$f":"B!$D$2883","v":0},{"$f":"B!$F$2883","v":0},{"$f":"B!$AN$2883","v":0}]
["3002022","Histiocitosis",{"$f":"B!$D$2884","v":0},{"$f":"B!$F$2884","v":0},{"$f":"B!$AN$2884","v":0}]
["3002024","Recaída tumores sólidos",{"$f":"B!$D$2885","v":0},{"$f":"B!$F$2885","v":0},{"$f":"B!$AN$2885","v":0}]
["3002025","Hepatoblastomas",{"$f":"B!$D$2886","v":0},{"$f":"B!$F$2886","v":0},{"$f":"B!$AN$2886","v":0}]
["3002026","Leucemias mieloide crónica",{"$f":"B!$D$2887","v":0},{"$f":"B!$F$2887","v":0},{"$f":"B!$AN$2887","v":0}]
["3002126","Recaída de Leucemia Mieloide",{"$f":"B!$D$2888","v":0},{"$f":"B!$F$2888","v":0},{"$f":"B!$AN$2888","v":0}]
["3002027","Recaídas de leucemias Linfoblasticas",{"$f":"B!$D$2889","v":0},{"$f":"B!$F$2889","v":0},{"$f":"B!$AN$2889","v":0}]
[null,"TUMORES CEREBRALES INFANTILES",{"$f":"SUM(C233:C238)","v":0},{"$f":"SUM(D233:D238)","v":0},{"$f":"SUM(E233:E238)","v":0}]
["3002028","Méduloblastomas",{"$f":"B!$D$2890","v":0},{"$f":"B!$F$2890","v":0},{"$f":"B!$AN$2890","v":0}]
["3002029","Tumores de < de 3 años",{"$f":"B!$D$2891","v":0},{"$f":"B!$F$2891","v":0},{"$f":"B!$AN$2891","v":0}]
["3002030","Glioma",{"$f":"B!$D$2892","v":0},{"$f":"B!$F$2892","v":0},{"$f":"B!$AN$2892","v":0}]
["3002031","Astrocitomas",{"$f":"B!$D$2893","v":0},{"$f":"B!$F$2893","v":0},{"$f":"B!$AN$2893","v":0}]
["3002032","Tumor Germinal SNC",{"$f":"B!$D$2894","v":0},{"$f":"B!$F$2894","v":0},{"$f":"B!$AN$2894","v":0}]
["3002023","Cuidados Paliativos y Alivio del Dolor en Cáncer Terminal (en adultos o niños)",{"$f":"B!$D$2895","v":0},{"$f":"B!$F$2895","v":0},{"$f":"B!$AN$2895","v":0}]
[null,"PROGRAMA CANCER",{"$f":"SUM(C240:C246)","v":0}]
[null," Test Inmunoquímico de Deposiciones",{"$f":"B!$D$2898","v":0}]
[null," Yodoterapia",{"$f":"B!$D$2899","v":0}]
[null," Braquiterapia alta tasa en dosis (HDR)",{"$f":"B!$D$2900","v":0}]
[null," Braquiterapia baja tasa en dosis (LDR)",{"$f":"B!$D$2901","v":0}]
[null," Teleterapia de alta complejidad con acelerador lineal (3D)",{"$f":"B!$D$2902","v":0}]
[null," Teleterapia estándar (3D) con acelerador lineal ",{"$f":"B!$D$2903","v":0}]
[null," Telecobaltoterapia con acelerador lineal",{"$f":"B!$D$2904","v":0}]
[null,"OTRAS"]
[null,"Otras actividades en cáncer",{"$f":"B!$D$2925","v":0}]
[null,"TOTAL ",{"$f":"SUM(C198+C213+C232+C239+C248)","v":0},{"$f":"SUM(D198+D213+D232+D239+D248)","v":0},{"$f":"SUM(E198+E213+E232+E239,E248)","v":0}]
["SECCIÓN I:TRATAMIENTO ABREVIADO DE LA TUBERCULOSIS"]
["CODIGOS","TRATAMIENTO ABREVIADO DE LA TUBERCULOSIS","TOTAL PRODUCCIÓN","TOTAL BENEFICIARIOS MAI","PAGO POR PRESTACIONES ($)"]
["3003001","TBC, Esquema primario (mensual)",{"$f":"B!$D$2927","v":0},{"$f":"B!$F$2927","v":0},{"$f":"B!$AN$2927","v":0}]
["3003002","TBC, Esquema primario simplificado (mensual)",{"$f":"B!$D$2928","v":0},{"$f":"B!$F$2928","v":0},{"$f":"B!$AN$2928","v":0}]
["3003003","TBC, Esquema secundario (mensual)",{"$f":"B!$D$2929","v":0},{"$f":"B!$F$2929","v":0},{"$f":"B!$AN$2929","v":0}]
["3003004","TBC, Esquema normado de retratamiento (mensual)",{"$f":"B!$D$2930","v":0},{"$f":"B!$F$2930","v":0},{"$f":"B!$AN$2930","v":0}]
["3003005","TBC, Esquema especial de retratamiento (mensual)",{"$f":"B!$D$2931","v":0},{"$f":"B!$F$2931","v":0},{"$f":"B!$AN$2931","v":0}]
[null,"SUB-TOTAL FACTURACION TRATAMIENTO TBC",{"$f":"SUM(C252:C256)","v":0},{"$f":"SUM(D252:D256)","v":0},{"$f":"SUM(E252:E256)","v":0}]
["SECCIÓN J:TRASLADO, RESCATES Y RONDAS RURALES"]
["CODIGOS","TRASLADO, RESCATES Y RONDAS RURALES","TOTAL PRODUCCIÓN","TOTAL BENEFICIARIOS MAI","PAGO POR PRESTACIONES ($)"]
["2401061","Rescate simple y/o traslado en móvil 1",{"$f":"B!$D$2711","v":0},{"$f":"B!$F$2711","v":0},{"$f":"B!$AN$2711","v":0}]
["2401062","Rescate profesionalizado y/o traslado paciente complejo móvil 2",{"$f":"B!$D$2712","v":0},{"$f":"B!$F$2712","v":0},{"$f":"B!$AN$2712","v":0}]
["2401063","Rescate medicalizado y/o traslado paciente critico en móvil 3",{"$f":"B!$D$2713","v":0},{"$f":"B!$F$2713","v":0},{"$f":"B!$AN$2713","v":0}]
["2401064","Traslado en ambulancia",{"$f":"B!$D$2714","v":0},{"$f":"B!$F$2714","v":0},{"$f":"B!$AN$2714","v":0}]
["2401065","Ronda rural terrestre, c/ km recorrido",{"$f":"B!$D$2715","v":0},{"$f":"B!$F$2715","v":0},{"$f":"B!$AN$2715","v":0}]
["2401066","Ronda rural aérea, c/ hora de vuelo",{"$f":"B!$D$2716","v":0},{"$f":"B!$F$2716","v":0},{"$f":"B!$AN$2716","v":0}]
["2401067","Ronda rural marítima, c/ hora de navegación",{"$f":"B!$D$2717","v":0},{"$f":"B!$F$2717","v":0},{"$f":"B!$AN$2717","v":0}]
[null,"SUB-TOTAL FACTURACION TRASLADOS, RESCATES Y RONDAS",{"$f":"SUM(C260:C266)","v":0},{"$f":"SUM(D260:D266)","v":0},{"$f":"SUM(E260:E266)","v":0}]
["SECCION K: PARTOS"]
["CODIGOS","IDENTIFICACION DE PRESTACIONES","TOTAL PRODUCCIÓN","TOTAL BENEFICIARIOS MAI","PAGO POR PRESTACIONES ($)"]
["2004103","Parto normal",{"$f":"B!$D$2390","v":0},{"$f":"B!$F$2390","v":0},{"$f":"B!$AN$2390","v":0}]
["2004113","Parto distósico vaginal",{"$f":"B!$D$2391","v":0},{"$f":"B!$F$2391","v":0},{"$f":"B!$AN$2391","v":0}]
[null,"SUB-TOTAL FACTURACION SECCION K",{"$f":"SUM(C270:C271)","v":0},{"$f":"SUM(D270:D271)","v":0},{"$f":"SUM(E270:E271)","v":0}]
["SECCION L: ATENCION ODONTOLOGICA"]
[null,"Prestaciones","TOTAL PRODUCCIÓN","TOTAL BENEFICIARIOS MAI","PAGO POR PRESTACIONES ($)"]
["2701XXX","Nivel primario                                   ",{"$f":"B!$D$2738","v":0},{"$f":"B!$F$2738","v":0},{"$f":"B!$AN$2738","v":0}]
["2702XXX","Nivel secundario",{"$f":"B!D2775+B!D2797+B!D2798","v":0},{"$f":"B!F2764+B!F2797+B!F2798","v":0},{"$f":"B!$AN$2764+B!AN2797+B!AN2798","v":0}]
["2703XXX","Nivel terciario",{"$f":"B!$D$2801","v":0},{"$f":"B!$I$2801","v":0},{"$f":"B!$AN$2801","v":0}]
[null,"Otras prestaciones odontológicas",{"$f":"B!$D$2851","v":0}]
[null,"Total",{"$f":"SUM(C275:C278)","v":0},{"$f":"SUM(D275:D278)","v":0},{"$f":"SUM(E275:E278)","v":0}]
["SECCIÓN M: HEMODIALISIS"]
["CODIGOS","IDENTIFICACION DE PRESTACIONES","TOTAL PRODUCCIÓN","TOTAL BENEFICIARIOS MAI","PAGO POR PRESTACIONES ($)"]
[1901023,"Hemodiálisis con insumos incluidos",{"$f":"B!$D$2223","v":0},{"$f":"B!$F$2223","v":0},{"$f":"B!$AN$2223","v":0}]
[1901024,"Hemodiálisis sin insumos",{"$f":"B!$D$2224","v":0},{"$f":"B!$F$2224","v":0},{"$f":"B!$AN$2224","v":0}]
["1901025","Peritoneodiálisis (incluye insumos)",{"$f":"B!$D$2225","v":0},{"$f":"B!$F$2225","v":0},{"$f":"B!$AN$2225","v":0}]
["1901026","Peritoneodiálisis continua en paciente crónico (adulto o niños) (tratamiento mensual)",{"$f":"B!$D$2226","v":0},{"$f":"B!$F$2226","v":0},{"$f":"B!$AN$2226","v":0}]
[1901126,"Instalación de cateter para peritoneodiális",{"$f":"B!$D$2227","v":0},{"$f":"B!$F$2227","v":0},{"$f":"B!$AN$2227","v":0}]
["1901027","Hemodialisis, Tratamiento Mensual (con insumos incluidos)",{"$f":"B!$D$2228","v":0},{"$f":"B!$F$2228","v":0},{"$f":"B!$AN$2228","v":0}]
["1901028","Hemodiálisis con bicarbonato con insumos (por sesion)",{"$f":"B!$D$2229","v":0},{"$f":"B!$F$2229","v":0},{"$f":"B!$AN$2229","v":0}]
[1901029,"Hemodiálisis con bicarbonato con insumos (tratamiento mensual)",{"$f":"B!$D$2230","v":0},{"$f":"B!$F$2230","v":0},{"$f":"B!$AN$2230","v":0}]
[null,"SUB-TOTAL FACTURACION SECCION M",{"$f":"SUM(C282:C289)","v":0},{"$f":"SUM(D282:D289)","v":0},{"$f":"SUM(E282:E289)","v":0}]
[]
["SECCIÓN N: TRASPLANTES"]
["CODIGOS","IDENTIFICACION DE PRESTACIONES","TOTAL PRODUCCIÓN","TOTAL BENEFICIARIOS MAI","PAGO POR PRESTACIONES ($)"]
[null," Estudio  receptor donante cadáver ",{"$f":"B!$D$100","v":0}]
[null," Estudio receptor donante vivo ",{"$f":"B!$D$101","v":0}]
[null," Estudio receptores corazón-pulmón ",{"$f":"B!$D$102","v":0}]
[null," Estudio pacientes trasplante medula ósea ",{"$f":"B!$D$103","v":0}]
[null," Trasplante de medula autólogo",{"$f":"B!$D$104","v":0}]
[null," Trasplante de medula alógeno",{"$f":"B!$D$105","v":0}]
[null," Trasplante medula de cordón",{"$f":"B!$D$106","v":0}]
[null," Trasplante medula aploidentico",{"$f":"B!$D$107","v":0}]
[null," Trasplante de córnea (incluye procuramiento y seguimiento por un año)",{"$f":"B!$D$108","v":0}]
[null," Soporte pretransplante hepático extracorporeo por sesión ",{"$f":"B!$D$109","v":0}]
[1802100," Trasplante hepático (prestaciones contenidas en sección D)",{"$f":"B!$D$2109","v":0}]
[null," Trasplante corazón",{"$f":"B!$D$1911","v":0}]
[1902003," Trasplante Renal (prestaciones contenidas en sección D)",{"$f":"B!$D$2235","v":0}]
[null," Mantención donante cadáver (pulmón, corazón e hígado) (muerte cerebral) ",{"$f":"B!$D$110","v":0}]
[null,"SUB-TOTAL FACTURACION SECCION N",{"$f":"SUM(C294:C307)","v":0}]
["SECCION O: LENTES, AUDIFONOS"]
["CODIGOS","IDENTIFICACION DE PRESTACIONES","TOTAL PRODUCCIÓN","TOTAL BENEFICIARIOS MAI","PAGO POR PRESTACIONES ($)"]
["3001001","Lentes ópticos",{"$f":"B!$D$2854","v":0},{"$f":"B!$F$2854","v":0},{"$f":"B!$AN$2854","v":0}]
["3001002","Audífonos",{"$f":"B!$D$2855","v":0},{"$f":"B!$F$2855","v":0},{"$f":"B!$AN$2855","v":0}]
[null,"SUB-TOTAL FACTURACION, LENTES Y AUDIFONOS",{"$f":"SUM(C311:C312)","v":0},{"$f":"SUM(D311:D312)","v":0},{"$f":"SUM(E311:E312)","v":0}]
["SECCIÓN P: MEDICINA TRANSFUSIONAL"]
["CODIGOS","IDENTIFICACION DE PRESTACIONES","TOTAL BENEFI-CIARIOS","TOTAL BENEFICIARIOS MAI","PAGO POR PRESTACIONES ($)"]
["Grupo 07","Medicina Transfusional",{"$f":"B!$D$1063","v":0},{"$f":"B!$F$1063","v":0},{"$f":"B!$AN$1063","v":0}]
["PARTE II"]
["SECCION A: EXAMENES DE DIAGNOSTICO"]
["TIPO DE EXAMEN",null,"TOTAL","EXAMENES REALIZADOS",{"$nulls":3},"PROCEDENCIA",null,null,"PRODUCCION INTRA HOSPITAL",null,null,"OPERATIVO","COMPRAS REALIZADAS",null,"VENTAS DE SERVICIOS"]
[{"$nulls":3},"TOTAL BENEFICIARIOS","BENEFICIARIOS",null,"NO BENEFICIARIOS","ATENCION CERRADA","ATENCION ABIERTA","EMERGENCIA","POR \nHONORARIOS","POR CONVENIOS","POR\nCONSULTORES\nDE LLAMADA",null,"AL SISTEMA ","EXTRA-SISTEMA"]
[{"$nulls":4},"MAI","MLE"]
["TOTAL EXAMENES LABORATORIO",null,{"$f":"+C323+C324+C325+C326+C327+C328+C332+C333+C334+C335","v":0},0,0,0,0,0,0,0,0,0,0,{"$f":"+N323+N324+N325+N326+N327+N328+N332+N333+N334+N335","v":0},0,0,0,{"$f":"IF((C322)<D322,\"ERROR EN PREVISION\",IF((H322+I322+J322)<>C322,\"ERROR EN PROCEDENCIA\",\"\"))","v":""}]
["I  ","HEMATOLOGICOS",{"$f":"B!D236","v":0},{"$f":"B!E236","v":0},{"$f":"B!F236","v":0},{"$f":"B!G236","v":0},{"$f":"B!H236","v":0},{"$f":"B!AB236","v":0},{"$f":"B!AC236","v":0},{"$f":"B!AD236","v":0},{"$f":"B!AE236","v":0},{"$f":"B!AF236","v":0},{"$f":"B!AG236","v":0},{"$f":"B!AH236","v":0},{"$f":"B!AI236","v":0},{"$f":"B!AJ236","v":0},{"$f":"B!AK236","v":0},{"$f":"IF((C323)<D323,\"ERROR EN PREVISION\",IF((H323+I323+J323)<>C323,\"ERROR EN PROCEDENCIA\",\"\"))","v":""}]
["II  ","BIOQUIMICOS",{"$f":"B!D312","v":0},{"$f":"B!E312","v":0},{"$f":"B!F312","v":0},{"$f":"B!G312","v":0},{"$f":"B!H312","v":0},{"$f":"B!AB312","v":0},{"$f":"B!AC312","v":0},{"$f":"B!AD312","v":0},{"$f":"B!AE312","v":0},{"$f":"B!AF312","v":0},{"$f":"B!AG312","v":0},{"$f":"B!AH312","v":0},{"$f":"B!AI312","v":0},{"$f":"B!AJ312","v":0},{"$f":"B!AK312","v":0},""]
["III","HORMONALES",{"$f":"B!D363","v":0},{"$f":"B!E363","v":0},{"$f":"B!F363","v":0},{"$f":"B!G363","v":0},{"$f":"B!H363","v":0},{"$f":"B!AB363","v":0},{"$f":"B!AC363","v":0},{"$f":"B!AD363","v":0},{"$f":"B!AE363","v":0},{"$f":"B!AF363","v":0},{"$f":"B!AG363","v":0},{"$f":"B!AH363","v":0},{"$f":"B!AI363","v":0},{"$f":"B!AJ363","v":0},{"$f":"B!AK363","v":0},""]
["IV","GENETICA",{"$f":"B!D371","v":0},{"$f":"B!E371","v":0},{"$f":"B!F371","v":0},{"$f":"B!G371","v":0},{"$f":"B!H371","v":0},{"$f":"B!AB371","v":0},{"$f":"B!AC371","v":0},{"$f":"B!AD371","v":0},{"$f":"B!AE371","v":0},{"$f":"B!AF371","v":0},{"$f":"B!AG371","v":0},{"$f":"B!AH371","v":0},{"$f":"B!AI371","v":0},{"$f":"B!AJ371","v":0},{"$f":"B!AK371","v":0},""]
["V","INMUNOLOGICOS",{"$f":"B!D440","v":0},{"$f":"B!E440","v":0},{"$f":"B!F440","v":0},{"$f":"B!G440","v":0},{"$f":"B!H440","v":0},{"$f":"B!AB440","v":0},{"$f":"B!AC440","v":0},{"$f":"B!AD440","v":0},{"$f":"B!AE440","v":0},{"$f":"B!AF440","v":0},{"$f":"B!AG440","v":0},{"$f":"B!AH440","v":0},{"$f":"B!AI440","v":0},{"$f":"B!AJ440","v":0},{"$f":"B!AK440","v":0},""]
["VI  ","MICROBIOLOGICOS",{"$f":"SUM(C329:C331)","v":0},{"$f":"SUM(D329:D331)","v":0},{"$f":"SUM(E329:E331)","v":0},0,0,0,0,0,0,0,0,0,0,0,0,""]
[null,"a)   BACTERIAS Y HONGOS",{"$f":"B!D489","v":0},{"$f":"B!E489","v":0},{"$f":"B!F489","v":0},{"$f":"B!G489","v":0},{"$f":"B!H489","v":0},{"$f":"B!AB489","v":0},{"$f":"B!AC489","v":0},{"$f":"B!AD489","v":0},{"$f":"B!AE489","v":0},{"$f":"B!AF489","v":0},{"$f":"B!AG489","v":0},{"$f":"B!AH489","v":0},{"$f":"B!AI489","v":0},{"$f":"B!AJ489","v":0},{"$f":"B!AK489","v":0},""]
[null,"b)   PARASITOS",{"$f":"B!D515","v":0},{"$f":"B!E515","v":0},{"$f":"B!F515","v":0},{"$f":"B!G515","v":0},{"$f":"B!H515","v":0},{"$f":"B!AB515","v":0},{"$f":"B!AC515","v":0},{"$f":"B!AD515","v":0},{"$f":"B!AE515","v":0},{"$f":"B!AF515","v":0},{"$f":"B!AG515","v":0},{"$f":"B!AH515","v":0},{"$f":"B!AI515","v":0},{"$f":"B!AJ515","v":0},{"$f":"B!AK515","v":0},""]
[null,"c)   VIRUS",{"$f":"B!D535","v":0},{"$f":"B!E535","v":0},{"$f":"B!F535","v":0},{"$f":"B!G535","v":0},{"$f":"B!H535","v":0},{"$f":"B!AB535","v":0},{"$f":"B!AC535","v":0},{"$f":"B!AD535","v":0},{"$f":"B!AE535","v":0},{"$f":"B!AF535","v":0},{"$f":"B!AG535","v":0},{"$f":"B!AH535","v":0},{"$f":"B!AI535","v":0},{"$f":"B!AJ535","v":0},{"$f":"B!AK535","v":0},""]
["VII","PROCEDIMIENTO O DETERMINACION DIRECTA C/PACIENTE",{"$f":"B!D547","v":0},{"$f":"B!E547","v":0},{"$f":"B!F547","v":0},{"$f":"B!G547","v":0},{"$f":"B!H547","v":0},{"$f":"B!AB547","v":0},{"$f":"B!AC547","v":0},{"$f":"B!AD547","v":0},{"$f":"B!AE547","v":0},{"$f":"B!AF547","v":0},{"$f":"B!AG547","v":0},{"$f":"B!AH547","v":0},{"$f":"B!AI547","v":0},{"$f":"B!AJ547","v":0},{"$f":"B!AK547","v":0},""]
["VIII  ","EX.  DE DEPOSICIONES EXUDADOS. SECREC. Y OTROS LIQ.  ",{"$f":"B!D610","v":0},{"$f":"B!E610","v":0},{"$f":"B!F610","v":0},{"$f":"B!G610","v":0},{"$f":"B!H610","v":0},{"$f":"B!AB610","v":0},{"$f":"B!AC610","v":0},{"$f":"B!AD610","v":0},{"$f":"B!AE610","v":0},{"$f":"B!AF610","v":0},{"$f":"B!AG610","v":0},{"$f":"B!AH610","v":0},{"$f":"B!AI610","v":0},{"$f":"B!AJ610","v":0},{"$f":"B!AK610","v":0},""]
["IX   ","ORINA",{"$f":"B!D645","v":0},{"$f":"B!E645","v":0},{"$f":"B!F645","v":0},{"$f":"B!G645","v":0},{"$f":"B!H645","v":0},{"$f":"B!AB645","v":0},{"$f":"B!AC645","v":0},{"$f":"B!AD645","v":0},{"$f":"B!AE645","v":0},{"$f":"B!AF645","v":0},{"$f":"B!AG645","v":0},{"$f":"B!AH645","v":0},{"$f":"B!AI645","v":0},{"$f":"B!AJ645","v":0},{"$f":"B!AK645","v":0},""]
["X","OTROS EXAMENES DE LABORATORIO",{"$f":"B!D3055","v":0},{"$f":"B!E3055","v":0},{"$f":"B!F3055","v":0},{"$f":"B!G3055","v":0},{"$f":"B!H3055","v":0},{"$f":"B!AB3055","v":0},{"$f":"B!AC3055","v":0},{"$f":"B!AD3055","v":0},{"$f":"B!AE3055","v":0},{"$f":"B!AF3055","v":0},{"$f":"B!AG3055","v":0},{"$f":"B!AH3055","v":0},{"$f":"B!AI3055","v":0},{"$f":"B!AJ3055","v":0},{"$f":"B!AK3055","v":0},""]
["TOTAL EXAMENES IMAGENOLOGIA",null,{"$f":"+C337+C338+C339+C340+C344+C345","v":0},0,0,0,0,0,0,0,0,0,0,0,0,0,0,""]
["I. a)","EX. RADIOLOGICOS SIMPLES",{"$f":"B!D705","v":0},{"$f":"B!E705","v":0},{"$f":"B!F705","v":0},{"$f":"B!G705","v":0},{"$f":"B!H705","v":0},{"$f":"B!AB705","v":0},{"$f":"B!AC705","v":0},{"$f":"B!AD705","v":0},{"$f":"B!AE705","v":0},{"$f":"B!AF705","v":0},{"$f":"B!AG705","v":0},{"$f":"B!AH705","v":0},{"$f":"B!AI705","v":0},{"$f":"B!AJ705","v":0},{"$f":"B!AK705","v":0},""]
["I. b)","EX. RADIOLOGICOS COMPLEJOS",{"$f":"B!D731","v":0},{"$f":"B!E731","v":0},{"$f":"B!F731","v":0},{"$f":"B!G731","v":0},{"$f":"B!H731","v":0},{"$f":"B!AB731","v":0},{"$f":"B!AC731","v":0},{"$f":"B!AD731","v":0},{"$f":"B!AE731","v":0},{"$f":"B!AF731","v":0},{"$f":"B!AG731","v":0},{"$f":"B!AH731","v":0},{"$f":"B!AI731","v":0},{"$f":"B!AJ731","v":0},{"$f":"B!AK731","v":0},""]
["II.","TOMOGRAFIA AXIAL COMP.",{"$f":"B!D761","v":0},{"$f":"B!E761","v":0},{"$f":"B!F761","v":0},{"$f":"B!G761","v":0},{"$f":"B!H761","v":0},{"$f":"B!AB761","v":0},{"$f":"B!AC761","v":0},{"$f":"B!AD761","v":0},{"$f":"B!AE761","v":0},{"$f":"B!AF761","v":0},{"$f":"B!AG761","v":0},{"$f":"B!AH761","v":0},{"$f":"B!AI761","v":0},{"$f":"B!AJ761","v":0},{"$f":"B!AK761","v":0},""]
["III","ULTRASONOGRAFIA",{"$f":"SUM(C341:C343)","v":0},{"$f":"SUM(D341:D343)","v":0},{"$f":"SUM(E341:E343)","v":0},0,0,0,0,0,0,0,0,{"$f":"SUM(N341:N343)","v":0},0,0,0,""]
[null,"Ecotomografias ( Sin Ecografía Obstetr. Y Abdominal )",{"$f":"B!D783-B!D763-B!D764","v":0},{"$f":"B!E783-B!E763-B!E764","v":0},{"$f":"B!F783-B!F763-B!F764","v":0},{"$f":"B!G783-B!G763-B!G764","v":0},{"$f":"B!H783-B!H763-B!H764","v":0},{"$f":"B!AB783-B!AB763-B!AB764","v":0},{"$f":"B!AC783-B!AC763-B!AC764","v":0},{"$f":"B!AD783-B!AD763-B!AD764","v":0},{"$f":"B!AE783-B!AE763-B!AE764","v":0},{"$f":"B!AF783-B!AF763-B!AF764","v":0},{"$f":"B!AG783-B!AG763-B!AG764","v":0},{"$f":"B!AH783-B!AH763-B!AH764","v":0},{"$f":"B!AI783-B!AI763-B!AI764","v":0},{"$f":"B!AJ783-B!AJ763-B!AJ764","v":0},{"$f":"B!AK783-B!AK763-B!AK764","v":0},""]
[null,"Ecografías Obstétricas",{"$f":"B!D763","v":0},{"$f":"B!E763","v":0},{"$f":"B!F763","v":0},{"$f":"B!G763","v":0},{"$f":"B!H763","v":0},{"$f":"B!AB763","v":0},{"$f":"B!AC763","v":0},{"$f":"B!AD763","v":0},{"$f":"B!AE763","v":0},{"$f":"B!AF763","v":0},{"$f":"B!AG763","v":0},{"$f":"B!AH763","v":0},{"$f":"B!AI763","v":0},{"$f":"B!AJ763","v":0},{"$f":"B!AK763","v":0},""]
[null,"Ecotomografias abdominal ",{"$f":"B!D764","v":0},{"$f":"B!E764","v":0},{"$f":"B!F764","v":0},{"$f":"B!G764","v":0},{"$f":"B!H764","v":0},{"$f":"B!AB764","v":0},{"$f":"B!AC764","v":0},{"$f":"B!AD764","v":0},{"$f":"B!AE764","v":0},{"$f":"B!AF764","v":0},{"$f":"B!AG764","v":0},{"$f":"B!AH764","v":0},{"$f":"B!AI764","v":0},{"$f":"B!AJ764","v":0},{"$f":"B!AK764","v":0},""]
["IV","RESONANCIA MAGNÉTICA ",{"$f":"B!D817","v":0},{"$f":"B!E817","v":0},{"$f":"B!F817","v":0},{"$f":"B!G817","v":0},{"$f":"B!H817","v":0},{"$f":"B!AB817","v":0},{"$f":"B!AC817","v":0},{"$f":"B!AD817","v":0},{"$f":"B!AE817","v":0},{"$f":"B!AF817","v":0},{"$f":"B!AG817","v":0},{"$f":"B!AH817","v":0},{"$f":"B!AI817","v":0},{"$f":"B!AJ817","v":0},{"$f":"B!AK817","v":0},""]
[null,"OTROS EXÁMENES DE IMÁGENES",{"$f":"B!D880","v":0},{"$f":"B!E880","v":0},{"$f":"B!F880","v":0},{"$f":"B!G880","v":0},{"$f":"B!H880","v":0},{"$f":"B!AB880","v":0},{"$f":"B!AC880","v":0},{"$f":"B!AD880","v":0},{"$f":"B!AE880","v":0},{"$f":"B!AF880","v":0},{"$f":"B!AG880","v":0},{"$f":"B!AH880","v":0},{"$f":"B!AI880","v":0},{"$f":"B!AJ880","v":0},{"$f":"B!AK880","v":0},""]
["TOMA DE MUESTRAS",null,{"$f":"B!D563","v":0},{"$f":"B!E563","v":0},{"$f":"B!F563","v":0},{"$f":"B!G563","v":0},{"$f":"B!H563","v":0},{"$f":"B!AB563","v":0},{"$f":"B!AC563","v":0},{"$f":"B!AD563","v":0},{"$f":"B!AE563","v":0},{"$f":"B!AF563","v":0},{"$f":"B!AG563","v":0},{"$f":"B!AH563","v":0},{"$f":"B!AI563","v":0},{"$f":"B!AJ563","v":0},{"$f":"B!AK563","v":0},""]
["TOTAL EXAMENES ANATOMIA PATOLOGICA",null,{"$f":"B!D1075","v":0},{"$f":"B!E1075","v":0},{"$f":"B!F1075","v":0},{"$f":"B!G1075","v":0},{"$f":"B!H1075","v":0},{"$f":"B!AB1075","v":0},{"$f":"B!AC1075","v":0},{"$f":"B!AD1075","v":0},{"$f":"B!AE1075","v":0},{"$f":"B!AF1075","v":0},{"$f":"B!AG1075","v":0},{"$f":"B!AH1075","v":0},{"$f":"B!AI1075","v":0},{"$f":"B!AJ1075","v":0},{"$f":"B!AK1075","v":0},""]
["SECCION B:  MEDICINA NUCLEAR Y RADIOTERAPIA"]
["TIPO DE PROCEDIMIENTO",null,"TOTAL","PROCEDIMIENTOS",{"$nulls":3},"PROCEDENCIA",null,null,"PRODUCCION INTRA HOSPITAL",null,null,"OPERATIVO","COMPRAS REALIZADAS",null,"VENTAS DE SERVICIOS"]
[{"$nulls":3},"TOTAL BENEFICIARIOS","BENEFICIARIOS",null,"NO BENEFICIARIOS","ATENCION CERRADA","ATENCION ABIERTA","EMERGENCIA","POR \nHONORARIOS","POR CONVENIOS","POR\nCONSULTORES\nDE LLAMADA",null,"AL SISTEMA ","EXTRA-SISTEMA"]
[{"$nulls":4},"MAI","MLE"]
["I) MEDICINA NUCLEAR"]
["A) PROCEDIMIENTOS DIAGNOSTICOS"]
["1) ESTUDIOS ESTATICOS",null,{"$f":"SUM(B!D887,B!D894,B!D898,B!D905,B!D914)","v":0},{"$f":"SUM(B!E887,B!E894,B!E898,B!E905,B!E914)","v":0},{"$f":"SUM(B!F887,B!F894,B!F898,B!F905,B!F914)","v":0},{"$f":"SUM(B!G887,B!G894,B!G898,B!G905,B!G914)","v":0},{"$f":"SUM(B!H887,B!H894,B!H898,B!H905,B!H914)","v":0},{"$f":"SUM(B!AB887,B!AB894,B!AB898,B!AB905,B!AB914)","v":0},{"$f":"SUM(B!AC887,B!AC894,B!AC898,B!AC905,B!AC914)","v":0},{"$f":"SUM(B!AD887,B!AD894,B!AD898,B!AD905,B!AD914)","v":0},{"$f":"SUM(B!AE887,B!AE894,B!AE898,B!AE905,B!AE914)","v":0},{"$f":"SUM(B!AF887,B!AF894,B!AF898,B!AF905,B!AF914)","v":0},{"$f":"SUM(B!AG887,B!AG894,B!AG898,B!AG905,B!AG914)","v":0},{"$f":"SUM(B!AH887,B!AH894,B!AH898,B!AH905,B!AH914)","v":0},{"$f":"SUM(B!AI887,B!AI894,B!AI898,B!AI905,B!AI914)","v":0},{"$f":"SUM(B!AJ887,B!AJ894,B!AJ898,B!AJ905,B!AJ914)","v":0},{"$f":"SUM(B!AK887,B!AK894,B!AK898,B!AK905,B!AK914)","v":0},{"$f":"IF((C354)<D354,\"ERROR EN PREVISION\",IF((H354+I354+J354)<>C354,\"ERROR EN PROCEDENCIA\",\"\"))","v":""}]
["2) ESTUDIOS DINAMICOS",null,{"$f":"SUM(B!D918,B!D922,B!D926,B!D934,B!D937)","v":0},{"$f":"SUM(B!E918,B!E922,B!E926,B!E934,B!E937)","v":0},{"$f":"SUM(B!F918,B!F922,B!F926,B!F934,B!F937)","v":0},{"$f":"SUM(B!G918,B!G922,B!G926,B!G934,B!G937)","v":0},{"$f":"SUM(B!H918,B!H922,B!H926,B!H934,B!H937)","v":0},{"$f":"SUM(B!AB918,B!AB922,B!AB926,B!AB934,B!AB937)","v":0},{"$f":"SUM(B!AC918,B!AC922,B!AC926,B!AC934,B!AC937)","v":0},{"$f":"SUM(B!AD918,B!AD922,B!AD926,B!AD934,B!AD937)","v":0},{"$f":"SUM(B!AE918,B!AE922,B!AE926,B!AE934,B!AE937)","v":0},{"$f":"SUM(B!AF918,B!AF922,B!AF926,B!AF934,B!AF937)","v":0},{"$f":"SUM(B!AG918,B!AG922,B!AG926,B!AG934,B!AG937)","v":0},{"$f":"SUM(B!AH918,B!AH922,B!AH926,B!AH934,B!AH937)","v":0},{"$f":"SUM(B!AI918,B!AI922,B!AI926,B!AI934,B!AI937)","v":0},{"$f":"SUM(B!AJ918,B!AJ922,B!AJ926,B!AJ934,B!AJ937)","v":0},{"$f":"SUM(B!AK918,B!AK922,B!AK926,B!AK934,B!AK937)","v":0},""]
["B) PROCEDIMIENTOS TERAPEUTICOS"]
["1) RADIOISOTOPOS",null,{"$f":"B!D945","v":0},{"$f":"B!E945","v":0},{"$f":"B!F945","v":0},{"$f":"B!G945","v":0},{"$f":"B!H945","v":0},{"$f":"B!AB945","v":0},{"$f":"B!AC945","v":0},{"$f":"B!AD945","v":0},{"$f":"B!AE945","v":0},{"$f":"B!AF945","v":0},{"$f":"B!AG945","v":0},{"$f":"B!AH945","v":0},{"$f":"B!AI945","v":0},{"$f":"B!AJ945","v":0},{"$f":"B!AK945","v":0},""]
["II) RADIOTERAPIA"]
["BRAQUITERAPIA",null,{"$f":"B!D950","v":0},{"$f":"B!E950","v":0},{"$f":"B!F950","v":0},{"$f":"B!G950","v":0},{"$f":"B!H950","v":0},{"$f":"B!AB950","v":0},{"$f":"B!AC950","v":0},{"$f":"B!AD950","v":0},{"$f":"B!AE950","v":0},{"$f":"B!AF950","v":0},{"$f":"B!AG950","v":0},{"$f":"B!AH950","v":0},{"$f":"B!AI950","v":0},{"$f":"B!AJ950","v":0},{"$f":"B!AK950","v":0},""]
["RADIOTERAPIA C/ACELERADOR",null,{"$f":"B!D968","v":0},{"$f":"B!E968","v":0},{"$f":"B!F968","v":0},{"$f":"B!G968","v":0},{"$f":"B!H968","v":0},{"$f":"B!AB968","v":0},{"$f":"B!AC968","v":0},{"$f":"B!AD968","v":0},{"$f":"B!AE968","v":0},{"$f":"B!AF968","v":0},{"$f":"B!AG968","v":0},{"$f":"B!AH968","v":0},{"$f":"B!AI968","v":0},{"$f":"B!AJ968","v":0},{"$f":"B!AK968","v":0},""]
["TELECOBALTOTERAPIA",null,{"$f":"B!D986","v":0},{"$f":"B!E986","v":0},{"$f":"B!F986","v":0},{"$f":"B!G986","v":0},{"$f":"B!H986","v":0},{"$f":"B!AB986","v":0},{"$f":"B!AC986","v":0},{"$f":"B!AD986","v":0},{"$f":"B!AE986","v":0},{"$f":"B!AF986","v":0},{"$f":"B!AG986","v":0},{"$f":"B!AH986","v":0},{"$f":"B!AI986","v":0},{"$f":"B!AJ986","v":0},{"$f":"B!AK986","v":0},""]
["TOTAL PROCEDIMIENTOS",null,{"$f":"SUM(C354+C355+C357+C359+C360+C361)","v":0},{"$f":"SUM(D354+D355+D357+D359+D360+D361)","v":0},0,0,0,0,0,0,0,0,0,0,0,0,0,""]
["SECCION C:  HEMODIALISIS"]
["TIPO DE HEMODIALISIS",null,"TOTAL","PROCEDIMIENTOS",{"$nulls":3},"PROCEDENCIA",null,null,"PRODUCCION INTRA HOSPITAL",null,null,"OPERATIVO","COMPRAS REALIZADAS",null,"VENTAS DE SERVICIOS"]
[{"$nulls":3},"TOTAL BENEFI-CIARIOS","BENEFICIARIOS",null,"NO BENEFI-CIARIOS","ATENCION CERRADA","ATENCION ABIERTA","EMERGENCIA","POR \nHONORARIOS","POR CONVENIOS","POR\nCONSULTORES\nDE LLAMADA",null,"AL SISTEMA ","EXTRA-SISTEMA"]
[{"$nulls":4},"MAI","MLE"]
[1901023,"Hemodiálisis con insumos incluidos",{"$f":"B!D2223","v":0},{"$f":"B!E2223","v":0},{"$f":"B!F2223","v":0},{"$f":"B!G2223","v":0},{"$f":"B!H2223","v":0},{"$f":"B!AB2223","v":0},{"$f":"B!AC2223","v":0},{"$f":"B!AD2223","v":0},{"$f":"B!AE2223","v":0},{"$f":"B!AF2223","v":0},{"$f":"B!AG2223","v":0},{"$f":"B!AH2223","v":0},{"$f":"B!AI2223","v":0},{"$f":"B!AJ2223","v":0},{"$f":"B!AK2223","v":0},{"$f":"IF((C367)<D367,\"ERROR EN PREVISION\",IF((H367+I367+J367)<>C367,\"ERROR EN PROCEDENCIA\",\"\"))","v":""}]
[1901024,"Hemodiálisis sin insumos",{"$f":"B!D2224","v":0},{"$f":"B!E2224","v":0},{"$f":"B!F2224","v":0},{"$f":"B!G2224","v":0},{"$f":"B!H2224","v":0},{"$f":"B!AB2224","v":0},{"$f":"B!AC2224","v":0},{"$f":"B!AD2224","v":0},{"$f":"B!AE2224","v":0},{"$f":"B!AF2224","v":0},{"$f":"B!AG2224","v":0},{"$f":"B!AH2224","v":0},{"$f":"B!AI2224","v":0},{"$f":"B!AJ2224","v":0},{"$f":"B!AK2224","v":0},""]
[1901025,"Peritoneodiálisis  (incluye insumos)",{"$f":"B!D2225","v":0},{"$f":"B!E2225","v":0},{"$f":"B!F2225","v":0},{"$f":"B!G2225","v":0},{"$f":"B!H2225","v":0},{"$f":"B!AB2225","v":0},{"$f":"B!AC2225","v":0},{"$f":"B!AD2225","v":0},{"$f":"B!AE2225","v":0},{"$f":"B!AF2225","v":0},{"$f":"B!AG2225","v":0},{"$f":"B!AH2225","v":0},{"$f":"B!AI2225","v":0},{"$f":"B!AJ2225","v":0},{"$f":"B!AK2225","v":0},""]
[1901026,"Peritoneodiálisis continua en paciente crónico (adulto o niños) (tratamiento mensual)",{"$f":"B!D2226","v":0},{"$f":"B!E2226","v":0},{"$f":"B!F2226","v":0},{"$f":"B!G2226","v":0},{"$f":"B!H2226","v":0},{"$f":"B!AB2226","v":0},{"$f":"B!AC2226","v":0},{"$f":"B!AD2226","v":0},{"$f":"B!AE2226","v":0},{"$f":"B!AF2226","v":0},{"$f":"B!AG2226","v":0},{"$f":"B!AH2226","v":0},{"$f":"B!AI2226","v":0},{"$f":"B!AJ2226","v":0},{"$f":"B!AK2226","v":0},""]
[1901126,"Instalación de cateter para peritoneodiális",{"$f":"B!D2227","v":0},{"$f":"B!E2227","v":0},{"$f":"B!F2227","v":0},{"$f":"B!G2227","v":0},{"$f":"B!H2227","v":0},{"$f":"B!AB2227","v":0},{"$f":"B!AC2227","v":0},{"$f":"B!AD2227","v":0},{"$f":"B!AE2227","v":0},{"$f":"B!AF2227","v":0},{"$f":"B!AG2227","v":0},{"$f":"B!AH2227","v":0},{"$f":"B!AI2227","v":0},{"$f":"B!AJ2227","v":0},{"$f":"B!AK2227","v":0},""]
[1901027,"Hemodiálisis, tratamiento mensual (con insumos incluidos)",{"$f":"B!D2228","v":0},{"$f":"B!E2228","v":0},{"$f":"B!F2228","v":0},{"$f":"B!G2228","v":0},{"$f":"B!H2228","v":0},{"$f":"B!AB2228","v":0},{"$f":"B!AC2228","v":0},{"$f":"B!AD2228","v":0},{"$f":"B!AE2228","v":0},{"$f":"B!AF2228","v":0},{"$f":"B!AG2228","v":0},{"$f":"B!AH2228","v":0},{"$f":"B!AI2228","v":0},{"$f":"B!AJ2228","v":0},{"$f":"B!AK2228","v":0},""]
[1901028,"Hemodiálisis con bicarbonato con insumos (por sesion)",{"$f":"B!D2229","v":0},{"$f":"B!E2229","v":0},{"$f":"B!F2229","v":0},{"$f":"B!G2229","v":0},{"$f":"B!H2229","v":0},{"$f":"B!AB2229","v":0},{"$f":"B!AC2229","v":0},{"$f":"B!AD2229","v":0},{"$f":"B!AE2229","v":0},{"$f":"B!AF2229","v":0},{"$f":"B!AG2229","v":0},{"$f":"B!AH2229","v":0},{"$f":"B!AI2229","v":0},{"$f":"B!AJ2229","v":0},{"$f":"B!AK2229","v":0},""]
[1901029,"Hemodiálisis con bicarbonato con insumos (tratamiento mensual)",{"$f":"B!D2230","v":0},{"$f":"B!E2230","v":0},{"$f":"B!F2230","v":0},{"$f":"B!G2230","v":0},{"$f":"B!H2230","v":0},{"$f":"B!AB2230","v":0},{"$f":"B!AC2230","v":0},{"$f":"B!AD2230","v":0},{"$f":"B!AE2230","v":0},{"$f":"B!AF2230","v":0},{"$f":"B!AG2230","v":0},{"$f":"B!AH2230","v":0},{"$f":"B!AI2230","v":0},{"$f":"B!AJ2230","v":0},{"$f":"B!AK2230","v":0},""]
["TOTAL",null,{"$f":"SUM(C367:C374)","v":0},{"$f":"SUM(D367:D374)","v":0},{"$f":"SUM(E367:E374)","v":0},0,0,0,0,0,0,0,0,0,0,0,0,""]
["SECCION D: INTERVENCIONES QUIRURGICAS"]
["TIPO DE INTERVENCION QUIRURGICA",null,"TOTAL PRODUCCIÓN","TOTAL BENEFICIARIOS","INTERVENCIONES QUIRÚRGICAS",{"$nulls":5},"CIRUGÍAS MENORES","PRODUCCION INTRA HOSPITAL",null,null,"OPERATIVO","COMPRAS REALIZADAS",null,"VENTAS DE SERVICIOS"]
[{"$nulls":4},"PRINCIPAL",null,null,"SECUNDARIA"]
[{"$nulls":4},"MAI","MLE","NO BENEFI-CIARIOS","MAI","MLE","NO BENEFI-CIARIOS",null,"POR \nHONORARIOS","POR CONVENIOS","POR\nCONSULTORES\nDE LLAMADA",null,"AL SISTEMA ","EXTRA-SISTEMA"]
["I","NEUROCIRUGIA",{"$f":"B!D1246","v":0},{"$f":"B!I1246","v":0},{"$f":"B!J1246","v":0},{"$f":"B!K1246","v":0},{"$f":"B!L1246","v":0},{"$f":"B!M1246","v":0},{"$f":"B!N1246","v":0},{"$f":"B!O1246","v":0},null,{"$f":"B!AE1246","v":0},{"$f":"B!AF1246","v":0},{"$f":"B!AG1246","v":0},{"$f":"B!AH1246","v":0},{"$f":"B!AI1246","v":0},{"$f":"B!AJ1246","v":0},{"$f":"B!AK1246","v":0}]
["II","CIRUGIA OFTALMOLOGICA",{"$f":"B!D1383","v":0},{"$f":"B!I1383","v":0},{"$f":"B!J1383","v":0},{"$f":"B!K1383","v":0},{"$f":"B!L1383","v":0},{"$f":"B!M1383","v":0},{"$f":"B!N1383","v":0},{"$f":"B!O1383","v":0},{"$f":"SUM(B!D1305:'B'!D1310,B!D1314:'B'!D1316,B!D1318:'B'!D1320,B!D1322:'B'!D1324,B!D1326,B!D1328:'B'!D1331,B!D1333:'B'!D1334,B!D1348:'B'!D1349,B!D1363,B!D1365:'B'!D1366,B!D1378:'B'!D1381)","v":0},{"$f":"B!AE1383","v":0},{"$f":"B!AF1383","v":0},{"$f":"B!AG1383","v":0},{"$f":"B!AH1383","v":0},{"$f":"B!AI1383","v":0},{"$f":"B!AJ1383","v":0},{"$f":"B!AK1383","v":0}]
["III","CIRUGIA OTORRINOLOGICA",{"$f":"B!D1525","v":0},{"$f":"B!I1525","v":0},{"$f":"B!J1525","v":0},{"$f":"B!K1525","v":0},{"$f":"B!L1525","v":0},{"$f":"B!M1525","v":0},{"$f":"B!N1525","v":0},{"$f":"B!O1525","v":0},{"$f":"SUM(B!D1450:'B'!D1454,B!D1457,B!D1471:'B'!D1476,B!D1479:'B'!D1480,B!D1487:'B'!D1488,B!D1490:'B'!D1491,B!D1495,B!D1497:'B'!D1498,B!D1505,B!D1508,B!D1511:'B'!D1512,B!D1519)","v":0},{"$f":"B!AE1525","v":0},{"$f":"B!AF1525","v":0},{"$f":"B!AG1525","v":0},{"$f":"B!AH1525","v":0},{"$f":"B!AI1525","v":0},{"$f":"B!AJ1525","v":0},{"$f":"B!AK1525","v":0}]
["IV","CIRUGIA DE CABEZA Y CUELLO",{"$f":"B!D1589","v":0},{"$f":"B!I1589","v":0},{"$f":"B!J1589","v":0},{"$f":"B!K1589","v":0},{"$f":"B!L1589","v":0},{"$f":"B!M1589","v":0},{"$f":"B!N1589","v":0},{"$f":"B!O1589","v":0},{"$f":"SUM(B!D1548,B!D1550:'B'!D1551,B!D1555:'B'!D1556,B!D1558,B!D1582,B!D1584,B!D1587:'B'!D1588)","v":0},{"$f":"B!AE1589","v":0},{"$f":"B!AF1589","v":0},{"$f":"B!AG1589","v":0},{"$f":"B!AH1589","v":0},{"$f":"B!AI1589","v":0},{"$f":"B!AJ1589","v":0},{"$f":"B!AK1589","v":0}]
["V","CIRUGIA PLASTICA Y REPARADORA",{"$f":"B!D1658","v":0},{"$f":"B!I1658","v":0},{"$f":"B!J1658","v":0},{"$f":"B!K1658","v":0},{"$f":"B!L1658","v":0},{"$f":"B!M1658","v":0},{"$f":"B!N1658","v":0},{"$f":"B!O1658","v":0},{"$f":"SUM(B!D1592:'B'!D1598,B!D1603,B!D1605,B!D1616:'B'!D1617,B!D1648,B!D1652:'B'!D1655)","v":0},{"$f":"B!AE1658","v":0},{"$f":"B!AF1658","v":0},{"$f":"B!AG1658","v":0},{"$f":"B!AH1658","v":0},{"$f":"B!AI1658","v":0},{"$f":"B!AJ1658","v":0},{"$f":"B!AK1658","v":0}]
["VI","TEGUMENTOS",{"$f":"B!D1703","v":0},{"$f":"B!I1703","v":0},{"$f":"B!J1703","v":0},{"$f":"B!K1703","v":0},{"$f":"B!L1703","v":0},{"$f":"B!M1703","v":0},{"$f":"B!N1703","v":0},{"$f":"B!O1703","v":0},{"$f":"SUM(B!D1679:'B'!D1701)","v":0},{"$f":"B!AE1703","v":0},{"$f":"B!AF1703","v":0},{"$f":"B!AG1703","v":0},{"$f":"B!AH1703","v":0},{"$f":"B!AI1703","v":0},{"$f":"B!AJ1703","v":0},{"$f":"B!AK1703","v":0}]
["VII","CIRUGIA CARDIOVASCULAR",{"$f":"B!D1921","v":0},{"$f":"B!I1921","v":0},{"$f":"B!J1921","v":0},{"$f":"B!K1921","v":0},{"$f":"B!L1921","v":0},{"$f":"B!M1921","v":0},{"$f":"B!N1921","v":0},{"$f":"B!O1921","v":0},{"$f":"SUM(B!D1865,B!D1876,B!D1877)","v":0},{"$f":"B!AE1921","v":0},{"$f":"B!AF1921","v":0},{"$f":"B!AG1921","v":0},{"$f":"B!AH1921","v":0},{"$f":"B!AI1921","v":0},{"$f":"B!AJ1921","v":0},{"$f":"B!AK1921","v":0}]
["VIII","CIRUGIA DE TORAX",{"$f":"B!D1991","v":0},{"$f":"B!I1991","v":0},{"$f":"B!J1991","v":0},{"$f":"B!K1991","v":0},{"$f":"B!L1991","v":0},{"$f":"B!IM991","v":0},{"$f":"B!N1991","v":0},{"$f":"B!O1991","v":0},{"$f":"B!D1950","v":0},{"$f":"B!AE1991","v":0},{"$f":"B!AF1991","v":0},{"$f":"B!AG1991","v":0},{"$f":"B!AH1991","v":0},{"$f":"B!AI1991","v":0},{"$f":"B!AJ1991","v":0},{"$f":"B!AK1991","v":0}]
["IX","CIRUGIA ABDOMINAL",{"$f":"B!D2153","v":0},{"$f":"B!I2153","v":0},{"$f":"B!J2153","v":0},{"$f":"B!K2153","v":0},{"$f":"B!L2153","v":0},{"$f":"B!M2153","v":0},{"$f":"B!N2153","v":0},{"$f":"B!O2153","v":0},null,{"$f":"B!AE2153","v":0},{"$f":"B!AF2153","v":0},{"$f":"B!AG2153","v":0},{"$f":"B!AH2153","v":0},{"$f":"B!AI2153","v":0},{"$f":"B!AJ2153","v":0},{"$f":"B!AK2153","v":0}]
["X","CIRUGIA PROCTOLOGICA",{"$f":"B!D2192","v":0},{"$f":"B!I2192","v":0},{"$f":"B!J2192","v":0},{"$f":"B!K2192","v":0},{"$f":"B!L2192","v":0},{"$f":"B!M2192","v":0},{"$f":"B!N2192","v":0},{"$f":"B!O2192","v":0},{"$f":"SUM(B!D2156:'B'!D2157,B!D2159,B!D2161,B!D2173,B!D2190)","v":0},{"$f":"B!AE2192","v":0},{"$f":"B!AF2192","v":0},{"$f":"B!AG2192","v":0},{"$f":"B!AH2192","v":0},{"$f":"B!AI2192","v":0},{"$f":"B!AJ2192","v":0},{"$f":"B!AK2192","v":0}]
["XI","CIRUGIA UROLOGICA Y SUPRARRENAL",{"$f":"B!D2316","v":0},{"$f":"B!I2316","v":0},{"$f":"B!J2316","v":0},{"$f":"B!K2316","v":0},{"$f":"B!L2316","v":0},{"$f":"B!M2316","v":0},{"$f":"B!N2316","v":0},{"$f":"B!O2316","v":0},{"$f":"SUM(B!D2310,B!D2314)","v":0},{"$f":"B!AE2316","v":0},{"$f":"B!AF2316","v":0},{"$f":"B!AG2316","v":0},{"$f":"B!AH2316","v":0},{"$f":"B!AI2316","v":0},{"$f":"B!AJ2316","v":0},{"$f":"B!AK2316","v":0}]
["XII","CIRUGIA DE LA MAMA",{"$f":"B!D2349","v":0},{"$f":"B!I2349","v":0},{"$f":"B!J2349","v":0},{"$f":"B!K2349","v":0},{"$f":"B!L2349","v":0},{"$f":"B!M2349","v":0},{"$f":"B!N2349","v":0},{"$f":"B!O2349","v":0},{"$f":"B!D2345","v":0},{"$f":"B!AE2349","v":0},{"$f":"B!AF2349","v":0},{"$f":"B!AG2349","v":0},{"$f":"B!AH2349","v":0},{"$f":"B!AI2349","v":0},{"$f":"B!AJ2349","v":0},{"$f":"B!AK2349","v":0}]
["XIII","CIRUGIA GINECOLOGICA",{"$f":"B!D2384","v":0},{"$f":"B!I2384","v":0},{"$f":"B!J2384","v":0},{"$f":"B!K2384","v":0},{"$f":"B!L2384","v":0},{"$f":"B!M2384","v":0},{"$f":"B!N2384","v":0},{"$f":"B!O2384","v":0},{"$f":"SUM(B!D2371,B!D2380)","v":0},{"$f":"B!AE2384","v":0},{"$f":"B!AF2384","v":0},{"$f":"B!AG2384","v":0},{"$f":"B!AH2384","v":0},{"$f":"B!AI2384","v":0},{"$f":"B!AJ2384","v":0},{"$f":"B!AK2384","v":0}]
["XIV","CIRUGIA OBSTETRICA",{"$f":"SUM(C394:C395)","v":0},{"$f":"SUM(D394:D395)","v":0},{"$f":"(E394+E395)","v":0},{"$f":"(F394+F395)","v":0},{"$f":"(G394+G395)","v":0},0,0,0,null,{"$f":"(L394+L395)","v":0},0,0,0,0,0,0]
[null,"CESAREA CON HISTERECTOMIA (2004005)",{"$f":"B!D2389","v":0},{"$f":"B!I2389","v":0},{"$f":"B!J2389","v":0},{"$f":"B!K2389","v":0},{"$f":"B!L2389","v":0},{"$f":"B!M2389","v":0},{"$f":"B!N2389","v":0},{"$f":"B!O2389","v":0},null,{"$f":"B!AE2389","v":0},{"$f":"B!AF2389","v":0},{"$f":"B!AG2389","v":0},{"$f":"B!AH2389","v":0},{"$f":"B!AI2389","v":0},{"$f":"B!AJ2389","v":0},{"$f":"B!AK2389","v":0}]
[null,"CESAREA CON/SIN SALPINGOLIGADURA O SALPINGECTOMIA (2004006)",{"$f":"B!D2388","v":0},{"$f":"B!I2388","v":0},{"$f":"B!J2388","v":0},{"$f":"B!K2388","v":0},{"$f":"B!L2388","v":0},{"$f":"B!M2388","v":0},{"$f":"B!N2388","v":0},{"$f":"B!O2388","v":0},null,{"$f":"B!AE2388","v":0},{"$f":"B!AF2388","v":0},{"$f":"B!AG2388","v":0},{"$f":"B!AH2388","v":0},{"$f":"B!AI2388","v":0},{"$f":"B!AJ2388","v":0},{"$f":"B!AK2388","v":0}]
[]
["XV.I","TRAUMATOLOGIA",{"$f":"B!D2625","v":0},{"$f":"B!I2625","v":0},{"$f":"B!J2625","v":0},{"$f":"B!K2625","v":0},{"$f":"B!L2625","v":0},{"$f":"B!M2625","v":0},{"$f":"B!N2625","v":0},{"$f":"B!O2625","v":0},{"$f":"SUM(B!D2413:'B'!D2419,B!D2421,B!D2431:'B'!D2432,B!D2444,B!D2446:'B'!D2449,B!D2499,B!D2501,B!D2504:'B'!D2506,B!D2510:'B'!D2511,B!D2520,B!D2575)","v":0},{"$f":"B!AE2625","v":0},{"$f":"B!AF2625","v":0},{"$f":"B!AG2625","v":0},{"$f":"B!AH2625","v":0},{"$f":"B!AI2625","v":0},{"$f":"B!AJ2625","v":0},{"$f":"B!AK2625","v":0}]
["XVI","ODONTOLOGIA (COD 27-03) Aranc.Fonasa",{"$f":"B!D2801-B!D2797-B!D2798+B!D2774","v":0},{"$f":"B!I2801-B!I2797-B!I2798+B!I2774","v":0},{"$f":"B!J2801-B!J2797-B!J2798+B!J2774","v":0},{"$f":"B!K2801-B!K2797-B!K2798+B!K2774","v":0},{"$f":"B!L2801-B!L2797-B!L2798+B!L2774","v":0},{"$f":"B!M2801-B!M2797-B!M2798+B!M2774","v":0},{"$f":"B!N2801-B!N2797-B!N2798+B!N2774","v":0},{"$f":"B!O2801-B!O2797-B!O2798+B!O2774","v":0},{"$f":"SUM(B!D2777,B!D2782,B!D2784,B!D2787:'B'!D2788,B!D2790:'B'!D2794,B!D2765:'B'!D2773)","v":0},{"$f":"B!AE2801-B!AE2797-B!AE2798+B!AE2774","v":0},{"$f":"B!AF2801-B!AF2797-B!AF2798+B!AF2774","v":0},{"$f":"B!AG2801-B!AG2797-B!AG2798+B!AG2774","v":0},{"$f":"B!AH2801-B!AH2797-B!AH2798+B!AH2774","v":0},{"$f":"B!AI2801-B!AI2797-B!AI2798+B!AI2774","v":0},{"$f":"B!AJ2801-B!AJ2797-B!AJ2798+B!AJ2774","v":0},{"$f":"B!AK2801-B!AK2797-B!AK2798+B!AK2774","v":0}]
["XVI","RETIRO ELEMENTOS OSTEOSINTESIS",{"$f":"B!D2630","v":0},{"$f":"B!I2630","v":0},{"$f":"B!J2630","v":0},{"$f":"B!K2630","v":0},{"$f":"B!L2630","v":0},{"$f":"B!M2630","v":0},{"$f":"B!N2630","v":0},{"$f":"B!O2630","v":0},null,{"$f":"B!AE2630","v":0},{"$f":"B!AF2630","v":0},{"$f":"B!AG2630","v":0},{"$f":"B!AH2630","v":0},{"$f":"B!AI2630","v":0},{"$f":"B!AJ2630","v":0},{"$f":"B!AK2630","v":0}]
["TOTAL INTERVENCIONES QUIRURGICAS",null,{"$f":"SUM(C380:C393)+C397+C398+C399","v":0},{"$f":"SUM(D380:D393)+D397+D398+D399","v":0},{"$f":"SUM(E380:E393)+E397+E398+E399","v":0},{"$f":"SUM(F380:F393)+F397+F398+F399","v":0},{"$f":"SUM(G380:G393)+G397+G398+G399","v":0},{"$f":"SUM(H380:H393)+H397+H398+H399","v":0},0,0,0,0,0,0,0,0,0,0]
["SECCIÓN E: INTERVENCIONES QUIRÚRGICAS POR TIPO DE INTERVENCIÓN "]
["TIPO DE INTERVENCIÓN",null,"TOTAL","BENEFICIARIOS MAI","< 15 AÑOS","15 AÑOS Y MAS","COMPRAS REALIZADAS AL SISTEMA ","COMPRAS REALIZADAS AL SISTEMA","COMPRAS REALIZADAS AL EXTRA-SISTEMA","COMPRAS REALIZADAS AL EXTRA-SISTEMA"]
[{"$nulls":6},"< 15 AÑOS","15 AÑOS Y MAS","< 15 AÑOS","15 AÑOS Y MAS"]
["ELECTIVAS MAYORES NO AMBULATORIAS ",null,{"$f":"SUM(E404,F404)","v":0},null,{"$f":"SUM(B!Q1246,B!Q1383,B!Q1525,B!Q1589,B!Q1658,B!Q1703,B!Q1908,B!Q1920,B!Q1991,B!Q2153,B!Q2192,B!Q2316,B!Q2349,B!Q2384,B!Q2392,B!Q2625,B!Q2630,B!Q2775,B!Q2801)","v":0},{"$f":"SUM(B!R1246,B!R1383,B!R1525,B!R1589,B!R1658,B!R1703,B!R1908,B!R1920,B!R1991,B!R2153,B!R2192,B!R2316,B!R2349,B!R2384,B!R2392,B!R2625,B!R2630,B!R2775,B!R2801)","v":0},{"$nulls":4},{"$f":"AA404","v":""},{"$nulls":15},{"$f":"IF(C404<D404,\"Beneficiarios MAI no puede ser mayor al TOTAL\",\"\")","v":""},{"$f":"IF(C404<D404,1,0)","v":0}]
["ELECTIVAS MAYORES AMBULATORIAS ",null,{"$f":"SUM(E405,F405)","v":0},null,{"$f":"SUM(B!T1246,B!T1383,B!T1525,B!T1589,B!T1658,B!T1703,B!T1908,B!T1920,B!T1991,B!T2153,B!T2192,B!T2316,B!T2349,B!T2384,B!T2392,B!T2625,B!T2630,B!T2775,B!T2801)","v":0},{"$f":"SUM(B!U1246,B!U1383,B!U1525,B!U1589,B!U1658,B!U1703,B!U1908,B!U1920,B!U1991,B!U2153,B!U2192,B!U2316,B!U2349,B!U2384,B!U2392,B!U2625,B!U2630,B!U2775,B!U2801)","v":0},{"$nulls":4},{"$f":"AA405","v":""},{"$nulls":15},{"$f":"IF(C405<D405,\"Beneficiarios MAI no puede ser mayor al TOTAL\",\"\")","v":""},{"$f":"IF(C405<D405,1,0)","v":0}]
["URGENCIA","MAYOR NO AMBULATORIAS",{"$f":"SUM(E406,F406)","v":0},null,{"$f":"SUM(B!Z1246,B!Z1383,B!Z1525,B!Z1589,B!Z1658,B!Z1703,B!Z1908,B!Z1920,B!Z1991,B!Z2153,B!Z2192,B!Z2316,B!Z2349,B!Z2384,B!Z2392,B!Z2625,B!Z2630,B!Z2775,B!Z2801)","v":0},{"$f":"SUM(B!AA1246,B!AA1383,B!AA1525,B!AA1589,B!AA1658,B!AA1703,B!AA1908,B!AA1920,B!AA1991,B!AA2153,B!AA2192,B!AA2316,B!AA2349,B!AA2384,B!AA2392,B!AA2625,B!AA2630,B!AA2775,B!AA2801)","v":0},{"$nulls":4},{"$f":"AA406","v":""},{"$nulls":15},{"$f":"IF(C406<D406,\"Beneficiarios MAI no puede ser mayor al TOTAL\",\"\")","v":""},{"$f":"IF(C406<D406,1,0)","v":0}]
[null,"MAYOR AMBULATORIAS",{"$f":"SUM(E407,F407)","v":0},null,{"$f":"SUM(B!W1246,B!W1383,B!W1525,B!W1589,B!W1658,B!W1703,B!W1908,B!W1920,B!W1991,B!W2153,B!W2192,B!W2316,B!W2349,B!W2384,B!W2392,B!W2625,B!W2630,B!W2775,B!W2801)","v":0},{"$f":"SUM(B!X1246,B!X1383,B!X1525,B!X1589,B!X1658,B!X1703,B!X1908,B!X1920,B!X1991,B!X2153,B!X2192,B!X2316,B!X2349,B!X2384,B!X2392,B!X2625,B!X2630,B!X2775,B!X2801)","v":0},{"$nulls":4},{"$f":"AA407","v":""},{"$nulls":15},{"$f":"IF(C407<D407,\"Beneficiarios MAI no puede ser mayor al TOTAL\",\"\")","v":""},{"$f":"IF(C407<D407,1,0)","v":0}]
["SECCIÓN F:  AMPUTACIÓN POR PIE DIABÉTICO"]
["TIPO DE INTERVENCIÓN QUIRÚRGICA",null,"TOTAL PRODUCCIÓN","TOTAL BENEFICIARIOS MAI"]
[]
["AMPUTACIÓN DE ORTEJO(S) POR PIE DIABETICO",null,{"$f":"B!D2622","v":0},{"$f":"B!I2622","v":0}]
["AMPUTACIÓN DE PIE COMPLETO POR PIE DIABETICO",null,{"$f":"B!D2623+B!D2621","v":0},{"$f":"B!I2623+B!I2621","v":0}]
["SECCIÓN G:PROCEDIMIENTOS MEDICOS DE DIAGNÓSTICO Y TERAPÉUTICOS"]
["TIPO DE PROCEDIMIENTO",null,"TOTAL","PROCEDIMIENTOS",{"$nulls":3},"PROCEDENCIA",null,null,"PRODUCCION INTRA HOSPITAL",null,null,"OPERATIVO","COMPRAS REALIZADAS",null,"VENTAS DE SERVICIOS"]
[{"$nulls":3},"TOTAL BENEFICIARIOS","BENEFICIARIOS",null,"NO BENEFI-CIARIOS","ATENCION CERRADA","ATENCION ABIERTA","EMERGENCIA","POR \nHONO-\nRARIOS","POR CONVENIOS","POR\nCONSULTORES\nDE LLAMADA",null,"AL SISTEMA ","EXTRA-SISTEMA"]
[{"$nulls":4},"MAI","MLE"]
[" DE\n NEUROLOGÍA","MODALIDAD ARANCEL INSTITUCIONAL",{"$f":"B!D1120","v":0},{"$f":"B!E1120","v":0},{"$f":"B!F1120","v":0},{"$f":"B!G1120","v":0},{"$f":"B!H1120","v":0},{"$f":"B!AB1120","v":0},{"$f":"B!AC1120","v":0},{"$f":"B!AD1120","v":0},{"$f":"B!AE1120","v":0},{"$f":"B!AF1120","v":0},{"$f":"B!AG1120","v":0},{"$f":"B!AH1120","v":0},{"$f":"B!AI1120","v":0},{"$f":"B!AJ1120","v":0},{"$f":"B!AK1120","v":0},{"$f":"IF((C417)<D417,\"ERROR EN PREVISION\",IF((H417+I417+J417)<>C417,\"ERROR EN PROCEDENCIA\",\"\"))","v":""}]
[null,"MODALIDAD LIBRE ELECCIÓN + LO NO ARANCELADO",{"$f":"B!D1174","v":0},{"$f":"B!E1174","v":0},{"$f":"B!F1174","v":0},{"$f":"B!G1174","v":0},{"$f":"B!H1174","v":0},{"$f":"B!AB1174","v":0},{"$f":"B!AC1174","v":0},{"$f":"B!AD1174","v":0},{"$f":"B!AE1174","v":0},{"$f":"B!AF1174","v":0},{"$f":"B!AG1174","v":0},{"$f":"B!AH1174","v":0},{"$f":"B!AI1174","v":0},{"$f":"B!AJ1174","v":0},{"$f":"B!AK1174","v":0},{"$f":"IF((C418)<D418,\"ERROR EN PREVISION\",IF((H418+I418+J418)<>C418,\"ERROR EN PROCEDENCIA\",\"\"))","v":""}]
[null,"TOTAL",{"$f":"SUM(C417:C418)","v":0},{"$f":"SUM(D417:D418)","v":0},{"$f":"SUM(E417:E418)","v":0},0,0,0,0,0,0,0,0,null,0,0,0]
[" DE OFTALMOLOGÍA","MODALIDAD LIBRE ELECCIÓN + LO NO ARANCELADO",{"$f":"B!D1303","v":0},{"$f":"B!E1303","v":0},{"$f":"B!F1303","v":0},{"$f":"B!G1303","v":0},{"$f":"B!H1303","v":0},{"$f":"B!AB1303","v":0},{"$f":"B!AC1303","v":0},{"$f":"B!AD1303","v":0},{"$f":"B!AE1303","v":0},{"$f":"B!AF1303","v":0},{"$f":"B!AG1303","v":0},{"$f":"B!AH1303","v":0},{"$f":"B!AI1303","v":0},{"$f":"B!AJ1303","v":0},{"$f":"B!AK1303","v":0},""]
[" DE OTORRINOLARINGOLOGÍA","MODALIDAD LIBRE ELECCIÓN + LO NO ARANCELADO",{"$f":"B!D1448","v":0},{"$f":"B!E1448","v":0},{"$f":"B!F1448","v":0},{"$f":"B!G1448","v":0},{"$f":"B!H1448","v":0},{"$f":"B!AB1448","v":0},{"$f":"B!AC1448","v":0},{"$f":"B!AD1448","v":0},{"$f":"B!AE1448","v":0},{"$f":"B!AF1448","v":0},{"$f":"B!AG1448","v":0},{"$f":"B!AH1448","v":0},{"$f":"B!AI1448","v":0},{"$f":"B!AJ1448","v":0},{"$f":"B!AK1448","v":0},""]
[" DE CABEZA Y CUELLO ","MODALIDAD ARANCEL INSTITUCIONAL",{"$f":"B!D1528","v":0},{"$f":"B!E1528","v":0},{"$f":"B!F1528","v":0},{"$f":"B!G1528","v":0},{"$f":"B!H1528","v":0},{"$f":"B!AB1528","v":0},{"$f":"B!AC1528","v":0},{"$f":"B!AD1528","v":0},{"$f":"B!AE1528","v":0},{"$f":"B!AF1528","v":0},{"$f":"B!AG1528","v":0},{"$f":"B!AH1528","v":0},{"$f":"B!AI1528","v":0},{"$f":"B!AJ1528","v":0},{"$f":"B!AK1528","v":0},""]
[" DE DERMATOLOGÍA","MODALIDAD LIBRE ELECCIÓN + LO NO ARANCELADO",{"$f":"B!D1676","v":0},{"$f":"B!E1676","v":0},{"$f":"B!F1676","v":0},{"$f":"B!G1676","v":0},{"$f":"B!H1676","v":0},{"$f":"B!AB1676","v":0},{"$f":"B!AC1676","v":0},{"$f":"B!AD1676","v":0},{"$f":"B!AE1676","v":0},{"$f":"B!AF1676","v":0},{"$f":"B!AG1676","v":0},{"$f":"B!AH1676","v":0},{"$f":"B!AI1676","v":0},{"$f":"B!AJ1676","v":0},{"$f":"B!AK1676","v":0},""]
[" DE CARDIOLOGÍA Y NEUMOLOGÍA","MODALIDAD ARANCEL INSTITUCIONAL",{"$f":"B!D1838","v":0},{"$f":"B!E1838","v":0},{"$f":"B!F1838","v":0},{"$f":"B!G1838","v":0},{"$f":"B!H1838","v":0},{"$f":"B!AB1838","v":0},{"$f":"B!AC1838","v":0},{"$f":"B!AD1838","v":0},{"$f":"B!AE1838","v":0},{"$f":"B!AF1838","v":0},{"$f":"B!AG1838","v":0},{"$f":"B!AH1838","v":0},{"$f":"B!AI1838","v":0},{"$f":"B!AJ1838","v":0},{"$f":"B!AK1838","v":0},""]
[null,"MODALIDAD LIBRE ELECCIÓN + LO NO ARANCELADO",{"$f":"B!D1812+B!D1840","v":0},{"$f":"B!E1812+B!E1840","v":0},{"$f":"B!F1812+B!F1840","v":0},{"$f":"B!G1812+B!G1840","v":0},{"$f":"B!H1812+B!H1840","v":0},{"$f":"B!AB1812+B!AB1840","v":0},{"$f":"B!AC1812+B!AC1840","v":0},{"$f":"B!AD1812+B!AD1840","v":0},{"$f":"B!AE1812+B!AE1840","v":0},{"$f":"B!AF1812+B!AF1840","v":0},{"$f":"B!AG1812+B!AG1840","v":0},{"$f":"B!AH1812+B!AH1840","v":0},{"$f":"B!AI1812+B!AI1840","v":0},{"$f":"B!AJ1812+B!AJ1840","v":0},{"$f":"B!AK1812+B!AK1840","v":0},""]
[null,"TOTAL",{"$f":"SUM(C424:C425)","v":0},0,0,0,0,0,0,0,0,0,0,null,0,0,0]
[" DE GASTRO\nENTEROLOGÍA","MODALIDAD ARANCEL INSTITUCIONAL",{"$f":"B!D2061","v":0},{"$f":"B!E2061","v":0},{"$f":"B!F2061","v":0},{"$f":"B!G2061","v":0},{"$f":"B!H2061","v":0},{"$f":"B!AB2061","v":0},{"$f":"B!AC2061","v":0},{"$f":"B!AD2061","v":0},{"$f":"B!AE2061","v":0},{"$f":"B!AF2061","v":0},{"$f":"B!AG2061","v":0},{"$f":"B!AH2061","v":0},{"$f":"B!AI2061","v":0},{"$f":"B!AJ2061","v":0},{"$f":"B!AK2061","v":0},""]
[null,"MODALIDAD LIBRE ELECCIÓN + LO NO ARANCELADO",{"$f":"B!D2055","v":0},{"$f":"B!E2055","v":0},{"$f":"B!F2055","v":0},{"$f":"B!G2055","v":0},{"$f":"B!H2055","v":0},{"$f":"B!AB2055","v":0},{"$f":"B!AC2055","v":0},{"$f":"B!AD2055","v":0},{"$f":"B!AE2055","v":0},{"$f":"B!AF2055","v":0},{"$f":"B!AG2055","v":0},{"$f":"B!AH2055","v":0},{"$f":"B!AI2055","v":0},{"$f":"B!AJ2055","v":0},{"$f":"B!AK2055","v":0},""]
[null,"TOTAL",{"$f":"SUM(C427:C428)","v":0},0,0,0,0,0,0,0,0,0,0,null,0,0,0]
[" DE UROLOGÍA Y NEFROLOGÍA","MODALIDAD LIBRE ELECCIÓN + LO NO ARANCELADO",{"$f":"B!D2220","v":0},{"$f":"B!E2220","v":0},{"$f":"B!F2220","v":0},{"$f":"B!G2220","v":0},{"$f":"B!H2220","v":0},{"$f":"B!AB2220","v":0},{"$f":"B!AC2220","v":0},{"$f":"B!AD2220","v":0},{"$f":"B!AE2220","v":0},{"$f":"B!AF2220","v":0},{"$f":"B!AG2220","v":0},{"$f":"B!AH2220","v":0},{"$f":"B!AI2220","v":0},{"$f":"B!AJ2220","v":0},{"$f":"B!AK2220","v":0},""]
[" DE GINECOLOGÍA OBSTETRICIA ","MODALIDAD ARANCEL INSTITUCIONAL (SE INCLUYEN ABORTOS)",{"$f":"B!D2335+B!D2386+B!D2387","v":0},{"$f":"B!E2335+B!E2386+B!E2387","v":0},{"$f":"B!F2335+B!F2386+B!F2387","v":0},{"$f":"B!G2335+B!G2386+B!G2387","v":0},{"$f":"B!H2335+B!H2386+B!H2387","v":0},{"$f":"B!AB2335+B!AB2386+B!AB2387","v":0},{"$f":"B!AC2335+B!AC2386+B!AC2387","v":0},{"$f":"B!AD2335+B!AD2386+B!AD2387","v":0},{"$f":"B!AE2335+B!AE2386+B!AE2387","v":0},{"$f":"B!AF2335+B!AF2386+B!AF2387","v":0},{"$f":"B!AG2335+B!AG2386+B!AG2387","v":0},{"$f":"B!AH2335+B!AH2386+B!AH2387","v":0},{"$f":"B!AI2335+B!AI2386+B!AI2387","v":0},{"$f":"B!AJ2335+B!AJ2386+B!AJ2387","v":0},{"$f":"B!AK2335+B!AK2386+B!AK2387","v":0},""]
[null,"MODALIDAD LIBRE ELECCIÓN + LO NO ARANCELADO",{"$f":"B!D2342","v":0},{"$f":"B!E2342","v":0},{"$f":"B!F2342","v":0},{"$f":"B!G2342","v":0},{"$f":"B!H2342","v":0},{"$f":"B!AB2342","v":0},{"$f":"B!AC2342","v":0},{"$f":"B!AD2342","v":0},{"$f":"B!AE2342","v":0},{"$f":"B!AF2342","v":0},{"$f":"B!AG2342","v":0},{"$f":"B!AH2342","v":0},{"$f":"B!AI2342","v":0},{"$f":"B!AJ2342","v":0},{"$f":"B!AK2342","v":0},""]
[null,"TOTAL",{"$f":"SUM(C431:C432)","v":0},{"$f":"SUM(D431:D432)","v":0},0,0,0,0,0,0,0,0,0,0,0,0,0]
[" DE TRAUMATOLOGÍA","MODALIDAD ARANCEL INSTITUCIONAL",{"$f":"B!D2642","v":0},{"$f":"B!E2642","v":0},{"$f":"B!F2642","v":0},{"$f":"B!G2642","v":0},{"$f":"B!H2642","v":0},{"$f":"B!AB2642","v":0},{"$f":"B!AC2642","v":0},{"$f":"B!AD2642","v":0},{"$f":"B!AE2642","v":0},{"$f":"B!AF2642","v":0},{"$f":"B!AG2642","v":0},{"$f":"B!AH2642","v":0},{"$f":"B!AI2642","v":0},{"$f":"B!AJ2642","v":0},{"$f":"B!AK2642","v":0},""]
[null,"MODALIDAD LIBRE ELECCIÓN + LO NO ARANCELADO",{"$f":"B!D2411","v":0},{"$f":"B!E2411","v":0},{"$f":"B!F2411","v":0},{"$f":"B!G2411","v":0},{"$f":"B!H2411","v":0},{"$f":"B!AB2411","v":0},{"$f":"B!AC2411","v":0},{"$f":"B!AD2411","v":0},{"$f":"B!AE2411","v":0},{"$f":"B!AF2411","v":0},{"$f":"B!AG2411","v":0},{"$f":"B!AH2411","v":0},{"$f":"B!AI2411","v":0},{"$f":"B!AJ2411","v":0},{"$f":"B!AK2411","v":0},""]
[null,"TOTAL",{"$f":"SUM(C434:C435)","v":0},0,0,0,0,0,0,0,0,0,0,null,0,0,0]
["OTROS PROCEDIMIENTOS ","MODALIDAD LIBRE ELECCIÓN + LO NO ARANCELADO",{"$f":"B!D1047","v":0},{"$f":"B!E1047","v":0},{"$f":"B!F1047","v":0},{"$f":"B!G1047","v":0},{"$f":"B!H1047","v":0},{"$f":"B!AB1047","v":0},{"$f":"B!AC1047","v":0},{"$f":"B!AD1047","v":0},{"$f":"B!AE1047","v":0},{"$f":"B!AF1047","v":0},{"$f":"B!AG1047","v":0},{"$f":"B!AH1047","v":0},{"$f":"B!AI1047","v":0},{"$f":"B!AJ1047","v":0},{"$f":"B!AK1047","v":0},""]
["TOTAL PROCEDIMIENTOS MEDICOS","MODALIDAD ARANCEL INSTITUCIONAL",{"$f":"D438+G438","v":0},{"$f":"+D417+D422+D424+D427+D431+D434","v":0},{"$f":"+E417+E422+E424+E427+E431+E434","v":0},{"$f":"+F417+F422+F424+F427+F431+F434","v":0},{"$f":"+G417+G422+G424+G427+G431+G434","v":0},{"$f":"+H417+H422+H424+H427+H431+H434","v":0},0,0,0,0,0,0,0,0,0,""]
[null,"MODALIDAD LIBRE ELECCIÓN + LO NO ARANCELADO",{"$f":"D439+G439","v":0},{"$f":"+D418+D420+D421+D423+D425+D428+D430+D435+D437","v":0},{"$f":"+E418+E420+E421+E423+E425+E428+E430+E435+E437","v":0},{"$f":"+F418+F420+F421+F423+F425+F428+F430+F435+F437","v":0},{"$f":"+G418+G420+G421+G423+G425+G428+G430+G435+G437","v":0},{"$f":"+H418+H420+H421+H423+H425+H428+H430+H435+H437","v":0},0,0,0,0,0,0,0,0,0,""]
[null,"TOTAL PRODUCCION",{"$f":"SUM(C438:C439)","v":0},{"$f":"SUM(D438:D439)","v":0},{"$f":"SUM(E438:E439)","v":0},{"$f":"SUM(F438:F439)","v":0},{"$f":"SUM(G438:G439)","v":0},{"$f":"SUM(H438:H439)","v":0},0,0,0,0,0,0,0,0,0]
["SECCION H:  MISCELANEOS"]
["TIPO DE PRESTACIÓN",null,"TOTAL","TOTAL BENEFICIARIOS MAI"]
[]
[]
[]
["OTRAS PRESTACIONES PSIQUIATRICAS",null,{"$f":"B!D1101","v":0},{"$f":"B!F1101","v":0}]
["ANESTESIA EPIDURAL  (PARTOS)",null,{"$f":"B!D2700","v":0},{"$f":"B!F2700","v":0}]
["OTROS PROCEDIMIENTOS ANESTÉSICOS",null,{"$f":"B!D2709","v":0},{"$f":"B!F2709","v":0}]
["CURACION SIMPLE AMBULATORIA",null,{"$f":"B!D64","v":0},{"$f":"B!F64","v":0}]
["PROCEDIMIENTO DE PODOLOGÍA",null,{"$f":"B!D70","v":0},{"$f":"B!F70","v":0}]
["AUTOCUIDADO PACIENTES DID",null,{"$f":"B!D65","v":0},{"$f":"B!F65","v":0}]
["OXIGENOTERAPIA DOMICILIO",null,{"$f":"B!D66","v":0},{"$f":"B!F66","v":0}]
["ABREU",null,{"$f":"B!D68","v":0},{"$f":"B!F68","v":0}]
["DESPACHO DE RECETAS A CRÓNICOS",null,{"$f":"B!D67","v":0},{"$f":"B!F67","v":0}]
["PROTESIS Y ÓRTESIS",null,{"$f":"B!D2697","v":0},{"$f":"B!F2697","v":0}]
["TOTAL MISCELANEOS",null,{"$f":"SUM(C445:C455)","v":0},{"$f":"SUM(D445:D455)","v":0}]
["SECCIÓN I: PRESCRIPCIONES ADMINISTRADAS EN URGENCIA APS"]
["ATENCIÓN",null,"TOTAL"]
[]
["URGENCIA SAPU/SAR"]
["SECCIÓN J: ACTIVIDADES EN UNIDAD DE FARMACIA HOSPITALARIA"]
[null,null,"TOTAL"]
["Nº DE PREPARADOS FARMACEUTICOS","ESTERILES"]
[null,"NO ESTERILES"]
["Nº DE DOSIS UNITARIA PREPARADAS"]
["SECCIÓN K: OTRAS ATENCIONES A PACIENTES AMBULATORIOS"]
["TIPO DE ATENCIÓN",null,"TOTAL ","ATENCIONES POR EDAD",{"$nulls":5},"BENEFICIARIOS"]
[{"$nulls":3},"< 1 año","1 - 4 años","5 a 9 años","10 a 19 años","20 a 64 años","65 años y más"]
["POR TERAPÉUTICA OCUPACIONAL",null,{"$f":"SUM(D469:I469)","v":0},{"$nulls":7},{"$f":"AA469","v":""},{"$nulls":15},{"$f":"IF(J469>C469,\"Error: Las actividades totales son menores que las realizadas en beneficiarios\",\"\")","v":""},{"$f":"IF(J469>C469,1,0)","v":0}]
["POR KINESIOLOGO (NO SAPU)",null,{"$f":"SUM(D470:I470)","v":0},{"$nulls":7},{"$f":"AA470","v":""},{"$nulls":15},{"$f":"IF(J470>C470,\"Error: Las actividades totales son menores que las realizadas en beneficiarios\",\"\")","v":""},{"$f":"IF(J470>C470,1,0)","v":0}]
["POR EDUCADORA DE PÁRVULO/DIFERENCIAL",null,{"$f":"SUM(D471:E471)","v":0},{"$nulls":7},{"$f":"AA471","v":""},{"$nulls":15},{"$f":"IF(J471>C471,\"Error: Las actividades totales son menores que las realizadas en beneficiarios\",\"\")","v":""},{"$f":"IF(J471>C471,1,0)","v":0}]
["SECCIÓN L: OTROS TRASLADOS DE PACIENTES"]
["TIPO DE ACCIÓN",null,"TOTAL","A \nBENE-\nFICIARIOS","POR COMPRA \nDE SERVICIO",{"$nulls":6}," "]
["TRASLADOS NO DE URGENCIA","AMBULANCIA",{"$nulls":3},{"$f":"AA474","v":""},{"$nulls":20},{"$f":"IF(D474>C474,\"Error: Las actividades totales son menores que las realizadas en beneficiarios\",\"\")","v":""},{"$f":"IF(D474>C474,1,0)","v":0}]
[null,"MARÍTIMO",{"$nulls":3},{"$f":"AA475","v":""},{"$nulls":20},{"$f":"IF(D475>C475,\"Error: Las actividades totales son menores que las realizadas en beneficiarios\",\"\")","v":""},{"$f":"IF(D475>C475,1,0)","v":0}]
[null,"AÉREO",{"$nulls":3},{"$f":"AA476","v":""},{"$nulls":20},{"$f":"IF(D476>C476,\"Error: Las actividades totales son menores que las realizadas en beneficiarios\",\"\")","v":""},{"$f":"IF(D476>C476,1,0)","v":0}]
["SECCIÓN M:EXAMENES DE TAMIZAJE POINT OF CARE (SAR)"]
["TAMIZAJE",null,"TOTAL "]
["Cartridge para Troponina",null,{"$f":"B!D3053","v":0}]
["Cartridge Multiple",null,{"$f":"B!D3054","v":0}]
[]
["SECCIÓN N: TELEMEDICINA"]
["TELEMEDICINA",null,"TOTAL","Institucional","Compra de Servicio o Convenio"]
[]
["SOLICITUDES"]
["Nº de exámenes radiológicos simples",null,{"$f":"SUM(D486:E486)","v":0}]
["Nº de otros exámenes radiológicos complejos",null,0]
["Nº de Telelectrocardiogramas",null,0]
["Nº de Radiografías Osteopulmonares",null,0]
["Nº de Radiografías Odontológicas",null,0]
["Nº de Tomografías de Urgencia y UPC",null,0]
["TOTAL DE SOLICITUDES",null,0,{"$f":"SUM(D486:D491)","v":0},{"$f":"SUM(E486:E491)","v":0}]
["EMISIONES DE INFORME (Uso exclusivo de Establecimientos de Mayor Complejidad)"]
["Nº de exámenes radiológicos simples",null,{"$f":"SUM(D494:E494)","v":0}]
["Nº de otros exámenes radiológicos complejos",null,0]
["Nº de Telelectrocardiogramas",null,0]
["Nº de Radiografías Osteopulmonares",null,0]
["Nº de Radiografías Odontológicas",null,0]
["Nº de Tomografías de Urgencia y UPC",null,0]
["N° de Consultas Especialidades resueltas por Telemedicina",null,0]
["N° de Consultas de Urgencia resueltas por Telemedicina",null,0]
["TOTAL DE INFORMES",null,0,{"$f":"SUM(D494:D501)","v":0},{"$f":"SUM(E494:E501)","v":0}]
["SECCIÓN O: ENTREGA DE AYUDAS TÉCNICAS GES Y NO GES A PERSONAS  EN EL ESTABLECIMIENTO"]
["AYUDA TÉCNICA",null,"TOTAL DE ENTREGA\n< 65 años","TOTAL DE ENTREGA\n> 65 años"]
[]
["BASTÓN"]
["ANDADOR"]
["ANDADOR DE PASILLO"]
["COJÍN ANTIESCARAS"]
["COLCHÓN ANTIESCARA"]
["SILLA DE RUEDAS"]
["LENTES POR PRESBICIA"]

{"sheet":"Control","index":3,"n_rows":82,"n_cols":4,"rows_kept":82}
[]
[null,"HOJA","SECCION","Nº Errores"]
[null,"NOMBRE","Código comuna",{"$f":"+NOMBRE!AF2","v":1}]
[null,"NOMBRE","Código establecimiento/estrategia",{"$f":"+NOMBRE!AF3","v":1}]
[null,"NOMBRE","Tipo establecimiento/estrategia",{"$f":"+NOMBRE!AF4","v":1}]
[null,"NOMBRE","Dependencia",{"$f":"+NOMBRE!AF5","v":1}]
[null,"NOMBRE","Código Mes",{"$f":"+NOMBRE!AF6","v":1}]
[null,"B17","SECCIÓN E: INTERVENCIONES QUIRÚRGICAS POR TIPO DE INTERVENCIÓN ",{"$f":"SUM('B17'!AB404:AB407)","v":0}]
[null,"B17","SECCIÓN L: OTRAS ATENCIONES A PACIENTES AMBULATORIOS",{"$f":"SUM('B17'!AB469:AB471)","v":0}]
[null,"B17","SECCIÓN N: OTROS TRASLADOS DE PACIENTES",{"$f":"SUM('B17'!AB474:AB476)","v":0}]
[null,null,"TOTAL ERRORES",{"$f":"SUM(D3:D10)","v":5}]
[]
[]
[]
[null,"¿Nombre vacío?"]
[null,{"$f":"ISBLANK(NOMBRE!B2)","v":true}]
{"$rows_empty":65}
[{"$nulls":3},{"$f":"SUM(D3:D7)","v":5}]

{"sheet":"MACROS","index":4,"n_rows":7,"n_cols":2,"rows_kept":7,"merged":[[0,0,0,13],[6,1,7,7]]}
["Hoja de Macros y Utilidades"]
[{"$f":"CONCATENATE(\"ESTABLECIMIENTO/ESTRATEGIA: \",NOMBRE!B3,\" - \",\"( \",NOMBRE!C3,NOMBRE!D3,NOMBRE!E3,NOMBRE!F3,NOMBRE!G3,NOMBRE!H3,NOMBRE!I3,\" )\")","v":"ESTABLECIMIENTO/ESTRATEGIA:  - ( Falta Cód. Est. )"}]
[]
[]
[null,"CREA UNA COPIA  DEL ARCHIVO  (TRANFORMA HOJAS A VALORES)\nA ESTE NUEVO ARCHIVO DEBERÁ ASIGNARLE UN NOMBRE"]
[null,"Contraseña para copia del archivo :DEIS"]
[null,{"$f":"IF(Control!D11>0,\"REVISE LA HOJA CONTROL, EXISTEN ERRORES\",\"\")","v":"REVISE LA HOJA CONTROL, EXISTEN ERRORES"}]